Error:  148:3 when I try to run PPro CS4

Trying to open PPro CS4.  Won't run & I get "Error: 148:3".  This happened at the same time I had to reauthorize WinXP  (can't figure out why I had to do that).  Yes, it's an older system, but it does exactly what we want.  Upgrading would not be cost effective for what we are now doing.  I need to get this running ASAP.  Or find a quality but inexpensive way to capture analog video to AVI without sync problems.  Thank you all!

>quality but inexpensive way to capture analog video to AVI without sync problems
What hardware do you use in the digitizing process?
I have NOT used either, but many say to try these for SD capture http://windv.mourek.cz/ or http://www.exsate.com/products/dvcapture/
I have NOT used it, but many say to try this for HDV capture
-archived at http://www.videohelp.com/tools/HDVSplit
-Click the 1st link under "Download sites:" for the latest version

Similar Messages

  • "Error: 3" message when I try to run Flash CS4 Pro

    I have Adobe Flash CS4 Pro installed on my Windows 8 OS, and it was working fine for a while, but all of a sudden now I get a generic error message when I try to launch the application. It gives me an "error: 3" status and tells me to restart (which I have done several times) and otherwise to contact Adobe Support, who won't help me because it's not a "current version." I have also tried to "Run As Admin."
    Very frustrated.

    Many people have had problems when they upgraded to Win8 on a machine with an existing Adobe CS installation. (Works better on a clean Win8 machine.) This could be why you're not seeing it in Add/Remove.
    Is your Flash Pro part of a CS Suite, or just a stand-alone? If part of a Suite, look for the Adobe Creative Suite listing in Add/Remove. A complete un-installation, and removal of all Adobe products, files, and folders from your machine, followed by a re-installation, might help.
    Also, Flash Pro CS4 apparently installs and uses an older version of the Flash Player (10.xx), which might create conflicts with the Flash Player's current version (11.8.800.94). Make sure to uninstall Flash Player completely before attempting CS4 Flash Pro re-installation. I got an error message upon installation, but Flash Pro still works (though I uninstalled the older version of Flash Player, so the built-in de-bugger may not function).
    You are correct: Adobe Support is generally useless, even when you have the current product. Forums and searches are usually your only recourse.

  • Why do I keep getting the error code 148:3 when I try to start Fireworks CS4?

    Why do I keep getting the error code 148:3 when I try to start Fireworks CS4?

    I just reinstalled Fireworks CS4 and it seems to be back to normal. Thanks

  • Firefox will not open on my computer, even after reinstall, with no error message or when I try to run "C:\Program Files\Mozilla Firefox\firefox.exe" -p. Help?

    I recently installed firefox so I could use an adblocker. It installed just fine, and it worked just fine for about three days. Then yesterday it stopped opening. I'm on a Toshiba running Windows 7. The icon highlights when I click on it, but then it stops and won't open the browser at all. When I try to run it with the manual command "C:\Program Files\Mozilla Firefox\firefox.exe" -p, I get the error message, "C:\Program Files\Mozilla Firefox\ refers to a location that is unavailable. It could be on a hard drive on this computer, or on a network. Check to make sure that the disk is properly inserted, or that you are connected to the Internet or your network, and then try again. If it still cannot be located, the information might have been moved to a different location." I installed it to that location, and I don't need a disk. I'm connected to the Internet just fine and my other browsers (Chrome and IE) work the same as always. But they're swamped with ads and I really was happy wih Firefox when it was opening...how can I fix this issue?

    Certain Firefox problems can be solved by performing a ''Clean reinstall''. This means you remove Firefox program files and then reinstall Firefox. Please follow these steps:
    '''Note:''' You might want to print these steps or view them in another browser.
    #Download the latest Desktop version of Firefox from http://www.mozilla.org and save the setup file to your computer.
    #After the download finishes, close all Firefox windows (click Exit from the Firefox or File menu).
    #Delete the Firefox installation folder, which is located in one of these locations, by default:
    #*'''Windows:'''
    #**C:\Program Files\Mozilla Firefox
    #**C:\Program Files (x86)\Mozilla Firefox
    #*'''Mac:''' Delete Firefox from the Applications folder.
    #*'''Linux:''' If you installed Firefox with the distro-based package manager, you should use the same way to uninstall it - see [[Installing Firefox on Linux]]. If you downloaded and installed the binary package from the [http://www.mozilla.org/firefox#desktop Firefox download page], simply remove the folder ''firefox'' in your home directory.
    #Now, go ahead and reinstall Firefox:
    ##Double-click the downloaded installation file and go through the steps of the installation wizard.
    ##Once the wizard is finished, choose to directly open Firefox after clicking the Finish button.
    Please report back to see if this helped you!

  • Error 1097 occurs when i try to run my vi

    hi,
    i am trying to run two stepper motors simultaneously using a joystick.. i was able to do the same without any problems until i defined a threshold and sensor in order to limit the stepper motor motion.. what i wanted to do is when the value of sensor surpasses the threshold value the motor should stop. but when i try to run the vi it gives me a 1097 error at the call library function node.. i am unable to figure out the cause for that error since it occurs only when i attach the sensor and threshold formula node.
    i am using labview 8.2, MID 7602, PCI 7344
    for reference i am hereby attaching both VIs..
    steppermotor1.vi works fine.. steppermotor2.vi does not.. i would appreciate if someone could help me out with the issue..
    thanks,
     vijay
    Attachments:
    steppermotor11.vi ‏45 KB
    steppermotor21.vi ‏49 KB

    Hi Vijay,
    I have tried running the code that you attached on my machine, and was unable to reproduce any error.  I notice that you have a Call Library Function node in your code, but there is also one in each of the motion subVIs that are called in the VI.  It is possible that the error is happening at one of those.  You could try placing motion error handlers at the end of each of the motion calls.  You can find this by going to the Vision and Motion»NI-Motion»Error and Utility Palette.  Placing this error handler here might help determine if the error is ocurring in one of the motion VIs or not.
    Wes P
    Certified LabVIEW Developer

  • I receive error 148:3 when trying to open Design Premium CS4

    Help: I cannot open my Design Premium CS4, error 148:3

    Hi atelierpanhof,
    148:3 refers to licensing error. Please follow the steps mentioned in the kb: http://helpx.adobe.com/creative-suite/kb/error-licensing-stopped-windows.html .
    Regards,
    Romit SInha

  • Why do I get Error-2201​1 when I try to run a HW Watchdog Timer vi?

    I am trying to use the HW watchdog timer vi's on the RT functions palette (Watchdog Configure.vi and Watchdog Clear.vi). Error-22011 is generated when Watchdog Open.vi is called (a subvi to Watchdog Configure.vi).
    "Explain Error" gives this result:
    "NI-Watchdog: The watchdog hardware you requested is already in use, or has been permanently locked."
    I get this error every time I execute Watchdog Configure.vi even if the host computer and network controller have just been rebooted. There is no place to specify or lock/unlock the hardware (that I can find). I'm using Windows XP, LV8.5, and the FP2010 controller.
    Thanks in advance for any help.
    pmac

    Yes, I have NI-Watchdog  2.1.5 installed on my FP.
    In fact, I figured out what the Error-22011 problem was all about and I'm almost too embarrassed to say. I had Watchdog Configure.vi inside a while loop... so only the first iteration would be error free and for every iteration after that, the hardware would be "already in use". Hence, Error-22011.
    I've made it over that hurdle, but I'm still having problems.
    Now,I have both Watchdog Configure.vi and Watchdog Clear.vi outside the while loop and I put Watchdog Whack.vi inside the while loop (mainly to monitor the watchdog status output). I also wired the occurrence output of Watchdog Configure.vi to a second while loop in which there is a wait for occurrence.vi wired to a boolean indicator.
    If I disconnect the ethernet cable while this vi is running, the program pauses and I get a Labview generated message informing me of a lost connection however, there is no occurrence generated and the watchdog stays in "running" status.
    Apparently, I've misunderstood how to implement the watchdog vi's and I'll need someone to set me straight.
    Is there anyone who can help?
    Thanks,
    pmac

  • When I try to run iTunes I receive the following error message: "Apple Application Support was not found.  Apple Application Support is required to run iTunes helper.  Please unistall iTunes, then install iTunes again". I have done this twice.  What now?

    When I try to run iTunes I receive the following error message: "Apple Application Support was not found.  Apple Application Support is required to run iTunes helper.  Please unistall iTunes, then install iTunes again". I have done this twice and continue to get the error message.  What now?

    Hi texasslagle,
    It sounds like you are having issues installing iTunes on your Windows 7 PC, a frustrating situation I am sure.
    There is an article that you may want to use to try to complete your install here -
    iTunes 11.1.4 for Windows: Unable to install or open
    http://support.apple.com/kb/ts5376
    Thanks for using Apple Support Communities.
    Best,
    Brett L

  • I updated my Itunes to the latest version(11.1.4) and it isn't running on my laptop. The current OS is a W7 ultimate 64bits, when i try to run it, opens a message box with the following error message: error 7 (windows error 1114) . What should I do?

    I updated my Itunes to the latest version(11.1.4) and it isn't running on my laptop. The current OS is a W7 ultimate 64bits, when i try to run it, opens a message box with the following error message: error 7 (windows error 1114) . What should I do?

    Try the following user tip:
    Troubleshooting issues with iTunes for Windows updates

  • I KEEP GETTING ERROR -3 WHEN INSTALLING THEN ERROR -2093 WHEN I TRY TO RUN

    I KEEP GETTING ERROR -3 WHEN INSTALLING QUICK TIME, AND THEN WHEN I TRY TO RUN ITUNES I GET ERROR -2093. PLEASE HELP!! I HAVE DELETED AND REINSTALLED THIS MORE THAN 5 TIMES ALREADY! I HAVE AN ACER COMPUTER WITH WINDOWS XP. IF YOU CAN HELP ME PLEASE REPLY OR WRITE ME AT [email protected]

    Hi DaFudgeWizzad57392483,
    Please refer to the threads below where this issue has been addressed:
    1. Installing Creative Cloud-Error 205
    2. Creative Cloud Error 205
    3. Creative Cloud App, installation error code 205
    Regards,
    Sheena

  • Hi folks! When I try to run BF3, i get this error at startup - d3dcompiler_43.dll is missing, why?

    Product Name and Number:
    HP Pavilion DV7-6151
    OS:
    Windows 7, 64-bit
    Error message:
    When I try to run Battlefield 3, I get this error d3dcompiler_43.dll is missing, anyone know what to do?
    I bought the laptop 4 days ago, and I have made no changes to is, its fresh from the factory.
    I hope you can help me out
    This question was solved.
    View Solution.

    Hi,
    On the BF3 CD, there should be a folder called DirectX. Use it to reinstall the directX runtime files.
    Else, you may get it here
    http://www.microsoft.com/downloads/en/details.aspx?FamilyID=2da43d38-db71-4c1b-bc6a-9b6652cd92a3&dis...
    Say "Thanks" by clicking the Kudos Star in the post that helped you.
    Please mark the post that solves your problem as "Accepted Solution"
    (Although I am employed by HP, I am speaking for myself and not for HP)

  • Error when I try to run a Journal report, Works fine in previous month

    Hi,
    I am getting an error when I try to run a Journal report in HFM. The report runs fine for October Month but fials in November. does anyone have any ideas what it could be. The error message details are per below
    Error Reference Number: {B6DCF307-AB72-476F-9634-70E35C3E8F2F};User Name: [email protected]
    Num: 0x8004023b;Type: 0;DTime: 12/20/2010 7:42:24 PM;Svr: AUHODWRLYP9;File: CHsvDSCalcStatus.cpp;Line: 391;Ver: 9.3.1.6.2558;
    Num: 0x8004023b;Type: 0;DTime: 12/20/2010 7:42:24 PM;Svr: AUHODWRLYP9;File: CHsvDSCalcStatus.cpp;Line: 7035;Ver: 9.3.1.6.2558;
    Num: 0x8004023b;Type: 0;DTime: 12/20/2010 7:42:24 PM;Svr: AUHODWRLYP9;File: DataSecurity.cpp;Line: 696;Ver: 9.3.1.0.2042;
    Num: 0x8004023b;Type: 0;DTime: 12/20/2010 7:42:24 PM;Svr: AUHODWRLYP9;File: DataSecurity.cpp;Line: 329;Ver: 9.3.1.0.2042;
    Num: 0x8004023b;Type: 0;DTime: 12/20/2010 7:42:24 PM;Svr: AUHODWRLYP9;File: SecurityInternal.cpp;Line: 1695;Ver: 9.3.1.0.2042;
    Num: 0x8004023b;Type: 0;DTime: 12/20/2010 7:42:24 PM;Svr: AUHODWRLYP9;File: CHsvJournals.cpp;Line: 1249;Ver: 9.3.1.0.2042;
    Num: 0x8004023b;Type: 0;DTime: 12/20/2010 7:42:24 PM;Svr: AUHODWRLYP9;File: CHsvJournals.cpp;Line: 988;Ver: 9.3.1.0.2042;
    Num: 0x8004023b;Type: 0;DTime: 12/20/2010 7:42:24 PM;Svr: AUHODWRLYP9;File: CHsvJournalsACM.cpp;Line: 1734;Ver: 9.3.1.0.1502;
    Num: 0x8004023b;Type: 0;DTime: 12/20/2010 7:42:24 PM;Svr: AUHODWRLYP9;File: CHsvJournalsACM.cpp;Line: 1648;Ver: 9.3.1.0.1502;
    Num: 0x8004023b;Type: 0;DTime: 12/20/2010 7:42:24 PM;Svr: AUHODWRLYP9;File: ReportGenerator_Journal.cpp;Line: 136;Ver: 9.3.1.0.2176;
    Num: 0x8004023b;Type: 0;DTime: 12/20/2010 7:42:24 PM;Svr: AUHODWRLYP9;File: CHsvReportGeneratorACM.cpp;Line: 575;Ver: 9.3.1.0.2176;
    Num: 0x8004023b;Type: 0;DTime: 12/20/2010 7:42:24 PM;Svr: AUHODWRLYP9;File: HFMActionsExecution.cpp;Line: 2189;Ver: 9.3.1.0.2385;
    Num: 0x8004023b;Type: 0;DTime: 12/20/2010 7:42:24 PM;Svr: AUHODWRLYP9;File: HFMActions.cpp;Line: 72;Ver: 9.3.1.0.2385;
    Num: 0x8004023b;Type: 0;DTime: 12/20/2010 7:42:24 PM;Svr: AUHODWRLYP9;File: HFMCESAction.cpp;Line: 28;Ver: 9.3.1.0.2385;
    Num: 0x8004023b;Type: 0;DTime: 12/20/2010 7:42:25 PM;Svr: AUHODWRLYP9;File: Actions.cpp;Line: 291;Ver: 9.3.1.0.2385;
    Regards
    Vivek

    Hi All,
    I narrowed it down by running a report excluding working journals and that worked fine.
    This was being caused by an invalid working Journal. I exported all journals from Prod, and tried loading them to test. One of the errors was
    "Line: 7736, Error: Invalid parent.child entity dimension specified"
    Looking at the row the journal did not have an entity specified for one of the lines.
    When a valid entity was specified the journal report then starts working.
    Lesson. Check all journals are valid. To find error, load journals export in a different environment.
    Thanks all for your help.
    Regards
    Vivek

  • Error when i try to run ARI_INVOICE_PAYMENT_PAGE.xml on local jdeveloper

    Hi,
    I brought all the files from server to local machine and when I try to run ARI_INVOICE_PAYMENT_PAGE.xml the project, I am getting the following error messages.
    Error:
    Error(320,17): final method getClass() in class java.lang.Object cannot be overridden by method getClass() in class oracle.apps.ar.irec.accountDetails.cmreq.server.CMRequestVORowImpl
    Then i change the method name getClass() to getXclass(),I run ARI_INVOICE_PAYMENT_PAGE.xml the project error message not displayed in jdeveloper but I am getting the following error in application page.
    Exception Details.
    oracle.apps.fnd.framework.OAException: oracle.jbo.SQLStmtException: JBO-27122: SQL error during statement preparation. Statement: SELECT customer_id, currency_code, total_due_original, total_due_remaining, total_discount, total_service_charge, total_payment_amount, (total_due_remaining - total_discount - total_payment_amount) as total_balance_due, TO_CHAR(total_due_original , FND_CURRENCY_CACHE.GET_FORMAT_MASK( currency_code , 30 )) || ' ' || currency_code as total_due_original_formatted, TO_CHAR(total_due_remaining , FND_CURRENCY_CACHE.GET_FORMAT_MASK( currency_code , 30 )) || ' ' || currency_code as total_due_remaining_formatted, TO_CHAR(total_service_charge , FND_CURRENCY_CACHE.GET_FORMAT_MASK( currency_code , 30 )) || ' ' || currency_code as total_service_charge_formatted, TO_CHAR( -total_discount , FND_CURRENCY_CACHE.GET_FORMAT_MASK( currency_code , 30 )) || ' ' || currency_code as total_discount_formatted, TO_CHAR(total_payment_amount , FND_CURRENCY_CACHE.GET_FORMAT_MASK( currency_code , 30 )) as total_payment_amount_formatted, TO_CHAR( (total_due_remaining - total_discount - total_payment_amount) , FND_CURRENCY_CACHE.GET_FORMAT_MASK( currency_code , 30 )) || ' ' || currency_code as total_balance_due_formatted, TO_CHAR(TO_NUMBER(TO_CHAR(SYSDATE, 'MM'))) current_month, TO_CHAR(SYSDATE, 'YYYY') current_year, TO_CHAR( (total_service_charge + total_payment_amount) , FND_CURRENCY_CACHE.GET_FORMAT_MASK( currency_code , 30 )) || ' ' || currency_code as grand_payment_total_formatted, :1 as customer_site_use_id, total_number_of_installments, trunc(sysdate) as receipt_date, TO_CHAR( (dispute_amt), FND_CURRENCY_CACHE.GET_FORMAT_MASK( currency_code , 30 ))||' '||currency_code as dispute_amt FROM (SELECT customer_id, currency_code, sum(amount_due_original) total_due_original, sum(amount_due_remaining) total_due_remaining, sum(discount_amount) total_discount, sum(service_charge) total_service_charge, sum(payment_amt) total_payment_amount, sum(number_of_installments) total_number_of_installments, sum(dispute_amt) dispute_amt FROM ar_irec_payment_list_gt WHERE customer_id = :2 AND customer_site_use_id = nvl(:3, customer_site_use_id) GROUP BY customer_id, currency_code ) at oracle.apps.fnd.framework.OAException.wrapperException(OAException.java:888) at oracle.apps.fnd.framework.OAException.wrapperException(OAException.java:862) at oracle.apps.fnd.framework.OAException.wrapperInvocationTargetException(OAException.java:985) at oracle.apps.fnd.framework.server.OAUtility.invokeMethod(OAUtility.java:210) at oracle.apps.fnd.framework.server.OAUtility.invokeMethod(OAUtility.java:132) at oracle.apps.fnd.framework.server.OAViewObjectImpl.invokeMethod(OAViewObjectImpl.java:1123) at oracle.apps.ar.irec.accountDetails.pay.webui.QuickPaymentCO.processRequest(QuickPaymentCO.java:53) at oracle.apps.fnd.framework.webui.OAWebBeanHelper.processRequest(OAWebBeanHelper.java:581) at oracle.apps.fnd.framework.webui.OAWebBeanContainerHelper.processRequest(OAWebBeanContainerHelper.java:247) at oracle.apps.fnd.framework.webui.beans.layout.OAHeaderBean.processRequest(OAHeaderBean.java:389) at oracle.apps.fnd.framework.webui.OAWebBeanHelper.processRequestChildren(OAWebBeanHelper.java:932) at oracle.apps.fnd.framework.webui.OAWebBeanHelper.processRequestChildren(OAWebBeanHelper.java:899) at oracle.apps.fnd.framework.webui.OAWebBeanHelper.processRequest(OAWebBeanHelper.java:640) at oracle.apps.fnd.framework.webui.OAWebBeanContainerHelper.processRequest(OAWebBeanContainerHelper.java:247) at oracle.apps.fnd.framework.webui.beans.layout.OAFlowLayoutBean.processRequest(OAFlowLayoutBean.java:351) at oracle.apps.fnd.framework.webui.OAWebBeanHelper.processRequestChildren(OAWebBeanHelper.java:932) at oracle.apps.fnd.framework.webui.OAWebBeanHelper.processRequestChildren(OAWebBeanHelper.java:899) at oracle.apps.fnd.framework.webui.OAWebBeanHelper.processRequest(OAWebBeanHelper.java:640) at oracle.apps.fnd.framework.webui.OAWebBeanContainerHelper.processRequest(OAWebBeanContainerHelper.java:247) at oracle.apps.fnd.framework.webui.beans.layout.OAFlowLayoutBean.processRequest(OAFlowLayoutBean.java:351) at oracle.apps.fnd.framework.webui.OAWebBeanHelper.processRequestChildren(OAWebBeanHelper.java:932) at oracle.apps.fnd.framework.webui.OAWebBeanHelper.processRequestChildren(OAWebBeanHelper.java:899) at oracle.apps.fnd.framework.webui.OAWebBeanHelper.processRequest(OAWebBeanHelper.java:640) at oracle.apps.fnd.framework.webui.OAWebBeanContainerHelper.processRequest(OAWebBeanContainerHelper.java:247) at oracle.apps.fnd.framework.webui.beans.layout.OAStackLayoutBean.processRequest(OAStackLayoutBean.java:350) at oracle.apps.fnd.framework.webui.OAWebBeanHelper.processRequestChildren(OAWebBeanHelper.java:932) at oracle.apps.fnd.framework.webui.OAWebBeanHelper.processRequestChildren(OAWebBeanHelper.java:899) at oracle.apps.fnd.framework.webui.OAWebBeanHelper.processRequest(OAWebBeanHelper.java:640) at oracle.apps.fnd.framework.webui.OAWebBeanContainerHelper.processRequest(OAWebBeanContainerHelper.java:247) at oracle.apps.fnd.framework.webui.OAPageLayoutHelper.processRequest(OAPageLayoutHelper.java:1095) at oracle.apps.fnd.framework.webui.beans.layout.OAPageLayoutBean.processRequest(OAPageLayoutBean.java:1569) at oracle.apps.fnd.framework.webui.OAWebBeanHelper.processRequestChildren(OAWebBeanHelper.java:932) at oracle.apps.fnd.framework.webui.OAWebBeanHelper.processRequestChildren(OAWebBeanHelper.java:899) at oracle.apps.fnd.framework.webui.OAWebBeanHelper.processRequest(OAWebBeanHelper.java:640) at oracle.apps.fnd.framework.webui.OAWebBeanContainerHelper.processRequest(OAWebBeanContainerHelper.java:247) at oracle.apps.fnd.framework.webui.beans.form.OAFormBean.processRequest(OAFormBean.java:385) at oracle.apps.fnd.framework.webui.OAWebBeanHelper.processRequestChildren(OAWebBeanHelper.java:932) at oracle.apps.fnd.framework.webui.OAWebBeanHelper.processRequestChildren(OAWebBeanHelper.java:899) at oracle.apps.fnd.framework.webui.OAWebBeanHelper.processRequest(OAWebBeanHelper.java:640) at oracle.apps.fnd.framework.webui.OAWebBeanContainerHelper.processRequest(OAWebBeanContainerHelper.java:247) at oracle.apps.fnd.framework.webui.beans.OABodyBean.processRequest(OABodyBean.java:353) at oracle.apps.fnd.framework.webui.OAPageBean.processRequest(OAPageBean.java:2298) at oracle.apps.fnd.framework.webui.OAPageBean.preparePage(OAPageBean.java:1711) at oracle.apps.fnd.framework.webui.OAPageBean.preparePage(OAPageBean.java:497) at oracle.apps.fnd.framework.webui.OAPageBean.preparePage(OAPageBean.java:418) at _OA._jspService(OA.jsp:40) at com.orionserver.http.OrionHttpJspPage.service(OrionHttpJspPage.java:56) at oracle.jsp.runtimev2.JspPageTable.service(JspPageTable.java:317) at oracle.jsp.runtimev2.JspServlet.internalService(JspServlet.java:465) at oracle.jsp.runtimev2.JspServlet.service(JspServlet.java:379) at javax.servlet.http.HttpServlet.service(HttpServlet.java:853) at com.evermind.server.http.ServletRequestDispatcher.invoke(ServletRequestDispatcher.java:727) at com.evermind.server.http.ServletRequestDispatcher.forwardInternal(ServletRequestDispatcher.java:306) at com.evermind.server.http.HttpRequestHandler.processRequest(HttpRequestHandler.java:767) at com.evermind.server.http.HttpRequestHandler.run(HttpRequestHandler.java:259) at com.evermind.server.http.HttpRequestHandler.run(HttpRequestHandler.java:106) at EDU.oswego.cs.dl.util.concurrent.PooledExecutor$Worker.run(PooledExecutor.java:803) at java.lang.Thread.run(Thread.java:534) ## Detail 0 ## java.sql.SQLException: ORA-01008: not all variables bound at oracle.jdbc.dbaccess.DBError.throwSqlException(DBError.java:134) at oracle.jdbc.ttc7.TTIoer.processError(TTIoer.java:289) at oracle.jdbc.ttc7.Oall7.receive(Oall7.java:583) at oracle.jdbc.ttc7.TTC7Protocol.doOall7(TTC7Protocol.java:1983) at oracle.jdbc.ttc7.TTC7Protocol.parseExecuteFetch(TTC7Protocol.java:1141) at oracle.jdbc.driver.OracleStatement.doExecuteQuery(OracleStatement.java:2487) at oracle.jdbc.driver.OracleStatement.doExecuteWithTimeout(OracleStatement.java:2854) at oracle.jdbc.driver.OraclePreparedStatement.executeUpdate(OraclePreparedStatement.java:622) at oracle.jdbc.driver.OraclePreparedStatement.executeQuery(OraclePreparedStatement.java:550) at oracle.jbo.server.QueryCollection.buildResultSet(QueryCollection.java:627) at oracle.jbo.server.QueryCollection.executeQuery(QueryCollection.java:515) at oracle.jbo.server.ViewObjectImpl.executeQueryForCollection(ViewObjectImpl.java:3347) at oracle.jbo.server.OAJboViewObjectImpl.executeQueryForCollection(OAJboViewObjectImpl.java:825) at oracle.apps.fnd.framework.server.OAViewObjectImpl.executeQueryForCollection(OAViewObjectImpl.java:4465) at oracle.jbo.server.ViewRowSetImpl.execute(ViewRowSetImpl.java:574) at oracle.jbo.server.ViewRowSetImpl.execute(ViewRowSetImpl.java:538) at oracle.jbo.server.ViewRowSetIteratorImpl.ensureRefreshed(ViewRowSetIteratorImpl.java:2369) at oracle.jbo.server.ViewRowSetIteratorImpl.first(ViewRowSetIteratorImpl.java:1250) at oracle.jbo.server.ViewRowSetImpl.first(ViewRowSetImpl.java:2363) at oracle.jbo.server.ViewObjectImpl.first(ViewObjectImpl.java:5231) at oracle.apps.ar.irec.accountDetails.pay.server.MultipleInvoicesPayListSummaryVOImpl.isSingleInstallment(MultipleInvoicesPayListSummaryVOImpl.java:186) at sun.reflect.NativeMethodAccessorImpl.invoke0(Native Method) at sun.reflect.NativeMethodAccessorImpl.invoke(NativeMethodAccessorImpl.java:39) at sun.reflect.DelegatingMethodAccessorImpl.invoke(DelegatingMethodAccessorImpl.java:25) at java.lang.reflect.Method.invoke(Method.java:324) at oracle.apps.fnd.framework.server.OAUtility.invokeMethod(OAUtility.java:189) at oracle.apps.fnd.framework.server.OAUtility.invokeMethod(OAUtility.java:132) at oracle.apps.fnd.framework.server.OAViewObjectImpl.invokeMethod(OAViewObjectImpl.java:1123) at oracle.apps.ar.irec.accountDetails.pay.webui.QuickPaymentCO.processRequest(QuickPaymentCO.java:53) at oracle.apps.fnd.framework.webui.OAWebBeanHelper.processRequest(OAWebBeanHelper.java:581) at oracle.apps.fnd.framework.webui.OAWebBeanContainerHelper.processRequest(OAWebBeanContainerHelper.java:247) at oracle.apps.fnd.framework.webui.beans.layout.OAHeaderBean.processRequest(OAHeaderBean.java:389) at oracle.apps.fnd.framework.webui.OAWebBeanHelper.processRequestChildren(OAWebBeanHelper.java:932) at oracle.apps.fnd.framework.webui.OAWebBeanHelper.processRequestChildren(OAWebBeanHelper.java:899) at oracle.apps.fnd.framework.webui.OAWebBeanHelper.processRequest(OAWebBeanHelper.java:640) at oracle.apps.fnd.framework.webui.OAWebBeanContainerHelper.processRequest(OAWebBeanContainerHelper.java:247) at oracle.apps.fnd.framework.webui.beans.layout.OAFlowLayoutBean.processRequest(OAFlowLayoutBean.java:351) at oracle.apps.fnd.framework.webui.OAWebBeanHelper.processRequestChildren(OAWebBeanHelper.java:932) at oracle.apps.fnd.framework.webui.OAWebBeanHelper.processRequestChildren(OAWebBeanHelper.java:899) at oracle.apps.fnd.framework.webui.OAWebBeanHelper.processRequest(OAWebBeanHelper.java:640) at oracle.apps.fnd.framework.webui.OAWebBeanContainerHelper.processRequest(OAWebBeanContainerHelper.java:247) at oracle.apps.fnd.framework.webui.beans.layout.OAFlowLayoutBean.processRequest(OAFlowLayoutBean.java:351) at oracle.apps.fnd.framework.webui.OAWebBeanHelper.processRequestChildren(OAWebBeanHelper.java:932) at oracle.apps.fnd.framework.webui.OAWebBeanHelper.processRequestChildren(OAWebBeanHelper.java:899) at oracle.apps.fnd.framework.webui.OAWebBeanHelper.processRequest(OAWebBeanHelper.java:640) at oracle.apps.fnd.framework.webui.OAWebBeanContainerHelper.processRequest(OAWebBeanContainerHelper.java:247) at oracle.apps.fnd.framework.webui.beans.layout.OAStackLayoutBean.processRequest(OAStackLayoutBean.java:350) at oracle.apps.fnd.framework.webui.OAWebBeanHelper.processRequestChildren(OAWebBeanHelper.java:932) at oracle.apps.fnd.framework.webui.OAWebBeanHelper.processRequestChildren(OAWebBeanHelper.java:899) at oracle.apps.fnd.framework.webui.OAWebBeanHelper.processRequest(OAWebBeanHelper.java:640) at oracle.apps.fnd.framework.webui.OAWebBeanContainerHelper.processRequest(OAWebBeanContainerHelper.java:247) at oracle.apps.fnd.framework.webui.OAPageLayoutHelper.processRequest(OAPageLayoutHelper.java:1095) at oracle.apps.fnd.framework.webui.beans.layout.OAPageLayoutBean.processRequest(OAPageLayoutBean.java:1569) at oracle.apps.fnd.framework.webui.OAWebBeanHelper.processRequestChildren(OAWebBeanHelper.java:932) at oracle.apps.fnd.framework.webui.OAWebBeanHelper.processRequestChildren(OAWebBeanHelper.java:899) at oracle.apps.fnd.framework.webui.OAWebBeanHelper.processRequest(OAWebBeanHelper.java:640) at oracle.apps.fnd.framework.webui.OAWebBeanContainerHelper.processRequest(OAWebBeanContainerHelper.java:247) at oracle.apps.fnd.framework.webui.beans.form.OAFormBean.processRequest(OAFormBean.java:385) at oracle.apps.fnd.framework.webui.OAWebBeanHelper.processRequestChildren(OAWebBeanHelper.java:932) at oracle.apps.fnd.framework.webui.OAWebBeanHelper.processRequestChildren(OAWebBeanHelper.java:899) at oracle.apps.fnd.framework.webui.OAWebBeanHelper.processRequest(OAWebBeanHelper.java:640) at oracle.apps.fnd.framework.webui.OAWebBeanContainerHelper.processRequest(OAWebBeanContainerHelper.java:247) at oracle.apps.fnd.framework.webui.beans.OABodyBean.processRequest(OABodyBean.java:353) at oracle.apps.fnd.framework.webui.OAPageBean.processRequest(OAPageBean.java:2298) at oracle.apps.fnd.framework.webui.OAPageBean.preparePage(OAPageBean.java:1711) at oracle.apps.fnd.framework.webui.OAPageBean.preparePage(OAPageBean.java:497) at oracle.apps.fnd.framework.webui.OAPageBean.preparePage(OAPageBean.java:418) at _OA._jspService(OA.jsp:40) at com.orionserver.http.OrionHttpJspPage.service(OrionHttpJspPage.java:56) at oracle.jsp.runtimev2.JspPageTable.service(JspPageTable.java:317) at oracle.jsp.runtimev2.JspServlet.internalService(JspServlet.java:465) at oracle.jsp.runtimev2.JspServlet.service(JspServlet.java:379) at javax.servlet.http.HttpServlet.service(HttpServlet.java:853) at com.evermind.server.http.ServletRequestDispatcher.invoke(ServletRequestDispatcher.java:727) at com.evermind.server.http.ServletRequestDispatcher.forwardInternal(ServletRequestDispatcher.java:306) at com.evermind.server.http.HttpRequestHandler.processRequest(HttpRequestHandler.java:767) at com.evermind.server.http.HttpRequestHandler.run(HttpRequestHandler.java:259) at com.evermind.server.http.HttpRequestHandler.run(HttpRequestHandler.java:106) at EDU.oswego.cs.dl.util.concurrent.PooledExecutor$Worker.run(PooledExecutor.java:803) at java.lang.Thread.run(Thread.java:534) java.sql.SQLException: ORA-01008: not all variables bound at oracle.jdbc.dbaccess.DBError.throwSqlException(DBError.java:134) at oracle.jdbc.ttc7.TTIoer.processError(TTIoer.java:289) at oracle.jdbc.ttc7.Oall7.receive(Oall7.java:583) at oracle.jdbc.ttc7.TTC7Protocol.doOall7(TTC7Protocol.java:1983) at oracle.jdbc.ttc7.TTC7Protocol.parseExecuteFetch(TTC7Protocol.java:1141) at oracle.jdbc.driver.OracleStatement.doExecuteQuery(OracleStatement.java:2487) at oracle.jdbc.driver.OracleStatement.doExecuteWithTimeout(OracleStatement.java:2854) at oracle.jdbc.driver.OraclePreparedStatement.executeUpdate(OraclePreparedStatement.java:622) at oracle.jdbc.driver.OraclePreparedStatement.executeQuery(OraclePreparedStatement.java:550) at oracle.jbo.server.QueryCollection.buildResultSet(QueryCollection.java:627) at oracle.jbo.server.QueryCollection.executeQuery(QueryCollection.java:515) at oracle.jbo.server.ViewObjectImpl.executeQueryForCollection(ViewObjectImpl.java:3347) at oracle.jbo.server.OAJboViewObjectImpl.executeQueryForCollection(OAJboViewObjectImpl.java:825) at oracle.apps.fnd.framework.server.OAViewObjectImpl.executeQueryForCollection(OAViewObjectImpl.java:4465) at oracle.jbo.server.ViewRowSetImpl.execute(ViewRowSetImpl.java:574) at oracle.jbo.server.ViewRowSetImpl.execute(ViewRowSetImpl.java:538) at oracle.jbo.server.ViewRowSetIteratorImpl.ensureRefreshed(ViewRowSetIteratorImpl.java:2369) at oracle.jbo.server.ViewRowSetIteratorImpl.first(ViewRowSetIteratorImpl.java:1250) at oracle.jbo.server.ViewRowSetImpl.first(ViewRowSetImpl.java:2363) at oracle.jbo.server.ViewObjectImpl.first(ViewObjectImpl.java:5231) at oracle.apps.ar.irec.accountDetails.pay.server.MultipleInvoicesPayListSummaryVOImpl.isSingleInstallment(MultipleInvoicesPayListSummaryVOImpl.java:186) at sun.reflect.NativeMethodAccessorImpl.invoke0(Native Method) at sun.reflect.NativeMethodAccessorImpl.invoke(NativeMethodAccessorImpl.java:39) at sun.reflect.DelegatingMethodAccessorImpl.invoke(DelegatingMethodAccessorImpl.java:25) at java.lang.reflect.Method.invoke(Method.java:324) at oracle.apps.fnd.framework.server.OAUtility.invokeMethod(OAUtility.java:189) at oracle.apps.fnd.framework.server.OAUtility.invokeMethod(OAUtility.java:132) at oracle.apps.fnd.framework.server.OAViewObjectImpl.invokeMethod(OAViewObjectImpl.java:1123) at oracle.apps.ar.irec.accountDetails.pay.webui.QuickPaymentCO.processRequest(QuickPaymentCO.java:53) at oracle.apps.fnd.framework.webui.OAWebBeanHelper.processRequest(OAWebBeanHelper.java:581) at oracle.apps.fnd.framework.webui.OAWebBeanContainerHelper.processRequest(OAWebBeanContainerHelper.java:247) at oracle.apps.fnd.framework.webui.beans.layout.OAHeaderBean.processRequest(OAHeaderBean.java:389) at oracle.apps.fnd.framework.webui.OAWebBeanHelper.processRequestChildren(OAWebBeanHelper.java:932) at oracle.apps.fnd.framework.webui.OAWebBeanHelper.processRequestChildren(OAWebBeanHelper.java:899) at oracle.apps.fnd.framework.webui.OAWebBeanHelper.processRequest(OAWebBeanHelper.java:640) at oracle.apps.fnd.framework.webui.OAWebBeanContainerHelper.processRequest(OAWebBeanContainerHelper.java:247) at oracle.apps.fnd.framework.webui.beans.layout.OAFlowLayoutBean.processRequest(OAFlowLayoutBean.java:351) at oracle.apps.fnd.framework.webui.OAWebBeanHelper.processRequestChildren(OAWebBeanHelper.java:932) at oracle.apps.fnd.framework.webui.OAWebBeanHelper.processRequestChildren(OAWebBeanHelper.java:899) at oracle.apps.fnd.framework.webui.OAWebBeanHelper.processRequest(OAWebBeanHelper.java:640) at oracle.apps.fnd.framework.webui.OAWebBeanContainerHelper.processRequest(OAWebBeanContainerHelper.java:247) at oracle.apps.fnd.framework.webui.beans.layout.OAFlowLayoutBean.processRequest(OAFlowLayoutBean.java:351) at oracle.apps.fnd.framework.webui.OAWebBeanHelper.processRequestChildren(OAWebBeanHelper.java:932) at oracle.apps.fnd.framework.webui.OAWebBeanHelper.processRequestChildren(OAWebBeanHelper.java:899) at oracle.apps.fnd.framework.webui.OAWebBeanHelper.processRequest(OAWebBeanHelper.java:640) at oracle.apps.fnd.framework.webui.OAWebBeanContainerHelper.processRequest(OAWebBeanContainerHelper.java:247) at oracle.apps.fnd.framework.webui.beans.layout.OAStackLayoutBean.processRequest(OAStackLayoutBean.java:350) at oracle.apps.fnd.framework.webui.OAWebBeanHelper.processRequestChildren(OAWebBeanHelper.java:932) at oracle.apps.fnd.framework.webui.OAWebBeanHelper.processRequestChildren(OAWebBeanHelper.java:899) at oracle.apps.fnd.framework.webui.OAWebBeanHelper.processRequest(OAWebBeanHelper.java:640) at oracle.apps.fnd.framework.webui.OAWebBeanContainerHelper.processRequest(OAWebBeanContainerHelper.java:247) at oracle.apps.fnd.framework.webui.OAPageLayoutHelper.processRequest(OAPageLayoutHelper.java:1095) at oracle.apps.fnd.framework.webui.beans.layout.OAPageLayoutBean.processRequest(OAPageLayoutBean.java:1569) at oracle.apps.fnd.framework.webui.OAWebBeanHelper.processRequestChildren(OAWebBeanHelper.java:932) at oracle.apps.fnd.framework.webui.OAWebBeanHelper.processRequestChildren(OAWebBeanHelper.java:899) at oracle.apps.fnd.framework.webui.OAWebBeanHelper.processRequest(OAWebBeanHelper.java:640) at oracle.apps.fnd.framework.webui.OAWebBeanContainerHelper.processRequest(OAWebBeanContainerHelper.java:247) at oracle.apps.fnd.framework.webui.beans.form.OAFormBean.processRequest(OAFormBean.java:385) at oracle.apps.fnd.framework.webui.OAWebBeanHelper.processRequestChildren(OAWebBeanHelper.java:932) at oracle.apps.fnd.framework.webui.OAWebBeanHelper.processRequestChildren(OAWebBeanHelper.java:899) at oracle.apps.fnd.framework.webui.OAWebBeanHelper.processRequest(OAWebBeanHelper.java:640) at oracle.apps.fnd.framework.webui.OAWebBeanContainerHelper.processRequest(OAWebBeanContainerHelper.java:247) at oracle.apps.fnd.framework.webui.beans.OABodyBean.processRequest(OABodyBean.java:353) at oracle.apps.fnd.framework.webui.OAPageBean.processRequest(OAPageBean.java:2298) at oracle.apps.fnd.framework.webui.OAPageBean.preparePage(OAPageBean.java:1711) at oracle.apps.fnd.framework.webui.OAPageBean.preparePage(OAPageBean.java:497) at oracle.apps.fnd.framework.webui.OAPageBean.preparePage(OAPageBean.java:418) at _OA._jspService(OA.jsp:40) at com.orionserver.http.OrionHttpJspPage.service(OrionHttpJspPage.java:56) at oracle.jsp.runtimev2.JspPageTable.service(JspPageTable.java:317) at oracle.jsp.runtimev2.JspServlet.internalService(JspServlet.java:465) at oracle.jsp.runtimev2.JspServlet.service(JspServlet.java:379) at javax.servlet.http.HttpServlet.service(HttpServlet.java:853) at com.evermind.server.http.ServletRequestDispatcher.invoke(ServletRequestDispatcher.java:727) at com.evermind.server.http.ServletRequestDispatcher.forwardInternal(ServletRequestDispatcher.java:306) at com.evermind.server.http.HttpRequestHandler.processRequest(HttpRequestHandler.java:767) at com.evermind.server.http.HttpRequestHandler.run(HttpRequestHandler.java:259) at com.evermind.server.http.HttpRequestHandler.run(HttpRequestHandler.java:106) at EDU.oswego.cs.dl.util.concurrent.PooledExecutor$Worker.run(PooledExecutor.java:803) at java.lang.Thread.run(Thread.java:534)
    Thanks,
    Siddhu

    Is IE your default browser?
    The address in that error is somewhat peculiar, in that it points to a process running on your computer (127.0.0.1 is a loopback address that points to your own system).
    I suggest that after downloading and saving the Flash installer to a folder, you completely exit Firefox, and do the installation with Firefox closed in case having Firefox open is interfering in some manner.
    Of course, make sure you get the official installer from Adobe, and '''uncheck the box for any tag-along software that you do not want''':
    http://get.adobe.com/flashplayer/

  • When i try to run Dreamweaver CC i always get an error.

    When i try to run Dreamweaver CC i always get an error on : [email protected]@@QEBPBIXZ.
    This started after i switch the WRServices.dll, when i was getting one other error.
    And no one answered me on the phone service.

    First, ask in that forum Dreamweaver support forum
    The Cloud forum is not about using individual programs
    The Cloud forum is about the Cloud as a delivery & install process
    If you will start at the Forums Index https://forums.adobe.com/welcome
    You will be able to select a forum for the specific Adobe product(s) you use
    Click the "down arrow" symbol on the right (where it says All communities) to open the drop down list and scroll
    Second, consider UN-installing and running the cleaner and RE-installing if the other Dreamweaver users think your install is corrupted
    Discussions of RE-installing
    -http://forums.adobe.com/thread/1408331?tstart=0
    -http://forums.adobe.com/thread/1398961?tstart=0
    -and http://helpx.adobe.com/creative-cloud/help/install-apps.html
    -using the cleaner after uninstalling and before reinstalling will usually help
    -http://helpx.adobe.com/creative-suite/kb/cs5-cleaner-tool-installation-problems.html

  • Error when I try to run a form

    Hi,
    I created a table-based form, but I get a error when I try to run it (CTRL+R):
    java.lang.ClassNotFoundException: oracle.forms.engine.Main
    How can I fix it?
    Thanks
    Savio Barros

    If you have JInitiator installed successfully that is if you are able to run the test form try this
    Open the control panel of your JInitiator (double click on the JInitiator icon in windows control panel) in the Proxies tab, see if you have the Use Browser Settings check box checked.
    Otherwise configure the proxy settings and test your form.
    Regards,
    Tony

Maybe you are looking for

  • Navigation Problem in JSF - Urgent, pls help

    hi, I have a problem while navigating into a popup using a custom commandLink which opens the popup.The problem is that when i close the popup and return to the parent JSF and click any button or link in the parent, the page navigates to the page tha

  • Oracle financials implementation

    Hi all.. plz cud anyone of you kindly tell me the minimum cofiguration to implement oracle financials dummy software by which we can practice all the modules.. plz kindly reply me as soon as possible... Also we have oracle application server... So wa

  • New VLan can't talk to DHCP server

    We have just created a new vlan (172.18.1.0/24 vlan 3) on our network and we are trying to use an exsisting DHCP server (192.168.0.1 vlan 8) But the clients on the 172.18.1.0 network can't connect to this DHCP server on vlan 8. My questions are. 1. D

  • HT5052 Why is my puffin browser not working?

    My puffin browser stopped functioning; I deleted it, and when I tried to purchase a newer version from the store, a displayed message stated that I need to have iOS 5 or later, in order to install the new puffin version. I searched for the iOS 5 but

  • Non Rendering Layers

    Making a flash website, and since I'm a lazy guy I grabbed a template (seen here http://www.templatesbox.com/free-flash-templates/003.htm), obivously it need to be changed from a corporate one to something different, so I changed the "slogan" layer t