Error when Installing 10gAS-Midtier on SuSE

I have the following error at the "Configuration Assistant" phase when I install 10gAS-Midtier on SuSE. This error happen at "OC4J Instance Configuration Assistant".
Adding dependent libraries for application 'portal'..done.Deploying application 'oraudrepl' to OC4J instance 'OC4J_Portal'..
ERROR: Caught exception during deploy.
Stopping OC4J instance 'OC4J_Portal'...java.rmi.RemoteException: deploy failed!: ; nested exception is:
     oracle.oc4j.admin.internal.DeployerException: User specified for application-client uddirepl, 'uddi_replicator' not found
     at com.evermind.server.rmi.RMIConnection.EXCEPTION_ORIGINATES_FROM_THE_REMOTE_SERVER(RMIConnection.java:1520)
     at com.evermind.server.rmi.RMIConnection.invokeMethod(RMIConnection.java:1473)
     at com.evermind.server.rmi.RemoteInvocationHandler.invoke(RemoteInvocationHandler.java:55)
     at com.evermind.server.rmi.RecoverableRemoteInvocationHandler.invoke(RecoverableRemoteInvocationHandler.java:22)
     at __Proxy0.deploy(Unknown Source)
     at oracle.ias.sysmgmt.deployment.j2ee.runtime.LocalDeploy.deployOnSingleInstance(Unknown Source)
Any ideal ?

Hi.
I seem to be having the same problem. Have you solved this issue ?? I just opened a SR with Oracle on this issue.

Similar Messages

  • Error when Installing Oracle XE on Suse Linux 10.0

    I am installing Oracle xe on Suse Linux 10.0.
    I get following error.
    [email protected]:~/oraclexe> rpm -ivh oracle-xe-10.2.0.1-0.1.i386.rpm
    error: cannot get exclusive lock on /var/lib/rpm/Packages
    error: cannot open Packages index using db3 - Operation not permitted (1)
    error: cannot open Packages database in /var/lib/rpm
    Please help
    George

    I found another thread in this forum where you can look up how to extend your swap space (look at the bottom of that thread):
    re:Out of swap space during 9iAS install.
    I am very new to Linux, I am very much disappointed,
    I installed Linux with lots of hopes that I can
    Install Oracle tools easily on Linux and work
    comfortably. Now If I cannot intall a small database
    Oracle XE, even with 1GB Ram and 25GB harddrive on
    Linux, I don't realize why people run for Linux.
    I could Oracle XE on windows on a machine with 512
    mb ram in 4 minutes.Maybe you should take into consideration that you are not so "new" to windows and that each new system has a learning curve.
    Someone please help.. in detail. How to resize the
    swap partition at this point.Look in the provided link.
    I have very limitted or no knowldge in Linux.Maybe you should change that or stay with what you know. I don't see any other way ...
    As a sidenote, each command under Linux does have a so called "man" page (from manual). You also need to open a shell to access those commands as shown in the thread.
    And please, take a look at the commands in that thread before you start implementing, since for example the dd command seems only to create a file with a size of 512M.
    Knowing how to use a search engine would also be a valuable asset in your current position.
    C.

  • Error when installing 9.2 on Suse 7.3

    The installer exits when it has completed aprox 6% with the following message:
    An unexpected exception has been detected in native code outside the VM.
    Unexpected Signal : 11 occurred at PC=0x40007dda
    Function name=(N/A)
    Library=(N/A)
    NOTE: We are unable to locate the function name symbol for the error
    just occurred. Please refer to release documentation for possible
    reason and solutions.
    Current Java thread:
    at java.lang.ClassLoader$NativeLibrary.find(Native Method)
    at java.lang.ClassLoader.findNative(ClassLoader.java:1441)
    at ssOiGeneralClassux201.getenv(Native Method)
    at sssetenvux.getSystemEnvironment(sssetenvux.java:162)
    at sssetenvux.installAction(sssetenvux.java:45)
    at oracle.sysman.oii.oiis.OiisCompActions.doActionWithException(OiisCompActions.java:1357)
    at oracle.sysman.oii.oiis.OiisCompActions.doActionImpl(OiisCompActions.java:1157)
    at oracle.sysman.oii.oiis.OiisCompActions.doAction(OiisCompActions.java:604)
    at Components.oracle.install.instcommon.v9_2_0_1_0.CompActions.doAction(CompActions.java:53)
    at Components.oracle.install.instcommon.v9_2_0_1_0.CompInstallPhase1.doActionP1setenv4(CompInstallPhase1.java:205)
    at Components.oracle.install.instcommon.v9_2_0_1_0.CompInstallPhase1.stateChangeActions(CompInstallPhase1.java:86)
    at Components.oracle.install.instcommon.v9_2_0_1_0.CompActions.stateChangeActions(CompActions.java:33)
    at oracle.sysman.oii.oiic.OiicInstallActionsPhase$OiilActionThr.run(OiicInstallActionsPhase.java:604)
    at oracle.sysman.oii.oiic.OiicInstallActionsPhase.executeProductPhases(OiicInstallActionsPhase.java:2199)
    at oracle.sysman.oii.oiic.OiicInstallActionsPhase.doInstalls(OiicInstallActionsPhase.java:2052)
    at oracle.sysman.oii.oiic.OiicInstallActionsPhase$OiInstRun.run(OiicInstallActionsPhase.java:2945)
    at java.lang.Thread.run(Thread.java:484)
    The orainstall*.err and .out files are empty, and the last lines of the orainstall.log file is:
    Starting install install phase 1 of component Installation Common Files
    Calling action fileActions2.2.0.10.0 finalClusterSetup
         selectedNodes =
         threadsActive = 2
         vectorInitialSize = 50
         vectorFactorSize = 25
    Calling query areasQueries2.2.0.7.0 getProductHome
    name = oracle.swd.jre
    startVersion = 1.1.8
    endVersion = 1.2
    acceptCompatible = null
    Query returned : /u01/app/oracle/jre/1.1.8
    Setting value of s_jreProductLocation to /u01/app/oracle/jre/1.1.8
    Calling action fileActions2.2.0.10.0 createDir
         selectedNodes =
         destination = /opt/oracle/Ora9.2/install
         permissions = null
         owner = null
         group = null
    Calling action generalActions2.2.0.6.0 setenv
         selectedNodes =
         name = ORACLE_HOME
         value = /opt/oracle/Ora9.2
         append = null
         replace = null
    Anyone who can spot the problem?

    I found another thread in this forum where you can look up how to extend your swap space (look at the bottom of that thread):
    re:Out of swap space during 9iAS install.
    I am very new to Linux, I am very much disappointed,
    I installed Linux with lots of hopes that I can
    Install Oracle tools easily on Linux and work
    comfortably. Now If I cannot intall a small database
    Oracle XE, even with 1GB Ram and 25GB harddrive on
    Linux, I don't realize why people run for Linux.
    I could Oracle XE on windows on a machine with 512
    mb ram in 4 minutes.Maybe you should take into consideration that you are not so "new" to windows and that each new system has a learning curve.
    Someone please help.. in detail. How to resize the
    swap partition at this point.Look in the provided link.
    I have very limitted or no knowldge in Linux.Maybe you should change that or stay with what you know. I don't see any other way ...
    As a sidenote, each command under Linux does have a so called "man" page (from manual). You also need to open a shell to access those commands as shown in the thread.
    And please, take a look at the commands in that thread before you start implementing, since for example the dd command seems only to create a file with a size of 512M.
    Knowing how to use a search engine would also be a valuable asset in your current position.
    C.

  • Error when install Infrastructure 10g 10.1.2 in Windows2000 server

    My environment:
    RDBMS Version: 10.1.0.3.1
    Operating System and Version: Windows2000 SP4
    Product (i.e., OAS, IAS, etc): 10g AS Release 2
    Product Version: 10.1.2
    JDK Version: 1.4
    I have the folowing error when installing the Infrastructure (in the stage of SSO Configure Assistant):
    Default Subscriber GUID: E0575BDE015C411CAD99BDEF85F79029
    Subscriber Naming attribute: dc
    Default Subscriber Name: server01
    *** Resetting user DN and GUID information ...***
    Done....
    PL/SQL procedure successfully completed.
    No errors.
    Disconnected from Oracle Database 10g Enterprise Edition Release 10.1.0.3.1 - Production
    With the Partitioning, Real Application Clusters, OLAP and Data Mining options
    NLS_LANG character set = WE8MSWIN1252
    NLS_LANG param = AMERICAN_AMERICA.WE8MSWIN1252
    ERROR : Exception while configing SSO DAD :
    oracle.ias.repository.schema.SchemaException: Unable to establish connection to the Oracle Internet Directory Server ldap://myserver.domain.com:3060/. Base Exception : javax.naming.CommunicationException: Request: 1 cancelled
    at oracle.ias.repository.directory.DirectoryReader.connect(DirectoryReader.java:124)
    at oracle.ias.repository.IASSchema.getDBConnect(IASSchema.java:523)
    Please advice.
    Thanks
    Trung

    I don't know much about the 10g Releases yet but I had the same error with 9.0.2.3. The problem is that OID isn't available when it needs to be.
    When you get the error, start OID using the command line then try running the config assistant again.
    Hope this helps
    Alex

  • TS3212 I get an apple application support error when installing itunes. It says uninstall and re-install.  Does not work.  same message.  What is a solution?

    I get an apple application support error when installing itunes. It says uninstall and re-install.  Does not work.  same message.  What is a solution?

    Is that an error 2 message?
    If so, let's try a standalone Apple Application Support install. It still might not install, but fingers crossed any error messages will give us a better idea of the underlying cause of the issue.
    Download and save a copy of the iTunesSetup.exe (or iTunes64setup.exe) installer file to your hard drive:
    http://www.apple.com/itunes/download/
    Download and install the free trial version of WinRAR:
    http://www.rarlab.com/
    Right-click the iTunesSetup.exe (or iTunes64Setup.exe), and select "Extract to iTunesSetup" (or "Extract to iTunes64Setup"). WinRAR will expand the contents of the file into a folder called "iTunesSetup" (or "iTunes64Setup").
    Go into the folder and doubleclick the AppleApplicationSupport.msi to do a standalone AAS install.
    Does it install properly for you?
    If instead you get an error message during the install, let us know what it says. (Precise text, please.)

  • ?I am getting an error when installing on my dell inspiron with latest updates for drivers.  Error 1406.  I have the problem with Scan Snap software and a full version of reader.

    ?I am getting an error when installing on my dell inspiron with latest updates for drivers.  Error 1406.  I have the problem with Scan Snap software and a full version of reader.

    Error 1402 | Error 1406 | Acrobat, Reader

  • What is the 0x80070570 error when installing Win7 or Win8 or Win 8.1 on a clean SSD/HDD ?!

    Hello,
    My computer was working perfectly with Win7 for about 2years until I formatted on monday to clean a little bit my drives ... Since then I'm unable to install windows again. I have the 0x80070570 error.
    The complete error message is:
    Windows cannot install required files. The file may be corrupt or missing. Make sure that all files required for installation are available and restart the installation. Error code:0x80070570.
    What is the 0x80070570 error when installing Win7 or Win8 or Win 8.1 on a clean SSD/HDD ?! These versions are full from MSDN.
    What I did already:
    check my RAM (16go gskill)
    remove unnecessary hard drives
    replace my "old" SSD with a clean new one
    remove my sound cards
    remove the mouse and use only keyboard
    reset the BIOS
    check every LED on the motherboard (asus sabertooth z77) and there is no problem
    What are the problems?
    Thanks,
    Adrien.

    Hi,
    If all images cannot be installed, we have a reason to suspect the hardware cause.
    If you use two memory slots to get 16G RAM, I suggest you test with just one (8G) to check the result.
    Alex Zhao
    TechNet Community Support

  • Update Operation Fatal Error when installing Technical Preview Build 10041 Upgrade

    I posted this in the Microsoft Community forums and was redirected here.
    Below is the original post (URL: http://answers.microsoft.com/en-us/insider/forum/insider_wintp-insider_install/update-operation-fatal-error-when-installing/6eaff1b9-0223-4357-afc8-884382590e82 )
    Hello,
    In trying to perform an upgrade install of the Windows 10 Technical Preview Build 10041 (as is the latest available for direct download as of my writing), I am running into a problem I cannot find mention of anywhere else on the web.
    I fall into two categories with regards to this build: A) Product tester who actually needs to test application performance under Windows 10 on bare metal, B) Semi-crazy techie who loves using (usable) beta software as his primary environment ;)
    so it is rather important to me that I get this working on my machine in some non-virtualized respect. I am reluctant to do a full/fresh install if installation problems are happening, because my Windows 8 product key has been f***ed up from the
    start (likely some random database corruption) and I've had to utilize phone support to get around an "unknown error" the last two times I've had to use it. So, for fear of that key completely crapping out on me, I don't want to move to Win10 unless
    I'm confident it will install and I can stick with it (for better or worse) through the end. Problems within the Preview after I install it I can deal with.
    So, I first tried to install the Preview through the standard Windows Update method. The installer took about 7 hours (but from reading lots of internet discussions, stupidly long install times in that range seem to be a common problem with
    this builds separate from it actually failing). During the reboot between the "Setting up Devices" (Or is it Setting up Drivers? I forget) and "Taking Care of a Few More Things" (Again, possibly paraphrased), for about a split second, underneath
    the Windows logo and throbber, some error like this appeared:
    Fatal Error Performing Update Operation # of ##: ERROR CODE
    It only appeared for a fraction of a second, and I had no chance of reading the precise numbers or error.
    However, the installer then seemed to continue, and went until the main circle was at 100%. As soon as 100% hit, however, the screen went black for something like 30min. Then, I briefly saw "Attempting to recover installation" before "Restoring
    your previous version of Windows." And I was, quite impressively considering how far along that installer was, back in Windows 8.1 completely unharmed.
    I tried again by burning an ISO and doing a disc upgrade install. I let that one run overnight and was asleep for the error, but I was back in Win8.1 in the morning, so I can only assume a similar thing happened there.
    As for my system specs, I'm running on a MacBook Pro 9,1 under Boot Camp. I am upgrading from Windows 8.1.2 Pro with Media Center. I have found other online accounts of people quite successfully installing Windows 10 on Macs, so that isn't the issue.
    Does anyone have any clue as to what this error might have been/be, and how I might fix it? Or at least have it on good authority that a fresh installation would be unaffected (meaning it's software-related)? If not, I can try installing to a VHD,
    which would at least let me product test on bare metal, but wouldn't have the harddrive space to be my daily driver and would probably only get used occasionally.
    Thanks in advance to anyone who can help!
    So far, I have the yet-to-be-tried idea of a clean boot prior to installation.
    If anyone here has any more specific ideas, lemme hear 'em.
    Thanks!

    To the individual who proposed this as an answer to my problem: It's not even applicable. I specifically stated that I was trying to avoid doing a clean installation (at least without knowing more about the problem at hand). An answer saying to do the thing
    you're trying to avoid doing is not an answer. You can see my last reply for the current status of this issue. 6-8 hour blocks of time in which I can't use my computer (as is required to install build 10041) aren't super common for me, but I haven't abandoned
    this thread. There have simply been no more updates. If your motivation as a mod was that you simply don't like there being unanswered threads on this forum, then perhaps you could attempt to contribute rather than arbitrarily marking the first reply as an
    answer.
    I will continue to update this thread as I try new things and get more information.
    Thank you.

  • Errors when installing Oracle Client 10.2.0.2.0 on zLinux (Red Hat)

    I am receiving errors when installing Oracle Client 10.2.0.2.0 (Administrator) on zLinux. During the install I receive two notifications for File Not Found when the installer tries to create the link for lib32/libclntsh.so.10.1. I hit ignore on the pop-ups and the install completes. The Oracle Net Configuration Assistant then fails to launch with the following error:
    Output generated from configuration assistant "Oracle Net Configuration Assistant":
    Command = /opt/oracle/product/10.2.0/db_1/bin/netca /orahome /opt/oracle/product/10.2.0/db_1 /orahnam Oracle_home /instype custom /inscomp client,oraclenet,ano /insprtcl tcp /cfg local /authadp NO_VALUE /nodeinfo NO_VALUE /responseFile /opt/oracle/product/10.2.0/db_1/network/install/netca_clt.rsp
    UnsatisfiedLinkError exception loading native library: njni10
    Configuration assistant "Oracle Net Configuration Assistant" failed
    The "/opt/oracle/product/10.2.0/db_1/cfgtoollogs/configToolFailedCommands" script contains all commands that failed, were skipped or were cancelled. This file may be used to run these configuration assistants outside of OUI. Note that you may have to update this script with passwords (if any) before executing the same.
    I have seen multiple threads relating to very similar errors, but none of the fixes that were suggested have worked. I have double checked the required Red Hat packages and made sure they were all installed on the server. All of the prerequisite checks for the installer are successful. Any assistance would be of most helpful!

    Worked with my Linux system admin and figured out that we were indeed missing some packages. There are 390 and 390x rpm's for Red Hat on System Z, i.e. 64 bit and 32 bit versions. Since we are running a 64 bit os some of those 32 bit packages did not get installed. Since our roles are split up, I am kind of blind as to the OS setup so I was not able to catch the problem. It is truly puzzling as to why Oracle would need 32 bit packages even though Oracle client is 64 bit. Regardless, after adding the 32 bit rpm's the installer was able to perform the linking operation that was failing, and the network configuration script ran successfully.

  • Getting an "installer failed to initialize" error when installing CS5 from CD

    Getting an "installer failed to initialize" error when installing CS5 from CD
    Mac OS X Version 10.7.5

    Try using the Adobe Creative Suite Cleaner Tool
    helps resolve installation problems for CS3 thru CS6 and for Creative Cloud
    http://www.adobe.com/support/contact/cscleanertool.html
    If you continue to have problems getting the CD installation to work you can download the trial version of the software thru the page linked below and then use your current serial number to activate it.
    Be sure to follow the steps outlined in the Note: Very Important Instructions section on the download pages at this site or else the download will not work properly.
    CS5:
    http://prodesigntools.com/all-adobe-cs5-direct-download-links.html

  • Error when installing SDK on BW platform

    We have successfully installed SDK to our DS client, but get an error when installing the extensions on the BW platform (SP12):
    I understand that I need to reboot the portal server, but the error message indicate that the issue will not be resolved. Any suggestions?

    Hi,
    it could be that the depending extension was unpacked while installing the extension pack.
    please go to folder C:\user\..\Analysis-config\plugins and check if the extension jar-file is available. If there is only a folder with the extension name you have to delete this folder,
    uninstall the extension pack in your Design Studio (client side),
    go to Eclipse and check the "Unpack after installing" checkbox in your project Features,
    if it is checked please unckeck it,
    export your extension pack to zip-file,
    install your extenion pack again on client side,
    now the jar-file should be available.
    You sholud deploy your extension on Server without any errors.
    kind regards
    Patrick

  • Error when installing SM7 "The step runMigrationMonitor with step key "

    Hi all
    Please help for the following error when installing
    ERROR 2009-06-13 00:27:13.515
    FCO-00011  The step runMigrationMonitor with step key |NW_Onehost|ind|ind|ind|ind|0|0|NW_Onehost_System|ind|ind|ind|ind|2|0|NW_CreateDBandLoad|ind|ind|ind|ind|10|0|NW_ABAP_Import_Dialog|ind|ind|ind|ind|5|0|NW_ABAP_Import|ind|ind|ind|ind|0|0|runMigrationMonitor was executed with status ERROR .
    Regards
    Kevin

    Hi Uday
    import.monitor.java.log
    Loading of 'SASACONT1' import package: OK
    Import Monitor jobs: running 2, waiting 23, completed 4, failed 0, total 29.
    Import Monitor jobs: running 3, waiting 22, completed 4, failed 0, total 29.
    Loading of 'SAPSSEXC' import package: ERROR
    Import Monitor jobs: running 2, waiting 22, completed 4, failed 1, total 29.
    Loading of 'REPOSRC' import package: ERROR
    Import Monitor jobs: running 1, waiting 22, completed 4, failed 2, total 29.
    Loading of 'SAPAPPL0' import package: ERROR
    Import Monitor jobs: running 0, waiting 22, completed 4, failed 3, total 29.
    Import Monitor jobs: running 1, waiting 21, completed 4, failed 3, total 29.
    Import Monitor jobs: running 2, waiting 20, completed 4, failed 3, total 29.
    Import Monitor jobs: running 3, waiting 19, completed 4, failed 3, total 29.
    Loading of 'DOKCLU' import package: ERROR
    Import Monitor jobs: running 2, waiting 19, completed 4, failed 4, total 29.
    Loading of 'SAPAPPL1' import package: ERROR
    Import Monitor jobs: running 1, waiting 19, completed 4, failed 5, total 29.
    Loading of 'SAPAPPL2' import package: ERROR
    Import Monitor jobs: running 0, waiting 19, completed 4, failed 6, total 29.
    Import Monitor jobs: running 1, waiting 18, completed 4, failed 6, total 29.
    Import Monitor jobs: running 2, waiting 17, completed 4, failed 6, total 29.
    Import Monitor jobs: running 3, waiting 16, completed 4, failed 6, total 29.
    Loading of 'DD03L' import package: ERROR
    Import Monitor jobs: running 2, waiting 16, completed 4, failed 7, total 29.
    Loading of 'SAPSSRC' import package: ERROR
    Import Monitor jobs: running 1, waiting 16, completed 4, failed 8, total 29.
    Loading of 'STERM_TEXT' import package: ERROR
    Import Monitor jobs: running 0, waiting 16, completed 4, failed 9, total 29.
    Import Monitor jobs: running 1, waiting 15, completed 4, failed 9, total 29.
    Import Monitor jobs: running 2, waiting 14, completed 4, failed 9, total 29.
    Import Monitor jobs: running 3, waiting 13, completed 4, failed 9, total 29.
    Loading of 'SEOSUBCODF' import package: ERROR
    Import Monitor jobs: running 2, waiting 13, completed 4, failed 10, total 29.
    Loading of 'E071K' import package: ERROR
    Import Monitor jobs: running 1, waiting 13, completed 4, failed 11, total 29.
    Loading of 'SAPSDIC' import package: ERROR
    Import Monitor jobs: running 0, waiting 13, completed 4, failed 12, total 29.
    Import Monitor jobs: running 1, waiting 12, completed 4, failed 12, total 29.
    Import Monitor jobs: running 2, waiting 11, completed 4, failed 12, total 29.
    Import Monitor jobs: running 3, waiting 10, completed 4, failed 12, total 29.
    Loading of 'ATAB' import package: ERROR
    Import Monitor jobs: running 2, waiting 10, completed 4, failed 13, total 29.
    Loading of 'SAPSPROT' import package: ERROR
    Import Monitor jobs: running 1, waiting 10, completed 4, failed 14, total 29.
    Loading of 'SAPSDOCU' import package: ERROR
    Import Monitor jobs: running 0, waiting 10, completed 4, failed 15, total 29.
    Import Monitor jobs: running 1, waiting 9, completed 4, failed 15, total 29.
    Import Monitor jobs: running 2, waiting 8, completed 4, failed 15, total 29.
    Import Monitor jobs: running 3, waiting 7, completed 4, failed 15, total 29.
    Loading of 'SAPPOOL' import package: ERROR
    Import Monitor jobs: running 2, waiting 7, completed 4, failed 16, total 29.
    Loading of 'SAPSLOAD' import package: ERROR
    Import Monitor jobs: running 1, waiting 7, completed 4, failed 17, total 29.
    Loading of 'SAPSLEXC' import package: ERROR
    Import Monitor jobs: running 0, waiting 7, completed 4, failed 18, total 29.
    Import Monitor jobs: running 1, waiting 6, completed 4, failed 18, total 29.
    Import Monitor jobs: running 2, waiting 5, completed 4, failed 18, total 29.
    Import Monitor jobs: running 3, waiting 4, completed 4, failed 18, total 29.
    Loading of 'SAPDDIM' import package: ERROR
    Import Monitor jobs: running 2, waiting 4, completed 4, failed 19, total 29.
    Loading of 'SAPDFACT' import package: ERROR
    Import Monitor jobs: running 1, waiting 4, completed 4, failed 20, total 29.
    Loading of 'SAPCLUST' import package: ERROR
    Import Monitor jobs: running 0, waiting 4, completed 4, failed 21, total 29.
    Import Monitor jobs: running 1, waiting 3, completed 4, failed 21, total 29.
    Import Monitor jobs: running 2, waiting 2, completed 4, failed 21, total 29.
    Import Monitor jobs: running 3, waiting 1, completed 4, failed 21, total 29.
    Loading of 'SAPDODS' import package: ERROR
    Import Monitor jobs: running 2, waiting 1, completed 4, failed 22, total 29.
    Loading of 'SAP0000' import package: ERROR
    Import Monitor jobs: running 1, waiting 1, completed 4, fail
    ed 23, total 29.
    Loading of 'SAPUSER' import package: ERROR
    Import Monitor jobs: running 0, waiting 1, completed 4, failed 24, total 29.
    Edited by: Kevin Wong on Jun 18, 2009 11:23 AM
    Edited by: Kevin Wong on Jun 18, 2009 11:24 AM

  • Error when installing "contents of this disk cannot be changed".

    I'm getting this error when installing Snow Leopard, 'The contents of this disk cannot be changed'.
    Any ideas?

    Install 10.5.8 COMBO update, then try SL.

  • Error when installing app

    I keep getting an error when installing some apps - unknown error (0xE8000013)
    Anyone know what this is or why this is happening???
    any help apreciated

    leefilmer,
    Have you tried the steps in article http://support.apple.com/kb/TS1702 ? Reporting the problem to the particular application developer may be helpful, since it seems to be occurring with some apps.
    Oddly, the article I found documenting the error doesn't seem related to the issue you're experiencing: http://support.apple.com/kb/TS1266. Do you have a SIM PIN on your iPhone by chance?
    Other than that, have you tried restoring your iPhone and setting it up as a new phone? More information can be found here: http://support.apple.com/kb/HT1414 .
    Hope this helps,
    Raleigh

  • Error when installing applications

    I am getting a error when installing a few different application.
    I get this error installing the Citrix Receiver, I get similar errors when installing the Cisco VPN software as well. These are two very important aps for us and need to work on 8.1 if we are to move forward with upgrades.
    Product: Citrix Receiver(USB) -- Error 1406. Could not write value GUID to key \SYSTEM\CurrentControlSet\Control\Citrix\Tracing\Modules\IcaClient_GenericUsb_Vdgusb. System error . Verify that you have sufficient access to that key, or contact your support
    personnel.
    It seams like it is not creating the key in the registry, even though I am a local admin on the system. I have tried running it as a domain admin with the same error. I have also verified I can create keys in the registry
    I am currently running Windows 8.1 Enterprise eval on my laptop, we are testing this in our environment.
    Thanks in advanced for any help, this one has stumped me a little.

    Ask Cisco support/forum for help. This seems to be vendor/product specific
    https://supportforums.cisco.com/discussion/12191531/cisco-vpn-client-wont-install-error-1406
    http://community.spiceworks.com/topic/492304-cisco-vpn-client-installtion-error-code-1406
    http://vootwerk.wordpress.com/2008/06/05/fix-error-1406-during-cisco-vpn-client-installation-or-upgrade/
    HTH
    Milos

Maybe you are looking for


HashFlare