Error when installing Oracle Designer/SCM Release 9.0.2.6 patch

Hi.
I am trying to install Oracle Designer/SCM Release 9.0.2.6 patch. I've already installed Oracle 9i Forms and Reports 9.0.2.1.0 (patch 2705870) and 9.0.2.3.0 (patch 3129219). The Oracle Installer version is 2.2.0.18.0, but when I try to install Designer/SCM Release 9.0.2.6.0, which uses Oracle Installer version is 2.3.0.0.0, I get the following error in my hs_err log file:
An unexpected exception has been detected in native code outside the VM.
Unexpected Signal : EXCEPTION_ACCESS_VIOLATION occurred at PC=0xff12ed8
Function name=CallWndProcFunc
Library=C:\WINDOWS\System32\SHW95DLL.DLL
Current Java thread:
     at sun.awt.windows.WToolkit.eventLoop(Native Method)
     at sun.awt.windows.WToolkit.run(Unknown Source)
     at java.lang.Thread.run(Unknown Source)
Dynamic libraries:
0x00400000 - 0x00405000      O:\Oracle Product Downloads\Oracle Developer Suite\Windows\Patches\9i_designer_scm_9026\stage\Components\oracle.swd.jre\1.3.1.1.0c\1\DataFiles\Expanded\bin\javaw.exe
0x77F50000 - 0x77FF7000      C:\WINDOWS\System32\ntdll.dll
0x77E60000 - 0x77F46000      C:\WINDOWS\system32\kernel32.dll
0x77DD0000 - 0x77E5D000      C:\WINDOWS\system32\ADVAPI32.dll
0x78000000 - 0x78086000      C:\WINDOWS\system32\RPCRT4.dll
0x77D40000 - 0x77DCC000      C:\WINDOWS\system32\USER32.dll
0x77C70000 - 0x77CB0000      C:\WINDOWS\system32\GDI32.dll
0x77C10000 - 0x77C63000      C:\WINDOWS\system32\MSVCRT.dll
0x6D420000 - 0x6D4EE000      O:\Oracle Product Downloads\Oracle Developer Suite\Windows\Patches\9i_designer_scm_9026\stage\Components\oracle.swd.jre\1.3.1.1.0c\1\DataFiles\Expanded\bin\hotspot\jvm.dll
0x76B40000 - 0x76B6C000      C:\WINDOWS\System32\WINMM.dll
0x6D220000 - 0x6D227000      O:\Oracle Product Downloads\Oracle Developer Suite\Windows\Patches\9i_designer_scm_9026\stage\Components\oracle.swd.jre\1.3.1.1.0c\1\DataFiles\Expanded\bin\hpi.dll
0x6D3B0000 - 0x6D3BD000      O:\Oracle Product Downloads\Oracle Developer Suite\Windows\Patches\9i_designer_scm_9026\stage\Components\oracle.swd.jre\1.3.1.1.0c\1\DataFiles\Expanded\bin\verify.dll
0x6D250000 - 0x6D266000      O:\Oracle Product Downloads\Oracle Developer Suite\Windows\Patches\9i_designer_scm_9026\stage\Components\oracle.swd.jre\1.3.1.1.0c\1\DataFiles\Expanded\bin\java.dll
0x6D3C0000 - 0x6D3CD000      O:\Oracle Product Downloads\Oracle Developer Suite\Windows\Patches\9i_designer_scm_9026\stage\Components\oracle.swd.jre\1.3.1.1.0c\1\DataFiles\Expanded\bin\zip.dll
0x6D020000 - 0x6D128000      O:\Oracle Product Downloads\Oracle Developer Suite\Windows\Patches\9i_designer_scm_9026\stage\Components\oracle.swd.jre\1.3.1.1.0c\1\DataFiles\Expanded\bin\awt.dll
0x73000000 - 0x73023000      C:\WINDOWS\System32\WINSPOOL.DRV
0x76390000 - 0x763AC000      C:\WINDOWS\System32\IMM32.dll
0x771B0000 - 0x772D1000      C:\WINDOWS\system32\ole32.dll
0x6D1E0000 - 0x6D21B000      O:\Oracle Product Downloads\Oracle Developer Suite\Windows\Patches\9i_designer_scm_9026\stage\Components\oracle.swd.jre\1.3.1.1.0c\1\DataFiles\Expanded\bin\fontmanager.dll
0x5ED00000 - 0x5EDC6000      C:\WINDOWS\System32\OPENGL32.dll
0x68B20000 - 0x68B3E000      C:\WINDOWS\System32\GLU32.dll
0x51000000 - 0x51047000      C:\WINDOWS\System32\DDRAW.dll
0x73BC0000 - 0x73BC6000      C:\WINDOWS\System32\DCIMAN32.dll
0x10000000 - 0x101CA000      C:\WINDOWS\System32\ialmgicd.dll
0x0FDB0000 - 0x0FDE0000      C:\WINDOWS\System32\ialmgdev.dll
0x74720000 - 0x74764000      C:\WINDOWS\System32\MSCTF.dll
0x0FF10000 - 0x0FF2F000      C:\WINDOWS\System32\SHW95DLL.DLL
0x0FFB0000 - 0x0FFF1000      C:\WINDOWS\system32\WOW32.dll
0x75F40000 - 0x75F5F000      C:\WINDOWS\system32\appHelp.dll
0x773D0000 - 0x77BC2000      C:\WINDOWS\system32\SHELL32.dll
0x63180000 - 0x631E5000      C:\WINDOWS\system32\SHLWAPI.dll
0x181D0000 - 0x18271000      C:\WINDOWS\System32\ntvdm.exe
0x763B0000 - 0x763F5000      C:\WINDOWS\system32\comdlg32.dll
0x77340000 - 0x773CB000      C:\WINDOWS\system32\COMCTL32.dll
0x77C00000 - 0x77C07000      C:\WINDOWS\system32\VERSION.dll
0x75A70000 - 0x75B15000      C:\WINDOWS\system32\USERENV.dll
0x71950000 - 0x71A34000      C:\WINDOWS\WinSxS\x86_Microsoft.Windows.Common-Controls_6595b64144ccf1df_6.0.10.0_x-ww_f7fb5805\comctl32.dll
0x5B430000 - 0x5B440000      C:\WINDOWS\System32\tsappcmp.dll
0x0FF80000 - 0x0FF9E000      O:\Oracle Product Downloads\Oracle Developer Suite\Windows\Patches\9i_designer_scm_9026\stage\Components\oracle.swd.jre\1.3.1.1.0c\1\DataFiles\Expanded\bin\JavaAccessBridge.dll
0x6D2C0000 - 0x6D2DB000      O:\Oracle Product Downloads\Oracle Developer Suite\Windows\Patches\9i_designer_scm_9026\stage\Components\oracle.swd.jre\1.3.1.1.0c\1\DataFiles\Expanded\bin\jpeg.dll
0x189D0000 - 0x189E4000      O:\Oracle Product Downloads\Oracle Developer Suite\Windows\Patches\9i_designer_scm_9026\stage\Components\oracle.swd.oui.core\2.3.0.2.0\1\DataFiles\Expanded\lib\win32\oraInstaller.dll
0x76C90000 - 0x76CB2000      C:\WINDOWS\system32\imagehlp.dll
0x6D510000 - 0x6D58D000      C:\WINDOWS\system32\DBGHELP.dll
0x76BF0000 - 0x76BFB000      C:\WINDOWS\System32\PSAPI.DLL
Local Time = Wed Nov 05 19:27:05 2003
Elapsed Time = 44
# The exception above was detected in native code outside the VM
# Java VM: Java HotSpot(TM) Client VM (1.3.1_01 mixed mode)
Please help!
Thanks,
Vincent Scorsone
Phone: 504-908-1087
Email: [email protected]

What exactly do you want to do with Designer? You need to install the Designer repository in a Oracle database before you can use Designer.
I suggest that you read the Repository Installation Guide (installed with the product or on OTN) and then go through the Designer Tutorial on OTN (http://www.oracle.com/technology/products/designer/9i_collateral.htm#tut) to understand some Designer concepts.

Similar Messages

  • Error installing Oracle Designer/SCM Release 9.0.2.6 patch

    Hi.
    I am trying to install Oracle Designer/SCM Release 9.0.2.6 patch. I've already installed Oracle 9i Forms and Reports 9.0.2.1.0 (patch 2705870) and 9.0.2.3.0 (patch 3129219). The Oracle Installer version is 2.2.0.18.0, but when I try to install Designer/SCM Release 9.0.2.6.0, which uses Oracle Installer version is 2.3.0.0.0, I get the following error in my hs_err log file:
    An unexpected exception has been detected in native code outside the VM.
    Unexpected Signal : EXCEPTION_ACCESS_VIOLATION occurred at PC=0xff12ed8
    Function name=CallWndProcFunc
    Library=C:\WINDOWS\System32\SHW95DLL.DLL
    Current Java thread:
         at sun.awt.windows.WToolkit.eventLoop(Native Method)
         at sun.awt.windows.WToolkit.run(Unknown Source)
         at java.lang.Thread.run(Unknown Source)
    Dynamic libraries:
    0x00400000 - 0x00405000      O:\Oracle Product Downloads\Oracle Developer Suite\Windows\Patches\9i_designer_scm_9026\stage\Components\oracle.swd.jre\1.3.1.1.0c\1\DataFiles\Expanded\bin\javaw.exe
    0x77F50000 - 0x77FF7000      C:\WINDOWS\System32\ntdll.dll
    0x77E60000 - 0x77F46000      C:\WINDOWS\system32\kernel32.dll
    0x77DD0000 - 0x77E5D000      C:\WINDOWS\system32\ADVAPI32.dll
    0x78000000 - 0x78086000      C:\WINDOWS\system32\RPCRT4.dll
    0x77D40000 - 0x77DCC000      C:\WINDOWS\system32\USER32.dll
    0x77C70000 - 0x77CB0000      C:\WINDOWS\system32\GDI32.dll
    0x77C10000 - 0x77C63000      C:\WINDOWS\system32\MSVCRT.dll
    0x6D420000 - 0x6D4EE000      O:\Oracle Product Downloads\Oracle Developer Suite\Windows\Patches\9i_designer_scm_9026\stage\Components\oracle.swd.jre\1.3.1.1.0c\1\DataFiles\Expanded\bin\hotspot\jvm.dll
    0x76B40000 - 0x76B6C000      C:\WINDOWS\System32\WINMM.dll
    0x6D220000 - 0x6D227000      O:\Oracle Product Downloads\Oracle Developer Suite\Windows\Patches\9i_designer_scm_9026\stage\Components\oracle.swd.jre\1.3.1.1.0c\1\DataFiles\Expanded\bin\hpi.dll
    0x6D3B0000 - 0x6D3BD000      O:\Oracle Product Downloads\Oracle Developer Suite\Windows\Patches\9i_designer_scm_9026\stage\Components\oracle.swd.jre\1.3.1.1.0c\1\DataFiles\Expanded\bin\verify.dll
    0x6D250000 - 0x6D266000      O:\Oracle Product Downloads\Oracle Developer Suite\Windows\Patches\9i_designer_scm_9026\stage\Components\oracle.swd.jre\1.3.1.1.0c\1\DataFiles\Expanded\bin\java.dll
    0x6D3C0000 - 0x6D3CD000      O:\Oracle Product Downloads\Oracle Developer Suite\Windows\Patches\9i_designer_scm_9026\stage\Components\oracle.swd.jre\1.3.1.1.0c\1\DataFiles\Expanded\bin\zip.dll
    0x6D020000 - 0x6D128000      O:\Oracle Product Downloads\Oracle Developer Suite\Windows\Patches\9i_designer_scm_9026\stage\Components\oracle.swd.jre\1.3.1.1.0c\1\DataFiles\Expanded\bin\awt.dll
    0x73000000 - 0x73023000      C:\WINDOWS\System32\WINSPOOL.DRV
    0x76390000 - 0x763AC000      C:\WINDOWS\System32\IMM32.dll
    0x771B0000 - 0x772D1000      C:\WINDOWS\system32\ole32.dll
    0x6D1E0000 - 0x6D21B000      O:\Oracle Product Downloads\Oracle Developer Suite\Windows\Patches\9i_designer_scm_9026\stage\Components\oracle.swd.jre\1.3.1.1.0c\1\DataFiles\Expanded\bin\fontmanager.dll
    0x5ED00000 - 0x5EDC6000      C:\WINDOWS\System32\OPENGL32.dll
    0x68B20000 - 0x68B3E000      C:\WINDOWS\System32\GLU32.dll
    0x51000000 - 0x51047000      C:\WINDOWS\System32\DDRAW.dll
    0x73BC0000 - 0x73BC6000      C:\WINDOWS\System32\DCIMAN32.dll
    0x10000000 - 0x101CA000      C:\WINDOWS\System32\ialmgicd.dll
    0x0FDB0000 - 0x0FDE0000      C:\WINDOWS\System32\ialmgdev.dll
    0x74720000 - 0x74764000      C:\WINDOWS\System32\MSCTF.dll
    0x0FF10000 - 0x0FF2F000      C:\WINDOWS\System32\SHW95DLL.DLL
    0x0FFB0000 - 0x0FFF1000      C:\WINDOWS\system32\WOW32.dll
    0x75F40000 - 0x75F5F000      C:\WINDOWS\system32\appHelp.dll
    0x773D0000 - 0x77BC2000      C:\WINDOWS\system32\SHELL32.dll
    0x63180000 - 0x631E5000      C:\WINDOWS\system32\SHLWAPI.dll
    0x181D0000 - 0x18271000      C:\WINDOWS\System32\ntvdm.exe
    0x763B0000 - 0x763F5000      C:\WINDOWS\system32\comdlg32.dll
    0x77340000 - 0x773CB000      C:\WINDOWS\system32\COMCTL32.dll
    0x77C00000 - 0x77C07000      C:\WINDOWS\system32\VERSION.dll
    0x75A70000 - 0x75B15000      C:\WINDOWS\system32\USERENV.dll
    0x71950000 - 0x71A34000      C:\WINDOWS\WinSxS\x86_Microsoft.Windows.Common-Controls_6595b64144ccf1df_6.0.10.0_x-ww_f7fb5805\comctl32.dll
    0x5B430000 - 0x5B440000      C:\WINDOWS\System32\tsappcmp.dll
    0x0FF80000 - 0x0FF9E000      O:\Oracle Product Downloads\Oracle Developer Suite\Windows\Patches\9i_designer_scm_9026\stage\Components\oracle.swd.jre\1.3.1.1.0c\1\DataFiles\Expanded\bin\JavaAccessBridge.dll
    0x6D2C0000 - 0x6D2DB000      O:\Oracle Product Downloads\Oracle Developer Suite\Windows\Patches\9i_designer_scm_9026\stage\Components\oracle.swd.jre\1.3.1.1.0c\1\DataFiles\Expanded\bin\jpeg.dll
    0x189D0000 - 0x189E4000      O:\Oracle Product Downloads\Oracle Developer Suite\Windows\Patches\9i_designer_scm_9026\stage\Components\oracle.swd.oui.core\2.3.0.2.0\1\DataFiles\Expanded\lib\win32\oraInstaller.dll
    0x76C90000 - 0x76CB2000      C:\WINDOWS\system32\imagehlp.dll
    0x6D510000 - 0x6D58D000      C:\WINDOWS\system32\DBGHELP.dll
    0x76BF0000 - 0x76BFB000      C:\WINDOWS\System32\PSAPI.DLL
    Local Time = Wed Nov 05 19:27:05 2003
    Elapsed Time = 44
    # The exception above was detected in native code outside the VM
    # Java VM: Java HotSpot(TM) Client VM (1.3.1_01 mixed mode)
    Please help!
    Thanks,
    Vincent Scorsone
    Phone: 504-908-1087
    Email: [email protected]

    What exactly do you want to do with Designer? You need to install the Designer repository in a Oracle database before you can use Designer.
    I suggest that you read the Repository Installation Guide (installed with the product or on OTN) and then go through the Designer Tutorial on OTN (http://www.oracle.com/technology/products/designer/9i_collateral.htm#tut) to understand some Designer concepts.

  • Errors when installing Oracle Client 10.2.0.2.0 on zLinux (Red Hat)

    I am receiving errors when installing Oracle Client 10.2.0.2.0 (Administrator) on zLinux. During the install I receive two notifications for File Not Found when the installer tries to create the link for lib32/libclntsh.so.10.1. I hit ignore on the pop-ups and the install completes. The Oracle Net Configuration Assistant then fails to launch with the following error:
    Output generated from configuration assistant "Oracle Net Configuration Assistant":
    Command = /opt/oracle/product/10.2.0/db_1/bin/netca /orahome /opt/oracle/product/10.2.0/db_1 /orahnam Oracle_home /instype custom /inscomp client,oraclenet,ano /insprtcl tcp /cfg local /authadp NO_VALUE /nodeinfo NO_VALUE /responseFile /opt/oracle/product/10.2.0/db_1/network/install/netca_clt.rsp
    UnsatisfiedLinkError exception loading native library: njni10
    Configuration assistant "Oracle Net Configuration Assistant" failed
    The "/opt/oracle/product/10.2.0/db_1/cfgtoollogs/configToolFailedCommands" script contains all commands that failed, were skipped or were cancelled. This file may be used to run these configuration assistants outside of OUI. Note that you may have to update this script with passwords (if any) before executing the same.
    I have seen multiple threads relating to very similar errors, but none of the fixes that were suggested have worked. I have double checked the required Red Hat packages and made sure they were all installed on the server. All of the prerequisite checks for the installer are successful. Any assistance would be of most helpful!

    Worked with my Linux system admin and figured out that we were indeed missing some packages. There are 390 and 390x rpm's for Red Hat on System Z, i.e. 64 bit and 32 bit versions. Since we are running a 64 bit os some of those 32 bit packages did not get installed. Since our roles are split up, I am kind of blind as to the OS setup so I was not able to catch the problem. It is truly puzzling as to why Oracle would need 32 bit packages even though Oracle client is 64 bit. Regardless, after adding the 32 bit rpm's the installer was able to perform the linking operation that was failing, and the network configuration script ran successfully.

  • Error after installing Oracle Enterprise Linux (Release 5) on Dell T 110

    eth0      Link encap:Ethernet  HWaddr 00:15:17:F7:81:53 
              inet addr:192.1.1.11  Bcast:192.1.1.255  Mask:255.255.255.0
              inet6 addr: fe80::215:17ff:fef7:8153/64 Scope:Link
              UP BROADCAST RUNNING MULTICAST  MTU:1500  Metric:1
              RX packets:0 errors:0 dropped:0 overruns:0 frame:0
              TX packets:220 errors:0 dropped:0 overruns:0 carrier:0
              collisions:0 txqueuelen:100
              RX bytes:0 (0.0 b)  TX bytes:15868 (15.4 KiB)
              Memory:dfcc0000-dfce0000
    eth1      Link encap:Ethernet  HWaddr B8:AC:6F:92:C2:0C 
              inet addr:192.1.1.9  Bcast:192.1.1.255  Mask:255.255.255.0
              inet6 addr: fe80::baac:6fff:fe92:c20c/64 Scope:Link
              UP BROADCAST RUNNING MULTICAST  MTU:1500  Metric:1
              RX packets:263812 errors:0 dropped:0 overruns:0 frame:0
              TX packets:58 errors:0 dropped:0 overruns:0 carrier:0
              collisions:0 txqueuelen:1000
              RX bytes:18959341 (18.0 MiB)  TX bytes:9476 (9.2 KiB)
              Interrupt:169 Memory:dfbf0000-dfc00000
    lo        Link encap:Local Loopback 
              inet addr:127.0.0.1  Mask:255.0.0.0
              inet6 addr: ::1/128 Scope:Host
              UP LOOPBACK RUNNING  MTU:16436  Metric:1
              RX packets:1393 errors:0 dropped:0 overruns:0 frame:0
              TX packets:1393 errors:0 dropped:0 overruns:0 carrier:0
              collisions:0 txqueuelen:0
              RX bytes:4035655 (3.8 MiB)  TX bytes:4035655 (3.8 MiB)Any help please. I am a first time Linux user.
    Thanks
    A/A

    This looks like a follow up of Re: Error after installing Oracle Enterprise Linux (Release 5) on Dell T 110
    Can you give more details what you are trying to do or trying to accomplish. Where are you trying to ping to?
    It could be that you have not defined your gateway or DNS server for name to IP mapping. What is the output of
    # netstat -rn
    # cat /etc/resolv.conf

  • Gives  ORA-12560: TNS: protocol adapter error when installing oracle 10g

    I tried to install oracle 10g r2 in server 2008. but it gives ORA-12560: TNS: protocol adapter error when installing. how I can fix this issue??? please help me ASAP. because its urgent.
    thanks in advance.
    chamara

    Welcome to the forums !
    Pl indicate which version of 10g you are installing and on which version of Win 2008. Neither 10gR1 nor 10gR2 are certified to be installed on Win 2008 R1, AFAIK.
    For 10gR2, only 10.2.0.5 is certified for Win 2008 R2 - see MOS Doc 1173433.1 (How to Install Oracle 10.2.0.5 on MS Windows 7 / Windows 2008R2)
    Also see MOS Doc 740926.1 (Where can I find the Database / Client software to download for Microsoft Vista, or Windows 2008R1?).
    Both 10gR1 and 10gR2 are now in extended support - is there a reason you are not using 11gR2 ?
    HTH
    Srini

  • Root.sh failed throws error when installing Oracle Grid Infrastructure 11.2

    Hi,
    root.sh failed with the following error when installing / configuring the oracle grid infrastructure version 11.2.0.1 for standalone on RHEL 6
    Now product-specific root actions will be performed.
    2011-10-10 11:46:55: Checking for super user privileges
    2011-10-10 11:46:55: User has super user privileges
    2011-10-10 11:46:55: Parsing the host name
    Using configuration parameter file: /apps/opt/oracle_infra/crs/install/crsconfig_params
    Creating trace directory
    LOCAL ADD MODE
    Creating OCR keys for user 'oracle', privgrp 'oinstall'..
    Operation successful.
    CRS-4664: Node vmhost1 successfully pinned.
    Adding daemon to inittab
    CRS-4124: Oracle High Availability Services startup failed.
    CRS-4000: Command Start failed, or completed with errors.
    ohasd failed to start: Inappropriate ioctl for device
    ohasd failed to start: Inappropriate ioctl for device at /apps/opt/oracle_infra/crs/install/roothas.pl line 296.
    I followed the steps / solution provided in the ID 1069182.1. But no use.
    Are there any workaround?
    Thanks
    -KarthicK
    Edited by: user11984375 on Oct 10, 2011 7:06 AM

    Check the logfiles under $GRID_HOME/log/<node_name>/cssd/
    I had seen the same problem and the following resolved the problem for me.
    [[email protected] ~]# rm -f /usr/tmp/.oracle/* /tmp/.oracle/* /var/tmp/.oracle/*
    [[email protected] ~]# > $ORA_CRS_HOME/log/<node_name>/cssd/<node_name>.pid
    HTH,
    Raj Mareddi
    http://www.freeoraclehelp.com

  • Borland VisiBroker for java meet error when Installed Oracle 8i(V8.1.6)

    Oracle modified some register key value of Java Runtime
    Evironment which result in Java2IDL.exe's runninng error. I
    fixed the value in /software/javasoft/java runtime environment
    and reset the currentversion key to 1.3. Oralce use jre1.1.7.
    Can oracle meet errors when change it to sun jre1.3.1? May
    upgrade oracle jre1.1.7 to high version ? Tell me how to. Please
    tell me where to download If Oracle can't use Sun JRE1.3 . How
    can I deal with this problem and let VisiBroker for java and
    VisiBroker for C++ work well?
    Best Regards

    Hi,
    I am not aware of a sqlplus v8 for macosx so the nonexistence of it might be your problem. The way I remember it, there are sqlnet libs that are usable from other apps. What you could do is install the v9.2 developers release. This contains sqlplus and in that case just make sure the directory containing sqlplus is in your PATH (you also need a few other environment variables; they are set in DBENV).
    Ronald.
    http://ronr.nl/unix-dba

  • Error when installing oracle 10g on OEL4..(oracle enterprise linux )

    Hi everyone,
    i am getting this error when i run ./runInstaller
    [[email protected] database]$ ./runInstaller
    ./runInstaller: line 52: /root/Desktop/10201_database_linux32/database/install/.oui: Permission denied
    But it has all the permissions (read,write,execute) for owner,groups,others.Do i have to give any more permissions.
    File owner of that file : oracle
    file group: oinstall
    i used the following commands when i created the groups.
    /usr/bin/groupadd oinstall
    /usr/bin/groupadd dba
    /usr/bin/ useradd-m-g oinstall -G dba oracle
    what more permissions do i have to give to that ./runInstaller.
    please helpme
    sandeep

    hi everyone,
    Please help me.I am not able to figure out what am i doing wrong.I am getting the permission denied error when i am running the ./runinstaller.But it has all the read,write execute permissions
    [[email protected] ~]# ls -ltr
    total 120
    -rw-r--r-- 1 root root 32283 Jan 3 18:36 install.log.syslog
    -rw-r--r-- 1 root root 57519 Jan 3 18:36 install.log
    -rw-r--r-- 1 root root 1446 Jan 3 18:36 anaconda-ks.cfg
    drwxrwxrwx 3 oracle oinstall 4096 Jan 3 21:40 Desktop
    [[email protected] ~]# su oracle
    [[email protected] root]$ ls -ltr
    ls: .: Permission denied
    [[email protected] root]$ cd Desktop
    bash: cd: Desktop: Permission denied
    [[email protected] root]$ exit
    [[email protected] ~]# cd Desktop
    [[email protected] Desktop]# su oracle
    [[email protected] Desktop]$ ls
    10201_database_linux32
    [[email protected] Desktop]$ ls -ltr
    total 8
    drwxrwxrwx 3 oracle oinstall 4096 Jan 3 21:38 10201_database_linux32
    [[email protected] Desktop]$ cd 10201_database_linux32/
    [[email protected] 10201_database_linux32]$ cd database/
    [[email protected] database]$ ls -ltr
    total 52
    drwxrwxrwx 9 oracle oinstall 4096 Jan 3 21:38 doc
    -rwxrwxrwx 1 oracle oinstall 1327 Jan 3 21:38 runInstaller
    drwxrwxrwx 2 oracle oinstall 4096 Jan 3 21:38 response
    drwxrwxrwx 5 oracle oinstall 4096 Jan 3 21:38 install
    -rwxrwxrwx 1 oracle oinstall 5213 Jan 3 21:40 welcome.html
    drwxrwxrwx 9 oracle oinstall 4096 Jan 3 21:40 stage
    [[email protected] database]$ ./runInstaller
    ./runInstaller: line 52: /root/Desktop/10201_database_linux32/database/install/.oui: Permission denied
    Please tell me what shall i do to run the installer.pleaseeeeee
    thanks
    sandeep

  • Receiving javaw.exe error when Installing Oracle SOA Suite 10.1.3.1.0

    Hello,
    I am installing Oracle SOA suite for Windows 10.1.3.1.0 and when it reaches 12% complete I receive the following error:
    Error signature:
    App Name: javaw.exe
    AppVer: 0.0.0.0
    ModName: easfa.dll
    ModVer: 6.0.0.7
    Offset: 0001c799
    error report shows:
    <?xml version="1.0" encoding="UTF-16"?>
    <DATABASE>
    <EXE NAME="javaw.exe" FILTER="GRABMI_FILTER_PRIVACY">
    <MATCHING_FILE NAME="awt.dll" SIZE="970862" CHECKSUM="0xD246DAA6" MODULE_TYPE="WIN32" PE_CHECKSUM="0x0" LINKER_VERSION="0x0" LINK_DATE="02/23/2004 07:10:19" UPTO_LINK_DATE="02/23/2004 07:10:19" />
    <MATCHING_FILE NAME="axbridge.dll" SIZE="94323" CHECKSUM="0xC85525D4" BIN_FILE_VERSION="1.4.2.40" BIN_PRODUCT_VERSION="1.4.2.40" PRODUCT_VERSION="1, 4, 2, 40" FILE_DESCRIPTION="ActiveX bridge for JavaBeans" COMPANY_NAME="JavaSoft / Sun Microsystems" PRODUCT_NAME="JavaSoft / Sun Microsystems -- ActiveX bridge" FILE_VERSION="1, 4, 2, 40" ORIGINAL_FILENAME="axbridge.dll" INTERNAL_NAME="ActiveX bridge for JavaBeans" LEGAL_COPYRIGHT="Copyright ¨ 2002" VERFILEDATEHI="0x0" VERFILEDATELO="0x0" VERFILEOS="0x40004" VERFILETYPE="0x1" MODULE_TYPE="WIN32" PE_CHECKSUM="0x26F3C" LINKER_VERSION="0x0" UPTO_BIN_FILE_VERSION="1.4.2.40" UPTO_BIN_PRODUCT_VERSION="1.4.2.40" LINK_DATE="02/23/2004 07:44:39" UPTO_LINK_DATE="02/23/2004 07:44:39" VER_LANGUAGE="English (United States) [0x409]" />
    <MATCHING_FILE NAME="cmm.dll" SIZE="139374" CHECKSUM="0x2266351B" MODULE_TYPE="WIN32" PE_CHECKSUM="0x0" LINKER_VERSION="0x0" LINK_DATE="02/23/2004 07:17:38" UPTO_LINK_DATE="02/23/2004 07:17:38" />
    <MATCHING_FILE NAME="dcpr.dll" SIZE="139375" CHECKSUM="0x53CE32F4" MODULE_TYPE="WIN32" PE_CHECKSUM="0x0" LINKER_VERSION="0x0" LINK_DATE="02/23/2004 07:13:42" UPTO_LINK_DATE="02/23/2004 07:13:42" />
    <MATCHING_FILE NAME="dt_shmem.dll" SIZE="24689" CHECKSUM="0xBA0CE08A" MODULE_TYPE="WIN32" PE_CHECKSUM="0x0" LINKER_VERSION="0x0" LINK_DATE="02/23/2004 07:24:02" UPTO_LINK_DATE="02/23/2004 07:24:02" />
    <MATCHING_FILE NAME="dt_socket.dll" SIZE="20595" CHECKSUM="0x9953B1F5" MODULE_TYPE="WIN32" PE_CHECKSUM="0x0" LINKER_VERSION="0x0" LINK_DATE="02/23/2004 07:23:58" UPTO_LINK_DATE="02/23/2004 07:23:58" />
    <MATCHING_FILE NAME="eula.dll" SIZE="61547" CHECKSUM="0x5D7B76F2" BIN_FILE_VERSION="1.4.2.40" BIN_PRODUCT_VERSION="1.4.2.40" PRODUCT_VERSION="1, 4, 2, 40" FILE_DESCRIPTION="EULA Module" COMPANY_NAME="Sun Microsystems, Inc." PRODUCT_NAME="EULA Module" FILE_VERSION="1, 4, 2, 40" ORIGINAL_FILENAME="EULA.EXE" INTERNAL_NAME="EULA" LEGAL_COPYRIGHT="Copyright 2004" VERFILEDATEHI="0x0" VERFILEDATELO="0x0" VERFILEOS="0x4" VERFILETYPE="0x1" MODULE_TYPE="WIN32" PE_CHECKSUM="0x10601" LINKER_VERSION="0x0" UPTO_BIN_FILE_VERSION="1.4.2.40" UPTO_BIN_PRODUCT_VERSION="1.4.2.40" LINK_DATE="02/23/2004 07:44:40" UPTO_LINK_DATE="02/23/2004 07:44:40" VER_LANGUAGE="English (United States) [0x409]" />
    <MATCHING_FILE NAME="fontmanager.dll" SIZE="327811" CHECKSUM="0xB2640BE0" MODULE_TYPE="WIN32" PE_CHECKSUM="0x0" LINKER_VERSION="0x0" LINK_DATE="02/23/2004 07:15:12" UPTO_LINK_DATE="02/23/2004 07:15:12" />
    <MATCHING_FILE NAME="hpi.dll" SIZE="28791" CHECKSUM="0x53D12BF0" MODULE_TYPE="WIN32" PE_CHECKSUM="0x0" LINKER_VERSION="0x0" LINK_DATE="02/23/2004 06:48:59" UPTO_LINK_DATE="02/23/2004 06:48:59" />
    <MATCHING_FILE NAME="hprof.dll" SIZE="49258" CHECKSUM="0xD4D20CB5" MODULE_TYPE="WIN32" PE_CHECKSUM="0x0" LINKER_VERSION="0x0" LINK_DATE="02/23/2004 06:56:40" UPTO_LINK_DATE="02/23/2004 06:56:40" />
    <MATCHING_FILE NAME="ioser12.dll" SIZE="24715" CHECKSUM="0x87528955" MODULE_TYPE="WIN32" PE_CHECKSUM="0x0" LINKER_VERSION="0x0" LINK_DATE="02/23/2004 07:19:02" UPTO_LINK_DATE="02/23/2004 07:19:02" />
    <MATCHING_FILE NAME="jaas_nt.dll" SIZE="20611" CHECKSUM="0xDEC7F851" MODULE_TYPE="WIN32" PE_CHECKSUM="0x0" LINKER_VERSION="0x0" LINK_DATE="02/23/2004 07:21:11" UPTO_LINK_DATE="02/23/2004 07:21:11" />
    <MATCHING_FILE NAME="java.dll" SIZE="102515" CHECKSUM="0x430048F5" MODULE_TYPE="WIN32" PE_CHECKSUM="0x0" LINKER_VERSION="0x0" LINK_DATE="02/23/2004 06:52:13" UPTO_LINK_DATE="02/23/2004 06:52:13" />
    <MATCHING_FILE NAME="java.exe" SIZE="24681" CHECKSUM="0xBBA58998" MODULE_TYPE="WIN32" PE_CHECKSUM="0x0" LINKER_VERSION="0x0" LINK_DATE="02/23/2004 06:52:42" UPTO_LINK_DATE="02/23/2004 06:52:42" />
    <MATCHING_FILE NAME="JavaAccessBridge.dll" SIZE="167936" CHECKSUM="0x8CD46E23" BIN_FILE_VERSION="2.0.5.0" BIN_PRODUCT_VERSION="2.0.5.0" PRODUCT_VERSION="2, 0, 5, 0" FILE_DESCRIPTION="" COMPANY_NAME="Sun Microsystems©" PRODUCT_NAME="" FILE_VERSION="2, 0, 5, 0" ORIGINAL_FILENAME="" INTERNAL_NAME="Java Access Bridge for Windows" LEGAL_COPYRIGHT="Copyright © 2005" VERFILEDATEHI="0x0" VERFILEDATELO="0x0" VERFILEOS="0x40004" VERFILETYPE="0x2" MODULE_TYPE="WIN32" PE_CHECKSUM="0x0" LINKER_VERSION="0x0" UPTO_BIN_FILE_VERSION="2.0.5.0" UPTO_BIN_PRODUCT_VERSION="2.0.5.0" LINK_DATE="12/13/2005 21:49:52" UPTO_LINK_DATE="12/13/2005 21:49:52" VER_LANGUAGE="English (United States) [0x409]" />
    <MATCHING_FILE NAME="javaw.exe" SIZE="28779" CHECKSUM="0x38F4D914" MODULE_TYPE="WIN32" PE_CHECKSUM="0x0" LINKER_VERSION="0x0" LINK_DATE="02/23/2004 06:52:45" UPTO_LINK_DATE="02/23/2004 06:52:45" />
    <MATCHING_FILE NAME="jawt.dll" SIZE="20592" CHECKSUM="0x19F4C69C" MODULE_TYPE="WIN32" PE_CHECKSUM="0x0" LINKER_VERSION="0x0" LINK_DATE="02/23/2004 07:20:25" UPTO_LINK_DATE="02/23/2004 07:20:25" />
    <MATCHING_FILE NAME="JAWTAccessBridge.dll" SIZE="32768" CHECKSUM="0xBE0D6CC2" BIN_FILE_VERSION="2.0.5.0" BIN_PRODUCT_VERSION="2.0.5.0" PRODUCT_VERSION="2, 0, 5, 0" FILE_DESCRIPTION="" COMPANY_NAME="Sun Microsystems©" PRODUCT_NAME="" FILE_VERSION="2, 0, 5, 0" ORIGINAL_FILENAME="" INTERNAL_NAME="Java Access Bridge for Windows" LEGAL_COPYRIGHT="Copyright © 2005" VERFILEDATEHI="0x0" VERFILEDATELO="0x0" VERFILEOS="0x40004" VERFILETYPE="0x2" MODULE_TYPE="WIN32" PE_CHECKSUM="0x0" LINKER_VERSION="0x0" UPTO_BIN_FILE_VERSION="2.0.5.0" UPTO_BIN_PRODUCT_VERSION="2.0.5.0" LINK_DATE="12/13/2005 21:50:20" UPTO_LINK_DATE="12/13/2005 21:50:20" VER_LANGUAGE="English (United States) [0x409]" />
    <MATCHING_FILE NAME="jcov.dll" SIZE="61544" CHECKSUM="0x8DF4BDEA" MODULE_TYPE="WIN32" PE_CHECKSUM="0x0" LINKER_VERSION="0x0" LINK_DATE="02/23/2004 06:56:55" UPTO_LINK_DATE="02/23/2004 06:56:55" />
    <MATCHING_FILE NAME="JdbcOdbc.dll" SIZE="49278" CHECKSUM="0x1FBFA2DD" MODULE_TYPE="WIN32" PE_CHECKSUM="0x0" LINKER_VERSION="0x0" LINK_DATE="02/23/2004 07:19:53" UPTO_LINK_DATE="02/23/2004 07:19:53" />
    <MATCHING_FILE NAME="jdwp.dll" SIZE="102505" CHECKSUM="0xDC87EF89" MODULE_TYPE="WIN32" PE_CHECKSUM="0x0" LINKER_VERSION="0x0" LINK_DATE="02/23/2004 07:23:23" UPTO_LINK_DATE="02/23/2004 07:23:23" />
    <MATCHING_FILE NAME="jpeg.dll" SIZE="122992" CHECKSUM="0x914959B6" MODULE_TYPE="WIN32" PE_CHECKSUM="0x0" LINKER_VERSION="0x0" LINK_DATE="02/23/2004 07:16:39" UPTO_LINK_DATE="02/23/2004 07:16:39" />
    <MATCHING_FILE NAME="jpicom32.dll" SIZE="82035" CHECKSUM="0x73656165" BIN_FILE_VERSION="1.4.2.40" BIN_PRODUCT_VERSION="1.4.2.40" PRODUCT_VERSION="1, 4, 2, 40" FILE_DESCRIPTION="JPICom Module" COMPANY_NAME="" PRODUCT_NAME="JPICom Module" FILE_VERSION="1, 4, 2, 40" ORIGINAL_FILENAME="JPICom32.DLL" INTERNAL_NAME="JPICom" LEGAL_COPYRIGHT="Copyright 2002" VERFILEDATEHI="0x0" VERFILEDATELO="0x0" VERFILEOS="0x4" VERFILETYPE="0x2" MODULE_TYPE="WIN32" PE_CHECKSUM="0x21331" LINKER_VERSION="0x0" UPTO_BIN_FILE_VERSION="1.4.2.40" UPTO_BIN_PRODUCT_VERSION="1.4.2.40" LINK_DATE="02/23/2004 07:44:40" UPTO_LINK_DATE="02/23/2004 07:44:40" VER_LANGUAGE="English (United States) [0x409]" />
    <MATCHING_FILE NAME="jpicpl32.exe" SIZE="16501" CHECKSUM="0x2DE50014" MODULE_TYPE="WIN32" PE_CHECKSUM="0x0" LINKER_VERSION="0x0" LINK_DATE="02/23/2004 07:41:22" UPTO_LINK_DATE="02/23/2004 07:41:22" />
    <MATCHING_FILE NAME="jpiexp32.dll" SIZE="94323" CHECKSUM="0x9A3F923A" BIN_FILE_VERSION="1.4.2.40" BIN_PRODUCT_VERSION="1.4.2.40" PRODUCT_VERSION="1, 4, 2, 40" FILE_DESCRIPTION="Java Plug-in for Internet Explorer" COMPANY_NAME="JavaSoft / Sun Microsystems" PRODUCT_NAME="JavaSoft / Sun Microsystems -- Java(TM) Plug-in" FILE_VERSION="1, 4, 2, 40" ORIGINAL_FILENAME="jpiexpl.dll" INTERNAL_NAME="Java Plug-in for Internet Explorer" LEGAL_COPYRIGHT="Copyright © 2002" VERFILEDATEHI="0x0" VERFILEDATELO="0x0" VERFILEOS="0x40004" VERFILETYPE="0x1" MODULE_TYPE="WIN32" PE_CHECKSUM="0x229B7" LINKER_VERSION="0x0" UPTO_BIN_FILE_VERSION="1.4.2.40" UPTO_BIN_PRODUCT_VERSION="1.4.2.40" LINK_DATE="02/23/2004 07:44:40" UPTO_LINK_DATE="02/23/2004 07:44:40" VER_LANGUAGE="English (United States) [0x409]" />
    <MATCHING_FILE NAME="jpins4.dll" SIZE="28783" CHECKSUM="0x8EBE21E2" MODULE_TYPE="WIN32" PE_CHECKSUM="0xE9E3" LINKER_VERSION="0x0" LINK_DATE="02/23/2004 07:44:40" UPTO_LINK_DATE="02/23/2004 07:44:40" />
    <MATCHING_FILE NAME="jpins6.dll" SIZE="41071" CHECKSUM="0xC84B7483" MODULE_TYPE="WIN32" PE_CHECKSUM="0x17B3F" LINKER_VERSION="0x0" LINK_DATE="02/23/2004 07:44:40" UPTO_LINK_DATE="02/23/2004 07:44:40" />
    <MATCHING_FILE NAME="jpins7.dll" SIZE="45167" CHECKSUM="0x6C20A296" MODULE_TYPE="WIN32" PE_CHECKSUM="0x10318" LINKER_VERSION="0x0" LINK_DATE="02/23/2004 07:44:40" UPTO_LINK_DATE="02/23/2004 07:44:40" />
    <MATCHING_FILE NAME="jpinsp.dll" SIZE="86127" CHECKSUM="0x89FF19DE" BIN_FILE_VERSION="1.4.2.40" BIN_PRODUCT_VERSION="1.4.2.40" PRODUCT_VERSION="1, 4, 2, 40" FILE_DESCRIPTION="Java Plug-in 1.4.2_04 for Netscape Navigator (DLL Helper)" COMPANY_NAME="JavaSoft / Sun Microsystems, Inc." PRODUCT_NAME="Java Plug-in" FILE_VERSION="1, 4, 2, 40" ORIGINAL_FILENAME="JPINSP.dll" INTERNAL_NAME="Java Plug-in" LEGAL_COPYRIGHT="Copyright © 2000" VERFILEDATEHI="0x0" VERFILEDATELO="0x0" VERFILEOS="0x4" VERFILETYPE="0x2" MODULE_TYPE="WIN32" PE_CHECKSUM="0x20ABB" LINKER_VERSION="0x0" UPTO_BIN_FILE_VERSION="1.4.2.40" UPTO_BIN_PRODUCT_VERSION="1.4.2.40" LINK_DATE="02/23/2004 07:44:40" UPTO_LINK_DATE="02/23/2004 07:44:40" VER_LANGUAGE="English (United States) [0x409]" />
    <MATCHING_FILE NAME="jpishare.dll" SIZE="77939" CHECKSUM="0x5593E581" BIN_FILE_VERSION="1.4.2.40" BIN_PRODUCT_VERSION="1.4.2.40" PRODUCT_VERSION="1, 4, 2, 40" FILE_DESCRIPTION="Java Plug-in Share Module for Win32" COMPANY_NAME="" PRODUCT_NAME="Java Plug-in" FILE_VERSION="1, 4, 2, 40" ORIGINAL_FILENAME="jpishare.dll" INTERNAL_NAME="Java Plug-in Share Module" LEGAL_COPYRIGHT="Copyright 1999" VERFILEDATEHI="0x0" VERFILEDATELO="0x0" VERFILEOS="0x4" VERFILETYPE="0x2" MODULE_TYPE="WIN32" PE_CHECKSUM="0x19831" LINKER_VERSION="0x0" UPTO_BIN_FILE_VERSION="1.4.2.40" UPTO_BIN_PRODUCT_VERSION="1.4.2.40" LINK_DATE="02/23/2004 07:44:40" UPTO_LINK_DATE="02/23/2004 07:44:40" VER_LANGUAGE="English (United States) [0x409]" />
    <MATCHING_FILE NAME="jsound.dll" SIZE="143480" CHECKSUM="0x2A70C20E" MODULE_TYPE="WIN32" PE_CHECKSUM="0x0" LINKER_VERSION="0x0" LINK_DATE="02/23/2004 07:01:59" UPTO_LINK_DATE="02/23/2004 07:01:59" />
    <MATCHING_FILE NAME="jucheck.exe" SIZE="241777" CHECKSUM="0xEF8851CF" BIN_FILE_VERSION="1.0.0.1" BIN_PRODUCT_VERSION="1.0.0.1" PRODUCT_VERSION="1, 0, 0, 1" FILE_DESCRIPTION="UpdateChecker Module" COMPANY_NAME="" PRODUCT_NAME="UpdateChecker Module" FILE_VERSION="1, 0, 0, 1" ORIGINAL_FILENAME="UpdateChecker.EXE" INTERNAL_NAME="UpdateChecker" LEGAL_COPYRIGHT="Copyright 2002" VERFILEDATEHI="0x0" VERFILEDATELO="0x0" VERFILEOS="0x4" VERFILETYPE="0x1" MODULE_TYPE="WIN32" PE_CHECKSUM="0x0" LINKER_VERSION="0x0" UPTO_BIN_FILE_VERSION="1.0.0.1" UPTO_BIN_PRODUCT_VERSION="1.0.0.1" LINK_DATE="02/23/2004 07:38:02" UPTO_LINK_DATE="02/23/2004 07:38:02" VER_LANGUAGE="English (United States) [0x409]" />
    <MATCHING_FILE NAME="jusched.exe" SIZE="32881" CHECKSUM="0x281222A2" MODULE_TYPE="WIN32" PE_CHECKSUM="0x0" LINKER_VERSION="0x0" LINK_DATE="02/23/2004 07:38:19" UPTO_LINK_DATE="02/23/2004 07:38:19" />
    <MATCHING_FILE NAME="keytool.exe" SIZE="28801" CHECKSUM="0xB0D8769E" MODULE_TYPE="WIN32" PE_CHECKSUM="0x0" LINKER_VERSION="0x0" LINK_DATE="02/23/2004 07:05:54" UPTO_LINK_DATE="02/23/2004 07:05:54" />
    <MATCHING_FILE NAME="kinit.exe" SIZE="28797" CHECKSUM="0x48462D1E" MODULE_TYPE="WIN32" PE_CHECKSUM="0x0" LINKER_VERSION="0x0" LINK_DATE="02/23/2004 07:06:09" UPTO_LINK_DATE="02/23/2004 07:06:09" />
    <MATCHING_FILE NAME="klist.exe" SIZE="28797" CHECKSUM="0x48462D1E" MODULE_TYPE="WIN32" PE_CHECKSUM="0x0" LINKER_VERSION="0x0" LINK_DATE="02/23/2004 07:06:11" UPTO_LINK_DATE="02/23/2004 07:06:11" />
    <MATCHING_FILE NAME="ktab.exe" SIZE="28795" CHECKSUM="0x48462D1E" MODULE_TYPE="WIN32" PE_CHECKSUM="0x0" LINKER_VERSION="0x0" LINK_DATE="02/23/2004 07:06:14" UPTO_LINK_DATE="02/23/2004 07:06:14" />
    <MATCHING_FILE NAME="msvcrt.dll" SIZE="266293" CHECKSUM="0x498A2F29" BIN_FILE_VERSION="6.0.8337.0" BIN_PRODUCT_VERSION="6.0.8337.0" PRODUCT_VERSION="6.00.8337.0" FILE_DESCRIPTION="Microsoft (R) C Runtime Library" COMPANY_NAME="Microsoft Corporation" PRODUCT_NAME="Microsoft (R) Visual C++" FILE_VERSION="6.00.8337.0" ORIGINAL_FILENAME="MSVCRT.DLL" INTERNAL_NAME="MSVCRT.DLL" LEGAL_COPYRIGHT="Copyright (C) Microsoft Corp. 1981-1998" VERFILEDATEHI="0x0" VERFILEDATELO="0x0" VERFILEOS="0x40004" VERFILETYPE="0x2" MODULE_TYPE="WIN32" PE_CHECKSUM="0x4D249" LINKER_VERSION="0x0" UPTO_BIN_FILE_VERSION="6.0.8337.0" UPTO_BIN_PRODUCT_VERSION="6.0.8337.0" LINK_DATE="12/04/1998 01:03:22" UPTO_LINK_DATE="12/04/1998 01:03:22" VER_LANGUAGE="English (United States) [0x409]" />
    <MATCHING_FILE NAME="net.dll" SIZE="57455" CHECKSUM="0x936673B" MODULE_TYPE="WIN32" PE_CHECKSUM="0x0" LINKER_VERSION="0x0" LINK_DATE="02/23/2004 06:58:30" UPTO_LINK_DATE="02/23/2004 06:58:30" />
    <MATCHING_FILE NAME="nio.dll" SIZE="32880" CHECKSUM="0xF017F580" MODULE_TYPE="WIN32" PE_CHECKSUM="0x0" LINKER_VERSION="0x0" LINK_DATE="02/23/2004 06:58:53" UPTO_LINK_DATE="02/23/2004 06:58:53" />
    <MATCHING_FILE NAME="NPJava11.dll" SIZE="65647" CHECKSUM="0x47D4B285" BIN_FILE_VERSION="1.4.2.40" BIN_PRODUCT_VERSION="1.4.2.40" PRODUCT_VERSION="1, 4, 2, 40" FILE_DESCRIPTION="Java Plug-in 1.4.2_04 for Netscape Navigator (DLL Helper)" COMPANY_NAME="JavaSoft / Sun Microsystems, Inc." PRODUCT_NAME="Java Plug-in" FILE_VERSION="1, 4, 2, 40" ORIGINAL_FILENAME="NPJava11.dll" INTERNAL_NAME="Java Plug-in" LEGAL_COPYRIGHT="Copyright (c) 2001" VERFILEDATEHI="0x0" VERFILEDATELO="0x0" VERFILEOS="0x4" VERFILETYPE="0x2" MODULE_TYPE="WIN32" PE_CHECKSUM="0x1E378" LINKER_VERSION="0x0" UPTO_BIN_FILE_VERSION="1.4.2.40" UPTO_BIN_PRODUCT_VERSION="1.4.2.40" LINK_DATE="02/23/2004 07:44:41" UPTO_LINK_DATE="02/23/2004 07:44:41" VER_LANGUAGE="English (United States) [0x409]" />
    <MATCHING_FILE NAME="NPJava12.dll" SIZE="65647" CHECKSUM="0x60150606" BIN_FILE_VERSION="1.4.2.40" BIN_PRODUCT_VERSION="1.4.2.40" PRODUCT_VERSION="1, 4, 2, 40" FILE_DESCRIPTION="Java Plug-in 1.4.2_04 for Netscape Navigator (DLL Helper)" COMPANY_NAME="JavaSoft / Sun Microsystems, Inc." PRODUCT_NAME="Java Plug-in" FILE_VERSION="1, 4, 2, 40" ORIGINAL_FILENAME="NPJava12.dll" INTERNAL_NAME="Java Plug-in" LEGAL_COPYRIGHT="Copyright (c) 2001" VERFILEDATEHI="0x0" VERFILEDATELO="0x0" VERFILEOS="0x4" VERFILETYPE="0x2" MODULE_TYPE="WIN32" PE_CHECKSUM="0x167C0" LINKER_VERSION="0x0" UPTO_BIN_FILE_VERSION="1.4.2.40" UPTO_BIN_PRODUCT_VERSION="1.4.2.40" LINK_DATE="02/23/2004 07:44:41" UPTO_LINK_DATE="02/23/2004 07:44:41" VER_LANGUAGE="English (United States) [0x409]" />
    <MATCHING_FILE NAME="NPJava13.dll" SIZE="65647" CHECKSUM="0x8A155CB8" BIN_FILE_VERSION="1.4.2.40" BIN_PRODUCT_VERSION="1.4.2.40" PRODUCT_VERSION="1, 4, 2, 40" FILE_DESCRIPTION="Java Plug-in 1.4.2_04 for Netscape Navigator (DLL Helper)" COMPANY_NAME="JavaSoft / Sun Microsystems, Inc." PRODUCT_NAME="Java Plug-in" FILE_VERSION="1, 4, 2, 40" ORIGINAL_FILENAME="NPJava13.dll" INTERNAL_NAME="Java Plug-in" LEGAL_COPYRIGHT="Copyright (c) 2001" VERFILEDATEHI="0x0" VERFILEDATELO="0x0" VERFILEOS="0x4" VERFILETYPE="0x2" MODULE_TYPE="WIN32" PE_CHECKSUM="0x19ADF" LINKER_VERSION="0x0" UPTO_BIN_FILE_VERSION="1.4.2.40" UPTO_BIN_PRODUCT_VERSION="1.4.2.40" LINK_DATE="02/23/2004 07:44:41" UPTO_LINK_DATE="02/23/2004 07:44:41" VER_LANGUAGE="English (United States) [0x409]" />
    <MATCHING_FILE NAME="NPJava14.dll" SIZE="65647" CHECKSUM="0x2D559CB6" BIN_FILE_VERSION="1.4.2.40" BIN_PRODUCT_VERSION="1.4.2.40" PRODUCT_VERSION="1, 4, 2, 40" FILE_DESCRIPTION="Java Plug-in 1.4.2_04 for Netscape Navigator (DLL Helper)" COMPANY_NAME="JavaSoft / Sun Microsystems, Inc." PRODUCT_NAME="Java Plug-in" FILE_VERSION="1, 4, 2, 40" ORIGINAL_FILENAME="NPJava14.dll" INTERNAL_NAME="Java Plug-in" LEGAL_COPYRIGHT="Copyright (c) 2001" VERFILEDATEHI="0x0" VERFILEDATELO="0x0" VERFILEOS="0x4" VERFILETYPE="0x2" MODULE_TYPE="WIN32" PE_CHECKSUM="0x14890" LINKER_VERSION="0x0" UPTO_BIN_FILE_VERSION="1.4.2.40" UPTO_BIN_PRODUCT_VERSION="1.4.2.40" LINK_DATE="02/23/2004 07:44:41" UPTO_LINK_DATE="02/23/2004 07:44:41" VER_LANGUAGE="English (United States) [0x409]" />
    <MATCHING_FILE NAME="NPJava32.dll" SIZE="65647" CHECKSUM="0xE55D102" BIN_FILE_VERSION="1.4.2.40" BIN_PRODUCT_VERSION="1.4.2.40" PRODUCT_VERSION="1, 4, 2, 40" FILE_DESCRIPTION="Java Plug-in 1.4.2_04 for Netscape Navigator (DLL Helper)" COMPANY_NAME="JavaSoft / Sun Microsystems, Inc." PRODUCT_NAME="Java Plug-in" FILE_VERSION="1, 4, 2, 40" ORIGINAL_FILENAME="NPJava32.dll" INTERNAL_NAME="Java Plug-in" LEGAL_COPYRIGHT="Copyright (c) 2001" VERFILEDATEHI="0x0" VERFILEDATELO="0x0" VERFILEOS="0x4" VERFILETYPE="0x2" MODULE_TYPE="WIN32" PE_CHECKSUM="0x1FAEC" LINKER_VERSION="0x0" UPTO_BIN_FILE_VERSION="1.4.2.40" UPTO_BIN_PRODUCT_VERSION="1.4.2.40" LINK_DATE="02/23/2004 07:44:41" UPTO_LINK_DATE="02/23/2004 07:44:41" VER_LANGUAGE="English (United States) [0x409]" />
    <MATCHING_FILE NAME="NPJPI142_04.dll" SIZE="65650" CHECKSUM="0xEB161C45" BIN_FILE_VERSION="1.4.2.40" BIN_PRODUCT_VERSION="1.4.2.40" PRODUCT_VERSION="1, 4, 2, 40" FILE_DESCRIPTION="Java Plug-in 1.4.2_04 for Netscape Navigator (DLL Helper)" COMPANY_NAME="JavaSoft / Sun Microsystems, Inc." PRODUCT_NAME="Java Plug-in" FILE_VERSION="1, 4, 2, 40" ORIGINAL_FILENAME="NPJPI&quot;142_04&quot;.dll" INTERNAL_NAME="Java Plug-in" LEGAL_COPYRIGHT="Copyright (c) 2001" VERFILEDATEHI="0x0" VERFILEDATELO="0x0" VERFILEOS="0x4" VERFILETYPE="0x2" MODULE_TYPE="WIN32" PE_CHECKSUM="0x14DBE" LINKER_VERSION="0x0" UPTO_BIN_FILE_VERSION="1.4.2.40" UPTO_BIN_PRODUCT_VERSION="1.4.2.40" LINK_DATE="02/23/2004 07:44:41" UPTO_LINK_DATE="02/23/2004 07:44:41" VER_LANGUAGE="English (United States) [0x409]" />
    <MATCHING_FILE NAME="NPOJI610.dll" SIZE="65647" CHECKSUM="0x4B96463F" BIN_FILE_VERSION="1.4.2.40" BIN_PRODUCT_VERSION="1.4.2.40" PRODUCT_VERSION="1, 4, 2, 40" FILE_DESCRIPTION="Java Plug-in 1.4.2_04 for Netscape Navigator (DLL Helper)" COMPANY_NAME="JavaSoft / Sun Microsystems, Inc." PRODUCT_NAME="Java Plug-in" FILE_VERSION="1, 4, 2, 40" ORIGINAL_FILENAME="NPOJI610.dll" INTERNAL_NAME="Java Plug-in" LEGAL_COPYRIGHT="Copyright ¨ 2001" VERFILEDATEHI="0x0" VERFILEDATELO="0x0" VERFILEOS="0x4" VERFILETYPE="0x2" MODULE_TYPE="WIN32" PE_CHECKSUM="0x130F8" LINKER_VERSION="0x0" UPTO_BIN_FILE_VERSION="1.4.2.40" UPTO_BIN_PRODUCT_VERSION="1.4.2.40" LINK_DATE="02/23/2004 07:44:41" UPTO_LINK_DATE="02/23/2004 07:44:41" VER_LANGUAGE="English (United States) [0x409]" />
    <MATCHING_FILE NAME="orbd.exe" SIZE="28820" CHECKSUM="0x7A2E72A3" MODULE_TYPE="WIN32" PE_CHECKSUM="0x0" LINKER_VERSION="0x0" LINK_DATE="02/23/2004 07:22:26" UPTO_LINK_DATE="02/23/2004 07:22:26" />
    <MATCHING_FILE NAME="policytool.exe" SIZE="28807" CHECKSUM="0x6DDA7373" MODULE_TYPE="WIN32" PE_CHECKSUM="0x0" LINKER_VERSION="0x0" LINK_DATE="02/23/2004 07:06:06" UPTO_LINK_DATE="02/23/2004 07:06:06" />
    <MATCHING_FILE NAME="RegUtils.dll" SIZE="110707" CHECKSUM="0x83993729" MODULE_TYPE="WIN32" PE_CHECKSUM="0x1C94F" LINKER_VERSION="0x0" LINK_DATE="02/23/2004 07:44:41" UPTO_LINK_DATE="02/23/2004 07:44:41" />
    <MATCHING_FILE NAME="rmi.dll" SIZE="20590" CHECKSUM="0x4960AF7D" MODULE_TYPE="WIN32" PE_CHECKSUM="0x0" LINKER_VERSION="0x0" LINK_DATE="02/23/2004 07:19:20" UPTO_LINK_DATE="02/23/2004 07:19:20" />
    <MATCHING_FILE NAME="rmid.exe" SIZE="28795" CHECKSUM="0xB0D8769E" MODULE_TYPE="WIN32" PE_CHECKSUM="0x0" LINKER_VERSION="0x0" LINK_DATE="02/23/2004 07:19:37" UPTO_LINK_DATE="02/23/2004 07:19:37" />
    <MATCHING_FILE NAME="rmiregistry.exe" SIZE="28807" CHECKSUM="0x6DDA7373" MODULE_TYPE="WIN32" PE_CHECKSUM="0x0" LINKER_VERSION="0x0" LINK_DATE="02/23/2004 07:19:27" UPTO_LINK_DATE="02/23/2004 07:19:27" />
    <MATCHING_FILE NAME="servertool.exe" SIZE="28832" CHECKSUM="0xCB9E2EC5" MODULE_TYPE="WIN32" PE_CHECKSUM="0x0" LINKER_VERSION="0x0" LINK_DATE="02/23/2004 07:22:29" UPTO_LINK_DATE="02/23/2004 07:22:29" />
    <MATCHING_FILE NAME="tnameserv.exe" SIZE="28822" CHECKSUM="0xE7411E8B" MODULE_TYPE="WIN32" PE_CHECKSUM="0x0" LINKER_VERSION="0x0" LINK_DATE="02/23/2004 07:22:37" UPTO_LINK_DATE="02/23/2004 07:22:37" />
    <MATCHING_FILE NAME="verify.dll" SIZE="57453" CHECKSUM="0x3E0877A9" MODULE_TYPE="WIN32" PE_CHECKSUM="0x0" LINKER_VERSION="0x0" LINK_DATE="02/23/2004 06:49:18" UPTO_LINK_DATE="02/23/2004 06:49:18" />
    <MATCHING_FILE NAME="w2k_lsa_auth.dll" SIZE="20563" CHECKSUM="0x9952E99A" MODULE_TYPE="WIN32" PE_CHECKSUM="0x0" LINKER_VERSION="0x0" LINK_DATE="01/11/2001 16:36:14" UPTO_LINK_DATE="01/11/2001 16:36:14" />
    <MATCHING_FILE NAME="WindowsAccessBridge.dll" SIZE="90112" CHECKSUM="0xF3038256" BIN_FILE_VERSION="2.0.5.0" BIN_PRODUCT_VERSION="2.0.5.0" PRODUCT_VERSION="2, 0, 5, 0" FILE_DESCRIPTION="" COMPANY_NAME="Sun Microsystems©" PRODUCT_NAME="" FILE_VERSION="2, 0, 5, 0" ORIGINAL_FILENAME="" INTERNAL_NAME="Java Access Bridge for Windows" LEGAL_COPYRIGHT="Copyright © 2005" VERFILEDATEHI="0x0" VERFILEDATELO="0x0" VERFILEOS="0x40004" VERFILETYPE="0x2" MODULE_TYPE="WIN32" PE_CHECKSUM="0x0" LINKER_VERSION="0x0" UPTO_BIN_FILE_VERSION="2.0.5.0" UPTO_BIN_PRODUCT_VERSION="2.0.5.0" LINK_DATE="12/13/2005 21:50:00" UPTO_LINK_DATE="12/13/2005 21:50:00" VER_LANGUAGE="English (United States) [0x409]" />
    <MATCHING_FILE NAME="zip.dll" SIZE="53364" CHECKSUM="0x50DD894B" MODULE_TYPE="WIN32" PE_CHECKSUM="0x0" LINKER_VERSION="0x0" LINK_DATE="02/23/2004 06:52:54" UPTO_LINK_DATE="02/23/2004 06:52:54" />
    <MATCHING_FILE NAME="client\jvm.dll" SIZE="1212546" CHECKSUM="0x728FE5C5" MODULE_TYPE="WIN32" PE_CHECKSUM="0x0" LINKER_VERSION="0x0" LINK_DATE="02/23/2004 06:40:16" UPTO_LINK_DATE="02/23/2004 06:40:16" />
    </EXE>
    <EXE NAME="easfa.dll" FILTER="GRABMI_FILTER_THISFILEONLY">
    <MATCHING_FILE NAME="easfa.dll" SIZE="303104" CHECKSUM="0xAB6E186B" BIN_FILE_VERSION="6.0.0.7" BIN_PRODUCT_VERSION="6.0.0.7" PRODUCT_VERSION="6, 0, 0, 7" FILE_DESCRIPTION="File Archiving Solution - Shell Extension" COMPANY_NAME="ZANTAZ Inc." PRODUCT_NAME="FAS" FILE_VERSION="6, 0, 0, 7" ORIGINAL_FILENAME="easfa.dll" INTERNAL_NAME="easfa.dll" LEGAL_COPYRIGHT="Copyright (c) ZANTAZ Inc. All rights reserved." VERFILEDATEHI="0x0" VERFILEDATELO="0x0" VERFILEOS="0x4" VERFILETYPE="0x2" MODULE_TYPE="WIN32" PE_CHECKSUM="0x5853D" LINKER_VERSION="0x0" UPTO_BIN_FILE_VERSION="6.0.0.7" UPTO_BIN_PRODUCT_VERSION="6.0.0.7" LINK_DATE="03/14/2007 19:50:23" UPTO_LINK_DATE="03/14/2007 19:50:23" VER_LANGUAGE="English (United States) [0x409]" />
    </EXE>
    <EXE NAME="kernel32.dll" FILTER="GRABMI_FILTER_THISFILEONLY">
    <MATCHING_FILE NAME="kernel32.dll" SIZE="984576" CHECKSUM="0xF0B331F6" BIN_FILE_VERSION="5.1.2600.3119" BIN_PRODUCT_VERSION="5.1.2600.3119" PRODUCT_VERSION="5.1.2600.3119" FILE_DESCRIPTION="Windows NT BASE API Client DLL" COMPANY_NAME="Microsoft Corporation" PRODUCT_NAME="Microsoft® Windows® Operating System" FILE_VERSION="5.1.2600.3119 (xpsp_sp2_gdr.070416-1301)" ORIGINAL_FILENAME="kernel32" INTERNAL_NAME="kernel32" LEGAL_COPYRIGHT="© Microsoft Corporation. All rights reserved." VERFILEDATEHI="0x0" VERFILEDATELO="0x0" VERFILEOS="0x40004" VERFILETYPE="0x2" MODULE_TYPE="WIN32" PE_CHECKSUM="0xF9293" LINKER_VERSION="0x50001" UPTO_BIN_FILE_VERSION="5.1.2600.3119" UPTO_BIN_PRODUCT_VERSION="5.1.2600.3119" LINK_DATE="04/16/2007 15:52:53" UPTO_LINK_DATE="04/16/2007 15:52:53" VER_LANGUAGE="English (United States) [0x409]" />
    </EXE>
    </DATABASE>
    I had installed Java 1.6.0b105 and Java SE Runtime Environment 6. I removed both and re-installed Java SE 6 update 4 (build 1.6.0_04-b12) but this made no difference.
    I have McAfee installed and disabled it's services still no joy.
    Please could someone suggest a solution to prevent this error?
    Thanks in advance
    Jan

    Installing from a CD or from a download? It may be corrupt.
    I suggest you compare the checksum of the downloaded file with the checksum as listed on the download page.
    The installer is supposed to use its own JRE, so it should not use your installed one.

  • Error when installing Oracle Identity Manager 9.1.0.1

    Hello friends,
    I installed Oracle Identity Manager 9.1.0.2 Oracle Weblogic Server on a cluster, at the time of treaties authenticated in the web console of Oracle Identity Manager, I get the following message:
    A system error was encountered.
    View the full log here
    http://pastebin.com/ucN1LHP4
    BUILD FAILED
    /opt/oim/xellerate/setup/setup.xml:447: The following error occurred while executing this line:
    /opt/oim/xellerate/setup/weblogic-setup.xml:318: weblogic.Deployer$DeployerException: weblogic.deploy.api.tools.deployer.DeployerException: Task 3 failed: [Deployer:149026]deploy application Nexaweb on oimCluster.
    Target state: deploy failed on Cluster oimCluster
    javax.servlet.ServletException: [HTTP:101249][[email protected][app:Nexaweb module:/Nexaweb path:/Nexaweb spec-version:null]]: Servlet class com.nexaweb.loader.ClientLoaderServlet for servlet ClientClassServlet could not be loaded because the requested class was not found in the classpath .
    java.lang.ClassNotFoundException: com.nexaweb.loader.ClientLoaderServlet.
         at weblogic.servlet.internal.ServletStubImpl.prepareServlet(ServletStubImpl.java:551)
         at weblogic.servlet.internal.WebAppServletContext.preloadServlet(WebAppServletContext.java:1985)
         at weblogic.servlet.internal.WebAppServletContext.loadServletsOnStartup(WebAppServletContext.java:1959)
         at weblogic.servlet.internal.WebAppServletContext.preloadResources(WebAppServletContext.java:1878)
         at weblogic.servlet.internal.WebAppServletContext.start(WebAppServletContext.java:3153)
         at weblogic.servlet.internal.WebAppModule.startContexts(WebAppModule.java:1508)
         at weblogic.servlet.internal.WebAppModule.start(WebAppModule.java:482)
         at weblogic.application.internal.flow.ModuleStateDriver$3.next(ModuleStateDriver.java:425)
         at weblogic.application.utils.StateMachineDriver.nextState(StateMachineDriver.java:52)
         at weblogic.application.internal.flow.ModuleStateDriver.start(ModuleStateDriver.java:119)
         at weblogic.application.internal.flow.ScopedModuleDriver.start(ScopedModuleDriver.java:200)
         at weblogic.application.internal.flow.ModuleListenerInvoker.start(ModuleListenerInvoker.java:247)
         at weblogic.application.internal.flow.ModuleStateDriver$3.next(ModuleStateDriver.java:425)
         at weblogic.application.utils.StateMachineDriver.nextState(StateMachineDriver.java:52)
         at weblogic.application.internal.flow.ModuleStateDriver.start(ModuleStateDriver.java:119)
         at weblogic.application.internal.flow.StartModulesFlow.activate(StartModulesFlow.java:27)
         at weblogic.application.internal.BaseDeployment$2.next(BaseDeployment.java:636)
         at weblogic.application.utils.StateMachineDriver.nextState(StateMachineDriver.java:52)
         at weblogic.application.internal.BaseDeployment.activate(BaseDeployment.java:205)
         at weblogic.application.internal.EarDeployment.activate(EarDeployment.java:58)
         at weblogic.application.internal.DeploymentStateChecker.activate(DeploymentStateChecker.java:161)
         at weblogic.deploy.internal.targetserver.AppContainerInvoker.activate(AppContainerInvoker.java:79)
         at weblogic.deploy.internal.targetserver.operations.AbstractOperation.activate(AbstractOperation.java:569)
         at weblogic.deploy.internal.targetserver.operations.ActivateOperation.activateDeployment(ActivateOperation.java:150)
         at weblogic.deploy.internal.targetserver.operations.ActivateOperation.doCommit(ActivateOperation.java:116)
         at weblogic.deploy.internal.targetserver.operations.AbstractOperation.commit(AbstractOperation.java:323)
         at weblogic.deploy.internal.targetserver.DeploymentManager.handleDeploymentCommit(DeploymentManager.java:844)
         at weblogic.deploy.internal.targetserver.DeploymentManager.activateDeploymentList(DeploymentManager.java:1253)
         at weblogic.deploy.internal.targetserver.DeploymentManager.handleCommit(DeploymentManager.java:440)
         at weblogic.deploy.internal.targetserver.DeploymentServiceDispatcher.commit(DeploymentServiceDispatcher.java:163)
         at weblogic.deploy.service.internal.targetserver.DeploymentReceiverCallbackDeliverer.doCommitCallback(DeploymentReceiverCallbackDeliverer.java:195)
         at weblogic.deploy.service.internal.targetserver.DeploymentReceiverCallbackDeliverer.access$100(DeploymentReceiverCallbackDeliverer.java:13)
         at weblogic.deploy.service.internal.targetserver.DeploymentReceiverCallbackDeliverer$2.run(DeploymentReceiverCallbackDeliverer.java:68)
         at weblogic.work.SelfTuningWorkManagerImpl$WorkAdapterImpl.run(SelfTuningWorkManagerImpl.java:528)
         at weblogic.work.ExecuteThread.execute(ExecuteThread.java:209)
         at weblogic.work.ExecuteThread.run(ExecuteThread.java:178)
         at org.apache.tools.ant.ProjectHelper.addLocationToBuildException(ProjectHelper.java:508)
         at org.apache.tools.ant.taskdefs.Ant.execute(Ant.java:418)
         at org.apache.tools.ant.UnknownElement.execute(UnknownElement.java:288)
         at sun.reflect.GeneratedMethodAccessor1.invoke(Unknown Source)
         at sun.reflect.DelegatingMethodAccessorImpl.invoke(DelegatingMethodAccessorImpl.java:25)
         at java.lang.reflect.Method.invoke(Method.java:597)
         at org.apache.tools.ant.dispatch.DispatchUtils.execute(DispatchUtils.java:106)
         at org.apache.tools.ant.Task.perform(Task.java:348)
         at org.apache.tools.ant.Target.execute(Target.java:357)
         at org.apache.tools.ant.Target.performTasks(Target.java:385)
         at org.apache.tools.ant.Project.executeSortedTargets(Project.java:1337)
         at org.apache.tools.ant.Project.executeTarget(Project.java:1306)
         at org.apache.tools.ant.helper.DefaultExecutor.executeTargets(DefaultExecutor.java:41)
         at org.apache.tools.ant.Project.executeTargets(Project.java:1189)
         at org.apache.tools.ant.Main.runBuild(Main.java:758)
         at org.apache.tools.ant.Main.startAnt(Main.java:217)
         at org.apache.tools.ant.launch.Launcher.run(Launcher.java:257)
         at org.apache.tools.ant.launch.Launcher.main(Launcher.java:104)
    Caused by: /opt/oim/xellerate/setup/weblogic-setup.xml:318: weblogic.Deployer$DeployerException: weblogic.deploy.api.tools.deployer.DeployerException: Task 3 failed: [Deployer:149026]deploy application Nexaweb on oimCluster.
    Target state: deploy failed on Cluster oimCluster
    javax.servlet.ServletException: [HTTP:101249][[email protected][app:Nexaweb module:/Nexaweb path:/Nexaweb spec-version:null]]: Servlet class com.nexaweb.loader.ClientLoaderServlet for servlet ClientClassServlet could not be loaded because the requested class was not found in the classpath .
    java.lang.ClassNotFoundException: com.nexaweb.loader.ClientLoaderServlet.
         at weblogic.servlet.internal.ServletStubImpl.prepareServlet(ServletStubImpl.java:551)
         at weblogic.servlet.internal.WebAppServletContext.preloadServlet(WebAppServletContext.java:1985)
         at weblogic.servlet.internal.WebAppServletContext.loadServletsOnStartup(WebAppServletContext.java:1959)
         at weblogic.servlet.internal.WebAppServletContext.preloadResources(WebAppServletContext.java:1878)
         at weblogic.servlet.internal.WebAppServletContext.start(WebAppServletContext.java:3153)
         at weblogic.servlet.internal.WebAppModule.startContexts(WebAppModule.java:1508)
         at weblogic.servlet.internal.WebAppModule.start(WebAppModule.java:482)
         at weblogic.application.internal.flow.ModuleStateDriver$3.next(ModuleStateDriver.java:425)
         at weblogic.application.utils.StateMachineDriver.nextState(StateMachineDriver.java:52)
         at weblogic.application.internal.flow.ModuleStateDriver.start(ModuleStateDriver.java:119)
         at weblogic.application.internal.flow.ScopedModuleDriver.start(ScopedModuleDriver.java:200)
         at weblogic.application.internal.flow.ModuleListenerInvoker.start(ModuleListenerInvoker.java:247)
         at weblogic.application.internal.flow.ModuleStateDriver$3.next(ModuleStateDriver.java:425)
         at weblogic.application.utils.StateMachineDriver.nextState(StateMachineDriver.java:52)
         at weblogic.application.internal.flow.ModuleStateDriver.start(ModuleStateDriver.java:119)
         at weblogic.application.internal.flow.StartModulesFlow.activate(StartModulesFlow.java:27)
         at weblogic.application.internal.BaseDeployment$2.next(BaseDeployment.java:636)
         at weblogic.application.utils.StateMachineDriver.nextState(StateMachineDriver.java:52)
         at weblogic.application.internal.BaseDeployment.activate(BaseDeployment.java:205)
         at weblogic.application.internal.EarDeployment.activate(EarDeployment.java:58)
         at weblogic.application.internal.DeploymentStateChecker.activate(DeploymentStateChecker.java:161)
         at weblogic.deploy.internal.targetserver.AppContainerInvoker.activate(AppContainerInvoker.java:79)
         at weblogic.deploy.internal.targetserver.operations.AbstractOperation.activate(AbstractOperation.java:569)
         at weblogic.deploy.internal.targetserver.operations.ActivateOperation.activateDeployment(ActivateOperation.java:150)
         at weblogic.deploy.internal.targetserver.operations.ActivateOperation.doCommit(ActivateOperation.java:116)
         at weblogic.deploy.internal.targetserver.operations.AbstractOperation.commit(AbstractOperation.java:323)
         at weblogic.deploy.internal.targetserver.DeploymentManager.handleDeploymentCommit(DeploymentManager.java:844)
         at weblogic.deploy.internal.targetserver.DeploymentManager.activateDeploymentList(DeploymentManager.java:1253)
         at weblogic.deploy.internal.targetserver.DeploymentManager.handleCommit(DeploymentManager.java:440)
         at weblogic.deploy.internal.targetserver.DeploymentServiceDispatcher.commit(DeploymentServiceDispatcher.java:163)
         at weblogic.deploy.service.internal.targetserver.DeploymentReceiverCallbackDeliverer.doCommitCallback(DeploymentReceiverCallbackDeliverer.java:195)
         at weblogic.deploy.service.internal.targetserver.DeploymentReceiverCallbackDeliverer.access$100(DeploymentReceiverCallbackDeliverer.java:13)
         at weblogic.deploy.service.internal.targetserver.DeploymentReceiverCallbackDeliverer$2.run(DeploymentReceiverCallbackDeliverer.java:68)
         at weblogic.work.SelfTuningWorkManagerImpl$WorkAdapterImpl.run(SelfTuningWorkManagerImpl.java:528)
         at weblogic.work.ExecuteThread.execute(ExecuteThread.java:209)
         at weblogic.work.ExecuteThread.run(ExecuteThread.java:178)
         at weblogic.ant.taskdefs.management.WLDeploy.execute(WLDeploy.java:357)
         at org.apache.tools.ant.UnknownElement.execute(UnknownElement.java:288)
         at sun.reflect.GeneratedMethodAccessor167.invoke(Unknown Source)
         at sun.reflect.DelegatingMethodAccessorImpl.invoke(DelegatingMethodAccessorImpl.java:25)
         at java.lang.reflect.Method.invoke(Method.java:597)
         at org.apache.tools.ant.dispatch.DispatchUtils.execute(DispatchUtils.java:106)
         at org.apache.tools.ant.Task.perform(Task.java:348)
         at org.apache.tools.ant.Target.execute(Target.java:357)
         at org.apache.tools.ant.Target.performTasks(Target.java:385)
         at org.apache.tools.ant.Project.executeSortedTargets(Project.java:1337)
         at org.apache.tools.ant.helper.SingleCheckExecutor.executeTargets(SingleCheckExecutor.java:38)
         at org.apache.tools.ant.Project.executeTargets(Project.java:1189)
         at org.apache.tools.ant.taskdefs.Ant.execute(Ant.java:416)
         ... 16 more
    Caused by: weblogic.Deployer$DeployerException: weblogic.deploy.api.tools.deployer.DeployerException: Task 3 failed: [Deployer:149026]deploy application Nexaweb on oimCluster.
    Target state: deploy failed on Cluster oimCluster
    javax.servlet.ServletException: [HTTP:101249][[email protected][app:Nexaweb module:/Nexaweb path:/Nexaweb spec-version:null]]: Servlet class com.nexaweb.loader.ClientLoaderServlet for servlet ClientClassServlet could not be loaded because the requested class was not found in the classpath .
    java.lang.ClassNotFoundException: com.nexaweb.loader.ClientLoaderServlet.
         at weblogic.servlet.internal.ServletStubImpl.prepareServlet(ServletStubImpl.java:551)
         at weblogic.servlet.internal.WebAppServletContext.preloadServlet(WebAppServletContext.java:1985)
         at weblogic.servlet.internal.WebAppServletContext.loadServletsOnStartup(WebAppServletContext.java:1959)
         at weblogic.servlet.internal.WebAppServletContext.preloadResources(WebAppServletContext.java:1878)
         at weblogic.servlet.internal.WebAppServletContext.start(WebAppServletContext.java:3153)
         at weblogic.servlet.internal.WebAppModule.startContexts(WebAppModule.java:1508)
         at weblogic.servlet.internal.WebAppModule.start(WebAppModule.java:482)
         at weblogic.application.internal.flow.ModuleStateDriver$3.next(ModuleStateDriver.java:425)
         at weblogic.application.utils.StateMachineDriver.nextState(StateMachineDriver.java:52)
         at weblogic.application.internal.flow.ModuleStateDriver.start(ModuleStateDriver.java:119)
         at weblogic.application.internal.flow.ScopedModuleDriver.start(ScopedModuleDriver.java:200)
         at weblogic.application.internal.flow.ModuleListenerInvoker.start(ModuleListenerInvoker.java:247)
         at weblogic.application.internal.flow.ModuleStateDriver$3.next(ModuleStateDriver.java:425)
         at weblogic.application.utils.StateMachineDriver.nextState(StateMachineDriver.java:52)
         at weblogic.application.internal.flow.ModuleStateDriver.start(ModuleStateDriver.java:119)
         at weblogic.application.internal.flow.StartModulesFlow.activate(StartModulesFlow.java:27)
         at weblogic.application.internal.BaseDeployment$2.next(BaseDeployment.java:636)
         at weblogic.application.utils.StateMachineDriver.nextState(StateMachineDriver.java:52)
         at weblogic.application.internal.BaseDeployment.activate(BaseDeployment.java:205)
         at weblogic.application.internal.EarDeployment.activate(EarDeployment.java:58)
         at weblogic.application.internal.DeploymentStateChecker.activate(DeploymentStateChecker.java:161)
         at weblogic.deploy.internal.targetserver.AppContainerInvoker.activate(AppContainerInvoker.java:79)
         at weblogic.deploy.internal.targetserver.operations.AbstractOperation.activate(AbstractOperation.java:569)
         at weblogic.deploy.internal.targetserver.operations.ActivateOperation.activateDeployment(ActivateOperation.java:150)
         at weblogic.deploy.internal.targetserver.operations.ActivateOperation.doCommit(ActivateOperation.java:116)
         at weblogic.deploy.internal.targetserver.operations.AbstractOperation.commit(AbstractOperation.java:323)
         at weblogic.deploy.internal.targetserver.DeploymentManager.handleDeploymentCommit(DeploymentManager.java:844)
         at weblogic.deploy.internal.targetserver.DeploymentManager.activateDeploymentList(DeploymentManager.java:1253)
         at weblogic.deploy.internal.targetserver.DeploymentManager.handleCommit(DeploymentManager.java:440)
         at weblogic.deploy.internal.targetserver.DeploymentServiceDispatcher.commit(DeploymentServiceDispatcher.java:163)
         at weblogic.deploy.service.internal.targetserver.DeploymentReceiverCallbackDeliverer.doCommitCallback(DeploymentReceiverCallbackDeliverer.java:195)
         at weblogic.deploy.service.internal.targetserver.DeploymentReceiverCallbackDeliverer.access$100(DeploymentReceiverCallbackDeliverer.java:13)
         at weblogic.deploy.service.internal.targetserver.DeploymentReceiverCallbackDeliverer$2.run(DeploymentReceiverCallbackDeliverer.java:68)
         at weblogic.work.SelfTuningWorkManagerImpl$WorkAdapterImpl.run(SelfTuningWorkManagerImpl.java:528)
         at weblogic.work.ExecuteThread.execute(ExecuteThread.java:209)
         at weblogic.work.ExecuteThread.run(ExecuteThread.java:178)
         at weblogic.Deployer.run(Deployer.java:72)
         at weblogic.Deployer.mainWithExceptions(Deployer.java:62)
         at sun.reflect.NativeMethodAccessorImpl.invoke0(Native Method)
         at sun.reflect.NativeMethodAccessorImpl.invoke(NativeMethodAccessorImpl.java:39)
         at sun.reflect.DelegatingMethodAccessorImpl.invoke(DelegatingMethodAccessorImpl.java:25)
         at java.lang.reflect.Method.invoke(Method.java:597)
         at weblogic.ant.taskdefs.management.WLDeploy.invokeMain(WLDeploy.java:419)
         at weblogic.ant.taskdefs.management.WLDeploy.execute(WLDeploy.java:349)
         ... 28 more
    Caused by: weblogic.deploy.api.tools.deployer.DeployerException: Task 3 failed: [Deployer:149026]deploy application Nexaweb on oimCluster.
    Target state: deploy failed on Cluster oimCluster
    javax.servlet.ServletException: [HTTP:101249][[email protected][app:Nexaweb module:/Nexaweb path:/Nexaweb spec-version:null]]: Servlet class com.nexaweb.loader.ClientLoaderServlet for servlet ClientClassServlet could not be loaded because the requested class was not found in the classpath .
    java.lang.ClassNotFoundException: com.nexaweb.loader.ClientLoaderServlet.
         at weblogic.servlet.internal.ServletStubImpl.prepareServlet(ServletStubImpl.java:551)
         at weblogic.servlet.internal.WebAppServletContext.preloadServlet(WebAppServletContext.java:1985)
         at weblogic.servlet.internal.WebAppServletContext.loadServletsOnStartup(WebAppServletContext.java:1959)
         at weblogic.servlet.internal.WebAppServletContext.preloadResources(WebAppServletContext.java:1878)
         at weblogic.servlet.internal.WebAppServletContext.start(WebAppServletContext.java:3153)
         at weblogic.servlet.internal.WebAppModule.startContexts(WebAppModule.java:1508)
         at weblogic.servlet.internal.WebAppModule.start(WebAppModule.java:482)
         at weblogic.application.internal.flow.ModuleStateDriver$3.next(ModuleStateDriver.java:425)
         at weblogic.application.utils.StateMachineDriver.nextState(StateMachineDriver.java:52)
         at weblogic.application.internal.flow.ModuleStateDriver.start(ModuleStateDriver.java:119)
         at weblogic.application.internal.flow.ScopedModuleDriver.start(ScopedModuleDriver.java:200)
         at weblogic.application.internal.flow.ModuleListenerInvoker.start(ModuleListenerInvoker.java:247)
         at weblogic.application.internal.flow.ModuleStateDriver$3.next(ModuleStateDriver.java:425)
         at weblogic.application.utils.StateMachineDriver.nextState(StateMachineDriver.java:52)
         at weblogic.application.internal.flow.ModuleStateDriver.start(ModuleStateDriver.java:119)
         at weblogic.application.internal.flow.StartModulesFlow.activate(StartModulesFlow.java:27)
         at weblogic.application.internal.BaseDeployment$2.next(BaseDeployment.java:636)
         at weblogic.application.utils.StateMachineDriver.nextState(StateMachineDriver.java:52)
         at weblogic.application.internal.BaseDeployment.activate(BaseDeployment.java:205)
         at weblogic.application.internal.EarDeployment.activate(EarDeployment.java:58)
         at weblogic.application.internal.DeploymentStateChecker.activate(DeploymentStateChecker.java:161)
         at weblogic.deploy.internal.targetserver.AppContainerInvoker.activate(AppContainerInvoker.java:79)
         at weblogic.deploy.internal.targetserver.operations.AbstractOperation.activate(AbstractOperation.java:569)
         at weblogic.deploy.internal.targetserver.operations.ActivateOperation.activateDeployment(ActivateOperation.java:150)
         at weblogic.deploy.internal.targetserver.operations.ActivateOperation.doCommit(ActivateOperation.java:116)
         at weblogic.deploy.internal.targetserver.operations.AbstractOperation.commit(AbstractOperation.java:323)
         at weblogic.deploy.internal.targetserver.DeploymentManager.handleDeploymentCommit(DeploymentManager.java:844)
         at weblogic.deploy.internal.targetserver.DeploymentManager.activateDeploymentList(DeploymentManager.java:1253)
         at weblogic.deploy.internal.targetserver.DeploymentManager.handleCommit(DeploymentManager.java:440)
         at weblogic.deploy.internal.targetserver.DeploymentServiceDispatcher.commit(DeploymentServiceDispatcher.java:163)
         at weblogic.deploy.service.internal.targetserver.DeploymentReceiverCallbackDeliverer.doCommitCallback(DeploymentReceiverCallbackDeliverer.java:195)
         at weblogic.deploy.service.internal.targetserver.DeploymentReceiverCallbackDeliverer.access$100(DeploymentReceiverCallbackDeliverer.java:13)
         at weblogic.deploy.service.internal.targetserver.DeploymentReceiverCallbackDeliverer$2.run(DeploymentReceiverCallbackDeliverer.java:68)
         at weblogic.work.SelfTuningWorkManagerImpl$WorkAdapterImpl.run(SelfTuningWorkManagerImpl.java:528)
         at weblogic.work.ExecuteThread.execute(ExecuteThread.java:209)
         at weblogic.work.ExecuteThread.run(ExecuteThread.java:178)
         at weblogic.deploy.api.tools.deployer.Jsr88Operation.report(Jsr88Operation.java:542)
         at weblogic.deploy.api.tools.deployer.Deployer.perform(Deployer.java:140)
         at weblogic.deploy.api.tools.deployer.Deployer.runBody(Deployer.java:88)
         at weblogic.utils.compiler.Tool.run(Tool.java:158)
         at weblogic.utils.compiler.Tool.run(Tool.java:115)
         at weblogic.Deployer.run(Deployer.java:70)
         ... 35 more
    As I can solve this problem, not to reinstall everything again
    thanks

    Not sure if I understand your issue correctly. Your deployment failed during the installation and you have started the servers and trying to login?
    When installing OIM in a clustered WLS domain, the docs specify various cluster configurations needed to be completed in the WLS Admin Console before running the OIM installer. These steps DO NOT include starting up of the first managed server. In fact, if you start up the managed server then you may very well run into deployment issues after the OIM application is built. Instead, when installing OIM, the installer detects that not all nodes are on-line and so will queue the deployment for later. Deployment then takes place in later steps when you are instructed to restart the app server and start managed nodes.
    Thus was your managed server running when you were doing the installation? That has caused the issue. I would suggest to dump this domain (save the .xldatabasekey) if you don't wanna to dump the database part and start the installation again BUT don't start the managed server while doing the installation.
    HTH,
    BB

  • Error when installing Oracle Lite for Mobile Field Service Laptop

    Hi,
    I am facing a strange problem when installing Mobile Field Service Laptop agent "Oracle Lite" on my laptop.
    When I run the setup, it asks me username and password, after entering the information, when I proceed, I see setup window which displays below messages
    "Authenticating with server... "
    Please wait. This may take several minutes ...
    Then it hangs for several minutes, approx 5 to 10 mins, and then gives message
    "Could not connect to server: HTTP/1.0 502 Bad Gateway"
    I am not able to proceed with setup.
    But none of my other colleagues are facing this issue, even though the network, proxy settings and java version are same.
    Any idea about this error?
    Regards,
    Mohammed

    I thought polite.ini us required....how r u using MFS without polite.ini?

  • Installation error when installing Oracle 8.1.7

    I'm currently upgrading 8.0.5 with 8.1.7. When installing 8.1.7 I receive the following error message:
    O/S error in starting service Oracleora81DataGatherer
    Has anyone seen this and is there a fix?
    thanks
    Mark
    null

    Hi,
    Please check up if any TNSListener (of older version , from previously installed RDBMS ) is already running in the system.
    Statup->controlpanel->Services->%TNSListener%.
    If so, please Stop the listener,while you install the oracle.
    Else, While you install oracle, don't create starter database.First install Oracle, after that, create the DB using "Database configuration Assistant(DCA)", life will be easier!!
    Regard
    karthik

  • Regaring error when installing oracle 10g on redhat linux4 on vmware

    hi can any body help me with this error
    when i run the runInstaller
    it run the prerequsits and
    Starting Oracle Universal Installer...
    Checking installer requirements...
    Checking operating system version: must be redhat-3, SuSE-9, redhat-4, UnitedLinux-1.0, asianux-1 or asianux-2
    Passed
    All installer requirements met.
    Preparing to launch Oracle Universal Installer from /tmp/OraInstall2010-12-24_01-06-17PM. Please wait ...[[email protected] oracle10g]$ Xlib: connection to ":0.0" refused by server
    Xlib: No protocol specified
    Exception in thread "main" java.lang.InternalError: Can't connect to X11 window server using ':0.0' as the value of the DISPLAY variable.
    at sun.awt.X11GraphicsEnvironment.initDisplay(Native Method)
    at sun.awt.X11GraphicsEnvironment.<clinit>(Unknown Source)
    at java.lang.Class.forName0(Native Method)
    at java.lang.Class.forName(Unknown Source)
    at java.awt.GraphicsEnvironment.getLocalGraphicsEnvironment(Unknown Source)
    at java.awt.Window.init(Unknown Source)
    at java.awt.Window.<init>(Unknown Source)
    at java.awt.Frame.<init>(Unknown Source)
    at oracle.ewt.popup.PopupFrame.<init>(Unknown Source)
    at oracle.ewt.lwAWT.BufferedFrame.<init>(Unknown Source)
    at oracle.sysman.oio.oioc.OiocOneClickInstaller.<init>(OiocOneClickInstaller.java:378)
    at oracle.sysman.oio.oioc.OiocOneClickInstaller.main(OiocOneClickInstaller.java:2091)
    thanks
    Edited by: user9971259 on 24-Dec-2010 05:38

    Welcome to the forums !
    Pl post exact details of OS and database versions. This error indicates that all pre-requisites for your install have not been met - the Install guide for your specific version of database can be found at http://docs.oracle.com
    Pl use the search feature to find many previous discussions on this topic - http://forums.oracle.com/forums/search.jspa?threadID=&q=xlib+AND+connection+AND+refused+AND+server&objID=f64&dateRange=thisyear&userID=&numResults=15
    HTH
    Srini

  • Perl error when installing Oracle 10g in a Window XP

    After I install Oracle Enterprise Manager 10g Grid Control in a Window XP SP2 environment, and appears the next message: "perl.exe has encountered a problem and needs to close. We are sorry for the inconvenience."
    And in some logs appears Errors, like in OC4J~OC4J_EM~default_island~1:
    08/04/30 11:46:03      at oracle.jdbc.driver.DatabaseError.throwSqlException(DatabaseError.java:137)
    08/04/30 11:46:03      at oracle.jdbc.driver.DatabaseError.throwSqlException(DatabaseError.java:174)
    08/04/30 11:46:03      at oracle.jdbc.driver.DatabaseError.throwSqlException(DatabaseError.java:239)
    between other errors in other logs.
    I need to configure the snmp agent and subagent, but it doesnt work correctly :(
    If someone can help me with this problems please I will so thank.
    Gabriela

    Hi,
    As you are new I would like to explain you more. First please confirm whether you have Oracle support. Metalink can be accessed only when you have oracle support.
    Regards
    Mudhalvan M.M

  • SAX Parser error when installing Oracle CCG 5.5.1

    I am trying to install Oracle CCG on Windows 2008. I already have my PeopleSoft system installed on the same box, running weblogic and jdk1.7.0_03.
    After setting the required environment variables, when I run the command "install.bat -f ccg-551-install.apf" from ccg_install folder, I get the following error:
    Starting Oracle Installation Engine 1.2.1
    Running from working directory C:\CCG\ccg_stage\
    ORACLE_HOME is C:\app\Administrator\product\11.2.0\dbhome_1
    JAVA_HOME is C:\Program Files\Java\jdk1.7.0_03
    LAUNCH_CLASSPATH is C:\app\Administrator\product\11.2.0\dbhome_1\jdbc\lib\classe
    s12.jar;C:\CCG\ccg_stage\install.jar;"C:\app\Administrator\product\11.2.0\dbhome
    _1\lib";C:\Program Files\Java\jdk1.7.0_03\lib;C:\app\Administrator\product\11.2.
    0\dbhome_1\lib;%CLASSPATH%
    Oracle CCG Installer -- Version 1.2.1 Build(installer12-Maint-1.2.1.2)
    Copyright 2009 Oracle. All rights reserved.
    Initializing. Please wait...
    FileParser: Parse error occurred: Could not load default SAX parser: org.apache.
    xerces.parsers.SAXParser: SAX2 driver class org.apache.xerces.parsers.SAXParser
    not found: org.apache.xerces.parsers.SAXParser
    Could not load default SAX parser: org.apache.xerces.parsers.SAXParser: SAX2 dri
    ver class org.apache.xerces.parsers.SAXParser not found: org.apache.xerces.parse
    rs.SAXParser
    I have tried downloading xerces.jar file and placed in the CLASSPATH folder but it did not help either. I do not have much knowledge about java and need help from someone who has installed CCG on windows.
    Thank you in advance

    Several things I would recommend here:
    1. Use JDK 1.5 instead of 1.7, I'm pretty sure 1.7 isn't supported (Don't ask why) - [http://www.oracle.com/technetwork/java/javasebusiness/downloads/java-archive-downloads-javase5-419410.html|http://www.oracle.com/technetwork/java/javasebusiness/downloads/java-archive-downloads-javase5-419410.html]
    2. Make sure to exit out all DOS command windows, then open a new one then go through setting all the environment variables, and using the same DOS command run the install command, otherwise all environment variables will be lost.
    I hope that helps.

Maybe you are looking for


HashFlare