Error when using DataSourceUserManager

Hello,
I have been able to use form-based authentication with the principals.xml file, but I would like to use the DataSourceUserManager for user authentication. However, I get the following error:
Error initializing server: Error instantiating default application at file:/C:/oc4j/j2ee/home/config/application.xml: Error initializing userManager 'com.evermind.sql.DataSourceUserManager': NamingException: Need to specify class name in environment or system property, or as an applet parameter, or in an application resource file: java.naming.factory.initial
Does anyone know what could be causing my problem.
Thanks,
Rick

Thanks much. I got the patch # from MetaLink and applied the same. Now I have the follg. error:
Error encountered initializing
users and groups using the specified user manager. com.evermind.sql.DataSourceUserManager does not support the operations needed to populate
this page.. getGroupCount() is not supported by this UserManager
Trace
========================================================
2004-03-26 16:39:57,481 [HttpRequestHandler-18670253] ERROR ias.ErrorData errHandler.62 - error during page render Error encountered initializing
users and groups using the specified user manager. com.evermind.sql.DataSourceUserManager does not support the operations needed to populate
this page.. getGroupCount() is not supported by this UserManager
oracle.sysman.emSDK.admObj.AdminObjectException: Unsupported operation exception encountered
at oracle.sysman.ias.sta.oc4j.UserMgrAdmin.initGroups(UserMgrAdmin.java:742)
at oracle.sysman.ias.sta.oc4j.UserMgrAdmin.getGroupsFromUserMgr(UserMgrAdmin.java:138)
at oracle.sysman.ias.sta.oc4j.AppSecurity.getGroupsData(AppSecurity.java:664)
Caused by: java.lang.UnsupportedOperationException: getGroupCount() is not supported by this UserManager
at com.evermind.security.AbstractUserManager.getGroupCount(AbstractUserManager.java:222)
at oracle.sysman.ias.sta.oc4j.UserMgrAdmin.initGroups(UserMgrAdmin.java:730)
... 207 more
java.lang.UnsupportedOperationException: getGroupCount() is not supported by this UserManager
at com.evermind.security.AbstractUserManager.getGroupCount(AbstractUserManager.java:222)
at oracle.sysman.ias.sta.oc4j.UserMgrAdmin.initGroups(UserMgrAdmin.java:730)
at oracle.sysman.ias.sta.oc4j.UserMgrAdmin.getGroupsFromUserMgr(UserMgrAdmin.java:138)
at oracle.sysman.ias.sta.oc4j.AppSecurity.getGroupsData(AppSecurity.java:664)
==========================================================
Where do I go from here?

Similar Messages

  • Photoshop CS4 "Program Error" when using Text tool

    Hello. I was having problems with Photoshop displaying a "Program Error" every so often, so I deleted the preference file and all seemed good. But after deleting the preference file for my Photoshop CS4 and re-launching Photoshop, the text tool causes Photoshop to display a Program Error when using the tool. It never did this before. Should I reinstall Photoshop? I am using a Powermac G5 running 10.5.8. I have already tried repairing the disk permissions.
    Thanks

    Thats kinda what I thought too, but the problem started happening randomly. It started when we were trying to use photomerge with large photos. The program just started giving the program errors. I still think it may be a font problem, but without going through my 2000+ fonts and disabling them one by one, how can I resolve this issue?
    Thanks

  • Error when using PPR in the OA page developed.

    HI,
    We are encountering an error when using PPR for the custom OA page being developed. I am using JDeveloper version 9.0.3.5(Build 1437) and Oracle Applications version 11.5.10.CU2. The scenario we are using PPR and the steps to reproduce the issue is mentioned below,
    Scenario:
    1) PPR is enabled for a custom OA page that is developed.
    2) The PPR is being used to enable or disable a particular field based on the
    selection of a value in a poplist in the same OA Page.
    Error replication steps:
    1) The user enters a value in the primary mandatory field which has to have
    unique value.
    2) The user selects a value from the poplist of a field which has PPR associated.
    3) The user enters data in all other mandatory fields in the OA page except one
    and tries to save the form and is shown a error message saying that all
    mandatory fields are not entered(This is correct). Now the page gets
    automatically refreshed and so the entered values are wiped off.
    4) Now if the user again enters a value in the primary mandatory field (as in
    step1) and if that value happens to be already existing value and then select
    a value from the poplist which has PPR enabled then immediately the error
    "Please enter a unique value" is entered, though we did not save the record.
    The unique record validation would happen only at the time of saving the
    record as per out business logic.
    5) But if in Step 4 if i had entered a unique value again then the above said error
    does not happen. There are few more similar kind of issues happening in the
    same page because PPR is enabled.
    Please note that this issue happens only when the page is deployed in a oracle
    applications instance and not in JDeveloper.
    Would this issue because of some cacheing problem? If Yes then how do we resolve it? Or would it be some other problem caused by our internal coding.
    Any inputs for resolving this issue would be highly appreciated.
    Thanks, Raja.

    What works in Jdeveloper should work when deployed in iAS as well.
    And PPR is an old feature given quite enough time to mature, so before we suspect OA we should investigate the code. What I do not understand is how the page refreshes in Step 3 and why does the user have to re-enter the fields just because he missed entering one mandatory field the last time.
    Mandatory field validations are client validations set by making the fields 'Required'. You obviously have client validations turned off on your PPR, otherwise you would be stuck with a javascript popup on PPR. The only way you can get the "Please enter unique..." error on PPR is Server Validation. So where have you placed this validation? If it is not in the EO, is it in the AM? And are you unconditionally calling the AM validation method in your processFormRequest? The PPR will also go through processFormRequest so I hope the PPR event is in a different if-else block.

  • Java Heap Error when using Stateless Session Timer Bean deployed in Oracle

    Hi,
    Am getting following Java Heap Error when using Stateless Session Timer Bean deployed in Oracle 10g AS R3 (Oracle Containers for J2EE 10g (10.1.3.0.0) (build 060119.1546.05277) ):
    06/08/02 14:58:43 javax.ejb.EJBException: java.lang.OutOfMemoryError: Java heap space
    06/08/02 14:58:43 at com.evermind.server.ejb.EJBUtils.getLocalUserException(EJBUtils.java:304)
    06/08/02 14:58:43 at com.evermind.server.ejb.interceptor.system.AbstractTxInterceptor.convertAndHandleMethodException(AbstractTxInterceptor.java:67)
    06/08/02 14:58:43 at com.evermind.server.ejb.interceptor.system.TxNotSupportedInterceptor.invoke(TxNotSupportedInterceptor.java:45)
    06/08/02 14:58:43 at com.evermind.server.ejb.interceptor.InvocationContextImpl.proceed(InvocationContextImpl.java:69)
    06/08/02 14:58:43 at com.evermind.server.ejb.StatelessSessionEJBObject.OC4J_invokeMethod(StatelessSessionEJBObject.java:86)
    06/08/02 14:58:43 at com.evermind.server.ejb.StatelessSessionEJBHome.invokeTimer(StatelessSessionEJBHome.java:71)
    06/08/02 14:58:43 at com.evermind.server.ejb.EJBContainer.invokeTimer(EJBContainer.java:1624)
    06/08/02 14:58:43 at oracle.ias.container.scheduler.TimerTask.runBeanTimer(TimerTask.java:92)
    06/08/02 14:58:43 at oracle.ias.container.scheduler.TimerTask.run(TimerTask.java:184)
    06/08/02 14:58:43 at EDU.oswego.cs.dl.util.concurrent.PooledExecutor$Worker.run(PooledExecutor.java:819)
    06/08/02 14:58:43 at java.lang.Thread.run(Thread.java:595)
    06/08/02 14:58:43 Caused by: java.lang.OutOfMemoryError: Java heap space
    I had tried using -Xms / -Xmx options (upto 1 GB).
    The trace of exception gets delayed (from being displayed on the console) as the memory size is increased; but after sometime it starts getting displayed on the console.
    Even though this exception is displayed on the console, the Timer Bean continues to execute upto sometime before it finally crashes!
    If anyone has encountered such problem; would appreciate if you could share the solution.
    Regards, Vidyadhar

    Hi guys, I have the same problem. I have an application EAR file with two modules (EJB and WAR starting in this order). The application can schedule a process via EJB timer. In this case restarting the server I receive the error above. If I change the modules start order --> WAR - EJB the server start correctly, but the application scheduler fails (the persistency is not working) with this error:
    07/10/09 10:30:54 FINISSIMO: TimerTask.runBeanTimer java.lang.NullPointerException; nested exception is: java.lang.NullPointerExceptionjavax.ejb.TransactionRolledbackLocalException: java.lang.NullPointerException; nested exception is: java.lang.NullPointerException
    java.lang.NullPointerException
         at java.util.ListResourceBundle.handleGetObject(ListResourceBundle.java:107)
         at java.util.ResourceBundle.getObject(ResourceBundle.java:319)
         at java.util.ResourceBundle.getString(ResourceBundle.java:285)
         at java.util.logging.Formatter.formatMessage(Formatter.java:108)
         at oracle.j2ee.util.TraceLogFormatter.format(TraceLogger.java:124)
         at oracle.j2ee.util.TraceLogger$TraceLoggerHandler.publish(TraceLogger.java:105)
         at java.util.logging.Logger.log(Logger.java:428)
         at java.util.logging.Logger.doLog(Logger.java:450)
         at java.util.logging.Logger.log(Logger.java:539)
         at oracle.ias.container.timer.TimerEntry.readObjFromBytes(TimerEntry.java:308)
         at oracle.ias.container.timer.TimerEntry.getInfo(TimerEntry.java:107)
         at oracle.ias.container.timer.Timer.getInfo(Timer.java:367)
         at oracle.ias.container.timer.EJBTimerImpl.getInfo(EJBTimerImpl.java:89)
         at com.finantix.foundation.integration.ejbtimer.EJBTimerServiceExecutorBean.ejbTimeout(EJBTimerServiceExecutorBean.java:42)
         at com.evermind.server.ejb.interceptor.joinpoint.EJBTimeoutJoinPoint.invoke(EJBTimeoutJoinPoint.java:20)
         at com.evermind.server.ejb.interceptor.InvocationContextImpl.proceed(InvocationContextImpl.java:119)
         at com.evermind.server.ejb.interceptor.system.DMSInterceptor.invoke(DMSInterceptor.java:52)
         at com.evermind.server.ejb.interceptor.InvocationContextImpl.proceed(InvocationContextImpl.java:119)
         at com.evermind.server.ejb.interceptor.system.SetContextActionInterceptor.invoke(SetContextActionInterceptor.java:44)
         at com.evermind.server.ejb.interceptor.InvocationContextImpl.proceed(InvocationContextImpl.java:119)
         at com.evermind.server.ejb.interceptor.system.TxBeanManagedInterceptor.invoke(TxBeanManagedInterceptor.java:53)
         at com.evermind.server.ejb.interceptor.InvocationContextImpl.proceed(InvocationContextImpl.java:119)
         at com.evermind.server.ejb.InvocationContextPool.invoke(InvocationContextPool.java:55)
         at com.evermind.server.ejb.StatelessSessionEJBObject.OC4J_invokeMethod(StatelessSessionEJBObject.java:87)
         at com.evermind.server.ejb.StatelessSessionEJBHome.invokeTimer(StatelessSessionEJBHome.java:38)
         at com.evermind.server.ejb.EJBContainer.invokeTimer(EJBContainer.java:1714)
         at oracle.ias.container.scheduler.TimerTask.runBeanTimer(TimerTask.java:106)
         at oracle.ias.container.scheduler.TimerTask.run(TimerTask.java:220)
         at com.evermind.util.ReleasableResourcePooledExecutor$MyWorker.run(ReleasableResourcePooledExecutor.java:303)
         at java.lang.Thread.run(Thread.java:595)
    javax.ejb.TransactionRolledbackLocalException: java.lang.NullPointerException; nested exception is: java.lang.NullPointerException
         at com.evermind.server.ejb.EJBUtils.getLocalUserException(EJBUtils.java:309)
         at com.evermind.server.ejb.interceptor.system.AbstractTxInterceptor.convertAndHandleMethodException(AbstractTxInterceptor.java:73)
         at com.evermind.server.ejb.interceptor.system.TxBeanManagedInterceptor.invoke(TxBeanManagedInterceptor.java:55)
         at com.evermind.server.ejb.interceptor.InvocationContextImpl.proceed(InvocationContextImpl.java:119)
         at com.evermind.server.ejb.InvocationContextPool.invoke(InvocationContextPool.java:55)
         at com.evermind.server.ejb.StatelessSessionEJBObject.OC4J_invokeMethod(StatelessSessionEJBObject.java:87)
         at com.evermind.server.ejb.StatelessSessionEJBHome.invokeTimer(StatelessSessionEJBHome.java:38)
         at com.evermind.server.ejb.EJBContainer.invokeTimer(EJBContainer.java:1714)
         at oracle.ias.container.scheduler.TimerTask.runBeanTimer(TimerTask.java:106)
         at oracle.ias.container.scheduler.TimerTask.run(TimerTask.java:220)
         at com.evermind.util.ReleasableResourcePooledExecutor$MyWorker.run(ReleasableResourcePooledExecutor.java:303)
         at java.lang.Thread.run(Thread.java:595)
    Caused by: java.lang.NullPointerException
         at java.util.ListResourceBundle.handleGetObject(ListResourceBundle.java:107)
         at java.util.ResourceBundle.getObject(ResourceBundle.java:319)
         at java.util.ResourceBundle.getString(ResourceBundle.java:285)
         at java.util.logging.Formatter.formatMessage(Formatter.java:108)
         at oracle.j2ee.util.TraceLogFormatter.format(TraceLogger.java:124)
         at oracle.j2ee.util.TraceLogger$TraceLoggerHandler.publish(TraceLogger.java:105)
         at java.util.logging.Logger.log(Logger.java:428)
         at java.util.logging.Logger.doLog(Logger.java:450)
         at java.util.logging.Logger.log(Logger.java:539)
         at oracle.ias.container.timer.TimerEntry.readObjFromBytes(TimerEntry.java:308)
         at oracle.ias.container.timer.TimerEntry.getInfo(TimerEntry.java:107)
         at oracle.ias.container.timer.Timer.getInfo(Timer.java:367)
         at oracle.ias.container.timer.EJBTimerImpl.getInfo(EJBTimerImpl.java:89)
         at com.finantix.foundation.integration.ejbtimer.EJBTimerServiceExecutorBean.ejbTimeout(EJBTimerServiceExecutorBean.java:42)
         at com.evermind.server.ejb.interceptor.joinpoint.EJBTimeoutJoinPoint.invoke(EJBTimeoutJoinPoint.java:20)
         at com.evermind.server.ejb.interceptor.InvocationContextImpl.proceed(InvocationContextImpl.java:119)
         at com.evermind.server.ejb.interceptor.system.DMSInterceptor.invoke(DMSInterceptor.java:52)
         at com.evermind.server.ejb.interceptor.InvocationContextImpl.proceed(InvocationContextImpl.java:119)
         at com.evermind.server.ejb.interceptor.system.SetContextActionInterceptor.invoke(SetContextActionInterceptor.java:44)
         at com.evermind.server.ejb.interceptor.InvocationContextImpl.proceed(InvocationContextImpl.java:119)
         at com.evermind.server.ejb.interceptor.system.TxBeanManagedInterceptor.invoke(TxBeanManagedInterceptor.java:53)
         ... 9 more
    Any idea?
    Thx Auro

  • Getting an error when using adobe photoshop CC, "Could not move the data because of a program error". Any idea on what this means?

    Getting an error when using adobe photoshop CC, "Could not move the data because of a program error". Any idea on what this means?

    Have no idea of what you were even doing in Photoshop my crystal ball is out for repairs so I can not see.  

  • Multivalue error when using the previous() function

    I am getting a multivalue error when using the previous() function on a dimension object in the report.  I thought that the previous function was supposed to look at the current report and then look at the previous record's contents.  How could this possibly give me a multivalue error when the value is clearly output in the previous row?  Anyone have any ideas?
    By the way, this is a valuable function for the types of reports that I design.  The next() function would be even more valuable.
    Thanks for your help.

    Hi Michael,
    Could you please test the following solutions it might help you to resolve the issue.
    Solution1:
    Use slice and dice to reset all the tables that have #multivalue in it. The only problem with this workaround is they have to do the formatting manually.
    Solution2:
    Also, test the issue by changing the object to dimension if it is a measure or to measure if it is a dimension.
    Regards,
    Sarbhjeet Kaur

  • UDESEncrypt Errors when using the JAVA engine (NW IDM 7.0)

    Folks,
    I'm seeing an error when I use the uDESEncrypt function with the Java Engine in NW IDM SP2 Patch 3.
    The error I am getting is:
    runFunctionsInString($FUNCTION.encrPWD()$$) got exception
    org.mozilla.javascript.EvaluatorException: uDESEncrypt: Key should be exactly 24 bytes long.
    The code calling it is:
    // Main function: encrPWD
    function encrPWD(Par){
         //Example calling DSE internal function
         //UserFunc.uStop("Terminated by user");
         key = "C:\Program Files\SAP\IdM\Workflow\configs\KEY\keys.ini";
         OutString = UserFunc.uDESEncrypt(key, Par);
         return OutString;
    I have also seen this error when using Patch 4.
    Interestingly enough, the error does not occur when using the Windows Engine.  Anyone else seeing this?
    Thanks,
    Matt

    Hi Matthew,
    Try to replace the '\' with '
    key = "C:
    Program Files
    SAP
    IdM
    Workflow
    configs
    KEY
    keys.ini";
    Alternative approaches,
    1) setting key empty and it will look into %DSE_HOME%\KEY\key.ini
      which should be C:\Program Files\SAP\IdM\Identity Center\Key\key.ini on default installation path.
    2) or setting the key to something like = 6D5A2AF59B1CDD7F9592484F178331C891537A3F9B91D362
       a 24 byte key...
    Also when using DES you should ensure that in Identity Center underneath Options/General
    you have encryption algorithm set to 3DES.
    Normally if you intend to use this for password provisioning in IC you would also
    on the identity store (for instance 'Enterprise people') underneath 'password policy' check
    of for 'enable password provisioning.'
    By doing so the MX_ENCRYPTED_PASSWORD with be set when operating through
    workflow (3DES encryption version of the MX_PASSWORD) which allows you to obtain password
    when provisioning to other target systems...

  • Errors when using source2wsdd

    Any help will be greatly appreciated.
    I got the following errors when using the ant task source2wsdd:
    [source2wsdd] classpath C:\bea\weblogic81\server\lib\weblogic.jar;C:\bea\weblogi
    c81\server\lib\webservices.jar
    [source2wsdd] source2wsdd: Cannot find doclet class weblogic.webservice.tools.dd
    gen.ServiceGen
    [source2wsdd] 1 error
    [ant] Exiting C:\project\DCII\ant\batch-build.xml.
    BUILD FAILED
    C:\project\ant\build.xml:67: The following error occurred while executing this l
    ine:
    C:\project\DCII\ant\batch-build.xml:326: javadoc execution failed
    at org.apache.tools.ant.ProjectHelper.addLocationToBuildException(Projec
    tHelper.java:539)
    at org.apache.tools.ant.taskdefs.Ant.execute(Ant.java:388)
    at org.apache.tools.ant.UnknownElement.execute(UnknownElement.java:275)
    at org.apache.tools.ant.Task.perform(Task.java:364)
    at org.apache.tools.ant.Target.execute(Target.java:341)
    at org.apache.tools.ant.Target.performTasks(Target.java:369)
    at org.apache.tools.ant.Project.executeTarget(Project.java:1214)
    at org.apache.tools.ant.Project.executeTargets(Project.java:1062)
    at org.apache.tools.ant.Main.runBuild(Main.java:673)
    at org.apache.tools.ant.Main.startAnt(Main.java:188)
    at org.apache.tools.ant.launch.Launcher.run(Launcher.java:196)
    at org.apache.tools.ant.launch.Launcher.main(Launcher.java:55)
    Caused by: C:\project\DCII\ant\batch-build.xml:326: javadoc execution failed
    at weblogic.ant.taskdefs.webservices.autotype.JavaSource2DD.runJavadoc(J
    avaSource2DD.java:297)
    at weblogic.ant.taskdefs.webservices.autotype.JavaSource2DD.execute(Java
    Source2DD.java:150)
    at org.apache.tools.ant.UnknownElement.execute(UnknownElement.java:275)
    at org.apache.tools.ant.Task.perform(Task.java:364)
    at org.apache.tools.ant.Target.execute(Target.java:341)
    at org.apache.tools.ant.Target.performTasks(Target.java:369)
    at org.apache.tools.ant.Project.executeTarget(Project.java:1214)
    at ise.antelope.tasks.Call.execute(Call.java:17)
    at org.apache.tools.ant.UnknownElement.execute(UnknownElement.java:275)
    at org.apache.tools.ant.Task.perform(Task.java:364)
    at ise.antelope.tasks.IfTask.doIf(IfTask.java:298)
    at ise.antelope.tasks.IfTask.execute(IfTask.java:267)
    at org.apache.tools.ant.UnknownElement.execute(UnknownElement.java:275)
    at org.apache.tools.ant.Task.perform(Task.java:364)
    at org.apache.tools.ant.Target.execute(Target.java:341)
    at org.apache.tools.ant.Target.performTasks(Target.java:369)
    at org.apache.tools.ant.Project.executeTarget(Project.java:1214)
    at org.apache.tools.ant.taskdefs.Ant.execute(Ant.java:386)
    ... 10 more
    --- Nested Exception ---
    C:\project\DCII\ant\batch-build.xml:326: javadoc execution failed
    at weblogic.ant.taskdefs.webservices.autotype.JavaSource2DD.runJavadoc(J
    avaSource2DD.java:297)
    at weblogic.ant.taskdefs.webservices.autotype.JavaSource2DD.execute(Java
    Source2DD.java:150)
    at org.apache.tools.ant.UnknownElement.execute(UnknownElement.java:275)
    at org.apache.tools.ant.Task.perform(Task.java:364)
    at org.apache.tools.ant.Target.execute(Target.java:341)
    at org.apache.tools.ant.Target.performTasks(Target.java:369)
    at org.apache.tools.ant.Project.executeTarget(Project.java:1214)
    at ise.antelope.tasks.Call.execute(Call.java:17)
    at org.apache.tools.ant.UnknownElement.execute(UnknownElement.java:275)
    at org.apache.tools.ant.Task.perform(Task.java:364)
    at ise.antelope.tasks.IfTask.doIf(IfTask.java:298)
    at ise.antelope.tasks.IfTask.execute(IfTask.java:267)
    at org.apache.tools.ant.UnknownElement.execute(UnknownElement.java:275)
    at org.apache.tools.ant.Task.perform(Task.java:364)
    at org.apache.tools.ant.Target.execute(Target.java:341)
    at org.apache.tools.ant.Target.performTasks(Target.java:369)
    at org.apache.tools.ant.Project.executeTarget(Project.java:1214)
    at org.apache.tools.ant.taskdefs.Ant.execute(Ant.java:386)
    at org.apache.tools.ant.UnknownElement.execute(UnknownElement.java:275)
    at org.apache.tools.ant.Task.perform(Task.java:364)
    at org.apache.tools.ant.Target.execute(Target.java:341)
    at org.apache.tools.ant.Target.performTasks(Target.java:369)
    at org.apache.tools.ant.Project.executeTarget(Project.java:1214)
    at org.apache.tools.ant.Project.executeTargets(Project.java:1062)
    at org.apache.tools.ant.Main.runBuild(Main.java:673)
    at org.apache.tools.ant.Main.startAnt(Main.java:188)
    at org.apache.tools.ant.launch.Launcher.run(Launcher.java:196)
    at org.apache.tools.ant.launch.Launcher.main(Launcher.java:55)
    Total time: 8 seconds
    The following is the major parts from my ant build file:
    <path id="webservice.classpath">
    <pathelement location="${wls.home.dir}/server/lib/weblogic.jar"/>
    <pathelement location="${wls.home.dir}/server/lib/webservices.jar"/>
    </path>
    <target name = "initialize">
    <mkdir dir="${build.dir}"/>
    <mkdir dir="${class.dir}"/>
    <mkdir dir="${dist.dir}/${deploy.env}"/>
    <mkdir dir="${jdocs.dir}"/>
    <mkdir dir="${weblogic.application.dir}"/>
    <taskdef name="call"
    classpathref="antelope.classpath"
    classname="ise.antelope.tasks.Call"/>
    <taskdef name="if"
    classpathref="antelope.classpath"
    classname="ise.antelope.tasks.IfTask"/>
    <taskdef name="servicegen"
    classpathref="webservice.classpath"
    classname="weblogic.ant.taskdefs.webservices.servicegen.ServiceGenTask"/>
    <taskdef name="clientgen"
    classpathref="webservice.classpath"
    classname="weblogic.ant.taskdefs.webservices.clientgen.ClientGenTask"/>
    <taskdef name="source2wsdd"
    classpathref="webservice.classpath"
    classname="weblogic.ant.taskdefs.webservices.autotype.JavaSource2DD"/>
    <taskdef name="wldeploy"
    classpathref="webservice.classpath"
    classname="weblogic.ant.taskdefs.management.WLDeploy"/>
    </target>
    <target name="buildEar"
    depends="buildCommonJar, ejbc">
    <echo message ="[${module.name}] Checking to see if ${ear.file} is up to date...[${appc.classpath}]" />
    <source2wsdd
    javaSource="${webserviceServer_src_dir}/HelloWorld.java"
    ddFile="${descriptor.dir}/webservice/web-services.xml"
    serviceUri="/HelloWorld">
    <classpath refid="webservice.classpath" />
    </source2wsdd>
    <echo message ="[Done with buildEar]" />
    </target>

    Did you ever resolve this?

  • Error When Using Class :(

    Hey,
    Class:
    package
        import flash.display.MovieClip;
        import flash.events.Event;
        public class Main extends MovieClip
            public var enemyA:Array = [];
            public var birdA:Array = [];
            public var rowNum:int = 2;
            private var gap:int = 100;
            private var obj_no = 2;
            public var enemy1:mychar = new mychar();
            public var TheBird:BirdChar = new BirdChar();
            public function Main()
                // constructor code
                createEnemyF();
                createBirdF();
                this.addEventListener(Event.ENTER_FRAME,loopF);
            public function createEnemyF()
                for (var i:int = 0; i < rowNum; i++)
                    for (var j:int = 0; j < obj_no; j++)
                        enemy1.x = Math.random() * stage.stageWidth - enemy1.width;
                        enemy1.y = - i * (gap + enemy1.height) - 30.65;
                        enemyA.push(enemy1);
                        addChild(enemy1);
            public function createBirdF() {
                TheBird.x = 270.95;
                TheBird.y = 350.95;
                birdA.push(TheBird);
                addChild(TheBird);
            public function loopF(event:Event) {
                updateEnemyPositionsF();
                updateBirdPositionsF();
                hitTestF();
            public function updateEnemyPositionsF() {
                enemy1.y +=  2;
            public function updateBirdPositionsF() {
                TheBird.x = mouseX;
            public function hitTestF() {
                if(TheBird.hitTestObject(enemy1))
                    gotoAndPlay(5);
                    trace('The Bird Hit Enemy 1');
    This conflicts and causes this error:
    1046: Type was not found or was not a compile-time constant: MouseEvent
    ^ ^ Code repeats to all of my event listeners
    Thanks for your time.

    Thanks, i thought it might be this because of previous problems but i seen i already had : import flash.events.Event; so i thought that would be OK!
    Second Error:
    1180: Call to an undefined method Timer.
    I think this is the same sort of thing but what to import to fix this?
    So far these are my imports:
        import flash.display.MovieClip;
        import flash.events.Event;
        import flash.events.MouseEvent;
        import flash.events.TimerEvent;
    Thanks for helping.
    Date: Thu, 3 Nov 2011 05:36:22 -0600
    From: [email protected]
    To: [email protected]
    Subject: Error When Using Class
        Re: Error When Using Class
        created by markerline in Flash Pro - General - View the full discussion
    Looks like you imported events.Event but not events.MouseEvent (or some similar syntax) basically you must import MouseEvents separately from other Events.
         Replies to this message go to everyone subscribed to this thread, not directly to the person who posted the message. To post a reply, either reply to this email or visit the message page: http://forums.adobe.com/message/4005227#4005227
         To unsubscribe from this thread, please visit the message page at http://forums.adobe.com/message/4005227#4005227. In the Actions box on the right, click the Stop Email Notifications link.
         Start a new discussion in Flash Pro - General by email or at Adobe Forums
      For more information about maintaining your forum email notifications please go to http://forums.adobe.com/message/2936746#2936746.

  • Dbms_crypto - avoid error when using different key in lower environment

    Hello Experts,
    We are using Oracle 11.2.0.2. We are planning to implement dbms_crypto to encrypt few columns. We clone the data from production to lower environment ( DEV, QC).
    For the lower environments, we do not want to get the sensitive data from production and do not plan to use same key. Rather than getting an error when using differnt key, is it possible to get a different resultset back.
    In other words, we want the implementation to be same across environments but want to use a diffent key in lower environment and get different result (or garbage).
    Any suggestions would be greatly appreciated.
    While testing this logic, I am getting following error when using differnt key to decrypt. It works fine if I use same key.
    Error at line 1
    ORA-28817: PL/SQL function returned an error.
    ORA-06512: at "SYS.DBMS_CRYPTO_FFI", line 67
    ORA-06512: at "SYS.DBMS_CRYPTO", line 44
    ORA-06512: at line 19
    DECLARE
      l_credit_card_no    VARCHAR2(19) := '1234 5678 9012 3456';
      l_ccn_raw           RAW(128) := UTL_RAW.cast_to_raw(l_credit_card_no);
    l_key               RAW(128) := UTL_RAW.cast_to_raw('abcdefgh');
       l2_key               RAW(128) := UTL_RAW.cast_to_raw('12345678');
      l_encrypted_raw     RAW(2048);
      l_decrypted_raw     RAW(2048);
    BEGIN
      DBMS_OUTPUT.put_line('Original  : ' || l_credit_card_no);
      l_encrypted_raw := DBMS_CRYPTO.encrypt(src => l_ccn_raw,
                                             typ => DBMS_CRYPTO.des_cbc_pkcs5,
                                             key => l_key);
      DBMS_OUTPUT.put_line('Encrypted : ' || RAWTOHEX(UTL_RAW.cast_to_raw(l_encrypted_raw)));
      l_decrypted_raw := DBMS_CRYPTO.decrypt(src => l_encrypted_raw,
                                             typ => DBMS_CRYPTO.des_cbc_pkcs5,
                                             key => l2_key); --**Using different key to decrypt
      DBMS_OUTPUT.put_line('Decrypted : ' || UTL_RAW.cast_to_varchar2(l_decrypted_raw));
    END;Thank you.

    If I understand what you are trying to do ... and I may not ... it is not going to work.
    SQL> DECLARE
      2   l_credit_card_no VARCHAR2(19) := '1612-1791-1809-2605';
      3   l_ccn_raw RAW(128) := utl_raw.cast_to_raw(l_credit_card_no);
      4   l_key1     RAW(128) := utl_raw.cast_to_raw('abcdefgh');
      5   l_key2     RAW(128) := utl_raw.cast_to_raw('zyxwvuts');  -- alternate key used to attempt a different decryption
      6 
      7   l_encrypted_raw RAW(2048);
      8   l_decrypted_raw RAW(2048);
      9  BEGIN
    10    dbms_output.put_line('Original : ' || l_credit_card_no);
    11 
    12    l_encrypted_raw := dbms_crypto.encrypt(l_ccn_raw, dbms_crypto.des_cbc_pkcs5, l_key1);
    13 
    14    dbms_output.put_line('Encrypted : ' || RAWTOHEX(utl_raw.cast_to_raw(l_encrypted_raw)));
    15 
    16    l_decrypted_raw := dbms_crypto.decrypt(src => l_encrypted_raw, typ => dbms_crypto.des_cbc_pkc
    s5, key => l_key1);
    17 
    18    dbms_output.put_line('Key1 : ' || utl_raw.cast_to_varchar2(l_decrypted_raw));
    19 
    20    l_decrypted_raw := dbms_crypto.decrypt(src => l_encrypted_raw, typ => dbms_crypto.des_cbc_pkc
    s5, key => l_key2);
    21 
    22    dbms_output.put_line('Key2 : ' || utl_raw.cast_to_varchar2(l_decrypted_raw));
    23  END;
    24  /
    Original : 1612-1791-1809-2605
    Encrypted : 3534443342333642353141363846384237463732384636373943374630364234323243334539383042323135
    Key1 : 1612-1791-1809-2605
    DECLARE
    ERROR at line 1:
    ORA-28817: PL/SQL function returned an error.
    ORA-06512: at "SYS.DBMS_CRYPTO_FFI", line 67
    ORA-06512: at "SYS.DBMS_CRYPTO", line 44
    ORA-06512: at line 20

  • Error when using Oracle Migration WorkBench (Sql Server 2k to Oracle 8i)

    I'm trying to migrate a Sql Server 2k database to an Oracle 8i schema using OMWB. After using BCP to collect metadata information on the source database, I tried to capture the source data model and got a "Capture aborted" message on the progress screen (even though then it appears a dialog window reporting "0 errors and 0 warnings", funny!). Down there is the error log OMWB generated. After reading some posts, I changed some columns of the OMWB dictionary that holds the source database name, but still got the same error. If someone can enlighten me on this toppic, I'd greatly appreciated it.
    Here's the error log of OMWB:
    ** Oracle Migration Workbench
    ** Production
    ** ( Build 20050629 )
    ** OMWB_HOME: D:\Datos\Download\Oracle\Oracle Migration Workbench\omwb
    ** user language: es
    ** user region: null
    ** user timezone:
    ** file encoding: Cp1252
    ** java version: 1.4.2_04
    ** java vendor: Sun Microsystems Inc.
    ** o.s. arch: x86
    ** o.s. name: Windows 2000
    ** o.s. version: 5.0
    ** Classpath:
    ..\lib\boot.jar
    ** Started : Fri Feb 23 17:18:48 GMT-03:00 2007
    ** Workbench Repository : Oracle8i Enterprise Edition Release 8.1.6.0.0 - Production
    With the Partitioning option
    JServer Release 8.1.6.0.0 - Production
    Repository Connection URL: jdbc:oracle:thin:@ServerCms:1521:sigcewbc
    ** The following plugins are installed:
    ** Microsoft Access 2.0/95/97/2000/2002/2003 Plugin, Production Release 10.1.0.4.0
    ** Microsoft SQLServer 2000 Plugin, Production Release 10.1.0.4.0
    ** Microsoft SQLServer 6.5 Plugin, Production Release 10.1.0.4.0
    ** Microsoft SQLServer 7.0 Plugin, Production Release 10.1.0.4.0
    ** Active Plugin : SQLServer2K
    EXCEPTION :SQLServer2KDisconnSourceModelLoad.loadSourceModel(): oracle.mtg.migration.MigrationStopException: java.lang.IndexOutOfBoundsException: Index: 15, Size: 15
    ** Shutdown : Fri Feb 23 18:00:50 GMT-03:00 2007

    Duplicate thread
    Error when using Oracle Migration WorkBench (Sql Server 2k to Oracle 8i)

  • ABAP Runtime error when using RSPC

    Hi Team,
    I am getting ABAP runtime error when using RSPC in my system.For the same user id in other systems this transaction  is working fine.Pls help me.
    regds
    Sha

    Hello Sha Han,
    What is the runtime error you are getting?
    Please check the authorization also for the user in that system
    Thanks
    Chandran

  • RPC Server not Available error when using Windows Fax & Scan under Windows 7

    RPC Server not Available error when using Windows Fax & Scan under Windows 7

    Hi,
    On current situation, please remove the old fax account and re-add a new fax account in Windows Fax and Scan, then check if this issue sill exist. For more details, please refer to following similar thread and artilces.
    RPC Server not Available error when using Windows Fax & Scan
    under Windows
    The local fax account is inaccessible after you rename a Windows Vista-based computer
    Cannot send fax from Windows Vista/Windows 7 PC with “RPC Server not Available” error message
    Note: Microsoft is providing this information as a convenience to you. The sites are not controlled by Microsoft. Microsoft cannot make any representations regarding the quality, safety, or suitability of any software or information found there. Please
    make sure that you completely understand the risk before retrieving any suggestions from the above link.
    If any update, please feel free to let me know.
    Best regards,
    Justin Gu
    Please remember to mark the replies as answers if they help and unmark them if they provide no help. If you have feedback for TechNet Support, contact [email protected]

  • Weblogic 9.2 error when using spring framework and taglibs.

    I am getting the following error when using spring binding for a command form class.
    Class ExCommandForm
    private String firmCode;
    public String getFirmCode ()
    public void setFirmCode ()
    In my jsp I have the following
    <spring:bind path="exCommandForm.firmCode">
    <input name="<c:out value="${status.expression}"/>" type="text" value="<c:out value="${status.value}"/>" >
    </spring:bind>
    Ps. exCommandForm is the commandForm declaration in my SiimpleFormController.
    When I deploy the application to weblogic 9.2 I get the following error :
    <Apr 26, 2007 4:34:44 PM BST> <Error> <HTTP> <BEA-101017> <[weblogic.servlet.int
    [email protected] - appName: 'BDRui', name: 'BDRui', context-pa
    th: '/BDRui'] Root cause of ServletException.
    java.lang.ClassCastException: javax.servlet.jsp.jstl.core.LoopTagSupport$1Status
    at jsp_servlet._web_45_inf._jsp.__tradesearch._jspService(__tradesearch.
    java:1075)
    at weblogic.servlet.jsp.JspBase.service(JspBase.java:34)
    at weblogic.servlet.internal.StubSecurityHelper$ServletServiceAction.run
    (StubSecurityHelper.java:225)
    at weblogic.servlet.internal.StubSecurityHelper.invokeServlet(StubSecuri
    tyHelper.java:127)
    at weblogic.servlet.internal.ServletStubImpl.execute(ServletStubImpl.jav
    a:283)
    Ps. Deploying application on Tomcat 5.23 works.
    Can anyone help on this ?
    cheers in advance.
    More Info - Using Weblogic 9.2 on UNIX, servlet 2.4, jstl 1.1
    regards
    Edited by kings_citi at 04/26/2007 9:03 AM
    Edited by kings_citi at 04/26/2007 10:35 AM
    Edited by kings_citi at 04/26/2007 10:36 AM

    The problem doesn't look like it has anything to do with wappers per se. The stack indicates that the JVM died when the persistent store tried to invoke a standard Java synchronize operation. JVM crashes need to be analyzed by a JVM expert, so I second the suggestion to solicit help from JVM experts and/or filing a case with customer support. In the mean-time, you can probably work-around the issue by either (A) ensuring you have a recent version of the JVM installed, or (B) temporarily switching to the Sun JVM.
    Regards,
    tom
    Edited by: TomB on Sep 17, 2010 2:33 PM

  • Error when using findbykey method

    hi am having this error when using below method cannot assign of type sms1405.common.agrROW TO variable of type oracle.jbo.row[]. type 'oracle.jbo.row[]' excepected but 'sms1405.common.agRROW' found the error is in this line agrRows = (AGRRow)agrRows[0]; the methos is
    am using this sample
    http://amulyamishras-tech-blog.blogspot.com/2011/01/viewobject-getrow-vs-findbykey.html
    where does EmpVORow in EmpVORow empRow =
    (EmpVORow)EmpVO.getRow(key); define from above sample
    where does EmpVO from EmpVORow empRow =
    (EmpVORow)EmpVO.getRow(key); define from above sample
    am in Jdeveloper 11.1.2.1.0
    Edited by: Tshifhiwa on 2012/07/03 4:36 PM

    Man, you should be able to find this out your self by now!
    Hint: there is one 's' too much in the line you get the error (i guess cut & past error)
    Try to understand the code you copied!
    Timo

Maybe you are looking for