Error while calling pscp.exe through a batch file which is called in SSIS Execute Process Task

Hi,
I am using Windows Server 2012 R2 Standard, SSIS 2012. I am trying to copy files from a remote location by calling pscp.exe through a batch file (FileCopy.bat at location M:\bin\) which is referenced in a SSIS Execute Process Task. My batch file content
is,
ECHO OFF
echo. >> M:\Prod\bin\SourceFile_FileLog.txt
echo %date% - %time% - Copy Start (XYZ_a201211155952avx0_69999.NOR.gz) >> M:\Prod\bin\SourceFile_FileLog.txt
M:\ProdFiles\bin\pscp.exe -unsafe -scp -pw aaaaa [email protected]:/ABC_data/*.NOR.gz M:\Prod\FromMediation\
echo %date% - %time% - Copy Complete >> M:\Prod\bin\SourceFile_FileLog.txt
The error I am getting is 
[Execute Process Task] Error: In Executing "M:\bin\FileCopy.bat" "" at "", The process exit code was "1" while the expected was "0".
Exactly same setup but using Windows Server 2003 R2 Enterprise and SSIS 2005, this works fine and copies the files successfully.
Please provide some guidance on this.
Thank you!
'In Persuit of Happiness' and ..... learning SQL.

Hi,
This is what I am getting while running the batch file from command prompt
M:\bin\mttrb1>CDR_FileCopy
M:\bin\mttrb1>ECHO OFF
The system cannot find the path specified.
The system cannot find the path specified.
scp: M:\Prod\FromMediation\: Cannot create file
scp: M:\Prod\FromMediation\: Cannot create file
scp: M:\Prod\FromMediation\: Cannot create file
The system cannot find the path specified.
'In Persuit of Happiness' and ..... learning SQL.

Similar Messages

  • Ssis execute process task error: process exit code was 1 while the expected was 0

    Hi Sir,
    in my SSIS Package(2012) i am using Execute Process Task which will call bat file.  bat file is located on UNC Path.i am having  the below script in the batch file.
     del \\servername\foldername\name.txt
     rcmd \\servername D:\name1.bat
     del \\servername\foldername\name2.txt
    xcopy \\servername\foldername\file.txt   \\server\foldername\outfilefolder
    i am getting the below error message:
    ssis execute process task error:  process exit code was 1 while the expected was 0
    i want know at what cases error exit code was 1?
    Thanks for your time.

    Hi prasad.alm,
    The error is generic and can be caused by various factors. Here are some suggestions for your reference:
    Manually run the executable to execute the batch file so that we can check whether the command lines in the batch file are correct or not.
    Check there are no duplicate/existing files in the destination folder.
    Try to run the package in 32-bit or 64-bit runtime mode.
    If the issue occurs when running a job, try to create a CmdExec type job step to call the excutable. If this job also fails, it might be an issue between executable and SQL Server Agent rather than the SSIS package itself.
    If the issue persists, enable logging for the package, and check if we can obtain more detailed error message for further analysis.
    Regards,
    Mike Yin
    TechNet Community Support

  • SSIS-Execute Process task Error in 2012 version _File/Process "\\Servername\Foldername\batfile.bat" is not in path

    Hi Sir,
    I have develop the SSIS Package in 2012 version and i am calling the SSIS Package using Stored Procedure according to my requirement and that stored procedure will be using in my SSRS report Datasource.
    once after the SSIS Pacakge has design and develop and deploy into the server as Project Deployment model..when i run the ssis Package ,calling through the SP it is working fine...
    even when i design a SSRS report  using SSDT(sql server data tools),  in the SSRS reprot calling the above SP in Dataset.when i execute the SSRS report it is wroking fine...
    once SSRS report has been deployed into the  remote Server.. when i Execute the SSRS report i am getting the below Error message:
    SSIS-Execute Process task Error  _File/Process "\\Servername\Foldername\batfile.bat" is not in path
    belo is the SP for calling the SSIS package.
    DECLARE @EXECUTION_ID BIGINT,
            @PKG_RESULT INT
    EXEC [SSISDB].[CATALOG].[CREATE_EXECUTION] @PACKAGE_NAME=N'abc.DTSX',
                                               @[email protected]_ID
    OUTPUT,
                                               @FOLDER_NAME=N'aa',
                                               @PROJECT_NAME=N'xxx',
                                               @USE32BITRUNTIME=FALSE,
                                               @REFERENCE_ID=29 --unique identifier for environment
    EXEC [SSISDB].[CATALOG].[START_EXECUTION] @EXECUTION_ID

    Where the BAT part is ?
    It looks like a security issue.
    The account running has no permission apparently over "\\Servername\Foldername\batfile.bat"
    Arthur My Blog

  • NOT able to call exe in ssis execute process task

    I am creating an SSIS package in which we execute an exe file from the EXECUTE PROCESS COMPONENT which contains the logics and uses few sp’s which checks the expiry dates of the certificates of some URL's. But when we keep the file on sever and run it through
    TWS it is showing the error "FILE NOT IN PATH" .But if we keep the exe file in local path then it executes through TWS. If we run the package locally without TWS then it runs successfully no matter if the exe is in local path or placed in a shared
    server folder. So i want to know is there any constraints in running the EXE file from the shared folder through TWS.
    Note:
    1.TWS- IBM Tivoli workload scheduler to call and execute ssis packages
    2. TWS is install in different server (Like server A)
    3. SSIS package and exe file located in different server (Like server B)
    4. We are using dynamic path in SSIS package to locate SSIS package and exe file.

    Hi SR_MCTS,
    According to your description, a package that execute an exe file with Execute Process Task can be executed successfully without using TWS or the exe file stores in local path with TWS. While it fails when use TWS to execute the package with the exe file
    stores in shared folder.
    If in this scenario, it seems that the logon user that use TWS to execute the package has no access to the shared folder. We can logon as the relevant account or change some relevant settings on TWS to make sure the user has access to shared folder which
    hosts the exe file.
    Besides, since I’m not familiar with TWS, I’m not sure whether the issue is caused by there are some constraints in running the exe file from the shared folder through TWS. As to this issue about TWS, I suggest you post the question in the following forum:
    https://www.ibm.com/developerworks/community/forums/html/forum?id=11111111-0000-0000-0000-000000002658&tags=tws. It is appropriate and more experts will assist you.
    Thank you for your understanding.
    Regards,
    Katherine Xiong
    Katherine Xiong
    TechNet Community Support

  • SSIS execute process task error on unziping

    Hi
    I am using 7zip to unzip files in SSIS using execute process task. Here is the configuration of the task:
    executable: C:\Program Files\7-Zip\7z.exe
    arguments: e default-o\\servername\livechat\unzip\
    However, on executing package in BIDS, following error is thrown
    [Execute Process Task] Error: In Executing "C:\Program Files\7-Zip\7z.exe" "e \\servername\livechat\7566_20121009.zip-o\\servername\livechat\unzip\" at "", The process exit code was "2" while the expected was "0".
    Can someone help where I made mistake?
    Thanks,
    hsbal

    I have mapped the share to F: and then tested. Unfortunately that doesnt work as well.
    I am getting the following error:
    [Execute Process Task] Error: In Executing "C:\Program Files\7-Zip\7z.exe" " F:\*.zip    -o F:\unzip" at "", The process exit code was "7" while the expected was "0".
    Thanks,
    hsbal
    Seems like a syntax error. Go through this
    http://www.dotnetperls.com/7-zip-examples
    Rajkumar

  • SSIS-Execute Process task Error _File/Process "\\Servername\Foldername\batfile.bat" is not in path

    Hi Sir,
    I have designed the SSIS Package in 2012 Version. and i have deployed into the Integration Server,using Project Deployment Model.
    In the SSIS Pacakge we are calling the batch file using Execute Process task.
    when i am Executing the SSIS pacakge using Visual Studio(Sql Server Data tools) which is working fine.
    When i Execute the Pacakge uisng Sql server Management Studio,after the Deployment i am getting the below Error message.
    ExecProcess task:Error: File/Process "\\Servername\Foldername\batfile.bat" is not in path.
    Thanks for your time.
    Regards
    Prasad

    Hi Prasad,
    When you say executing the package in SSMS, I think you right click on the package and execute it manually rather than execute it through SQL Server Agent job, right? How did you execute the package from the SSMS on DEV server? Have your also deployed the
    SSIS project to the SSISDB catalog on DEV server or you used SSMS tool on DEV to connect to the QA server to execute the package?
    When you log into the Database Engine instance, make sure the credentials you used has access on the shared folder which hosts the .bat file. Besides, I think the issue may be caused by the Windows UAC feature which may lower the permissions level of an
    administrator to a standard user. So, I suggest that you run the SSMS as administrator to see if it works.
    Regards,
    Mike Yin
    TechNet Community Support

  • How to run a java program via a batch file,which is called from a webserver

    REM This batch file runs the Spider with the [-v] option.
    REM Lines 51 through 54 are simple DOS commands..they call the Spider
    REM The location of the Spider package is the important piece of information here...
    REM a batch file has access to the whole computer where the server resides.
    setlocal
    set JDK=C:\j2sdk1.4.1_01
    set PATH=%JDK%\bin;.;%PATH%
    CLASSPATH=%JDK%\jre\lib\*.jar;.;%JDK%\jre\lib\ext\*.jar;.;%CLASSPATH%
    java spiderpackage.EntryPoint -v
    endlocal
    I am trying to call this batch file from my web server but I am unable to capture the result.I tried to append the result to a file but It writes nothing to it.What should I do to proceed?

    I am not entirely sure if this is analogous, but I once wrote a PHP script uner Linux that invokes java and returning the output. I found that it was necessary to pipe the output of the Java program from stderr to stdout in order to properly receive it in PHP. The command would be as follows:
    java spiderpackage.EntryPoint -v 2>&1
    The pipe syntax (2>&1) should be exactly the same under MSDOS. So add that, and then continue as normal (appending it to a file or whatever else you want to do). Hope that helps

  • Pass Passord Variable to a Batch File using Execute Process Task

    I have an FTP batch file that I want to execute using Execute Process Task. The content of the ftp (ftpscript.cmd) is as below:
    open ftpsite
    UserName
    Password
    ASCII
    get file  c:\temp\test.txt
    bye
    Using SSIS Execute process task, I was able to download data. I configured the Execute Process task as follows:
    Executable: ftp.exe
    Arguments: -s:"c:\temp\ftpscript.cmd"
    The above works fine. But the problem is that I don't want to store the password value in the batch file for security/policy reasons. Please, is there a way I can pass the password value to the ftp executable or the batch file at run time?
    I know how to get and store variables in SSIS but I don't know how to pass this kind of variable to the batch file just before execution.
    Any suggestions will be appreciated. Thanks.

    you can dynamically generate the source (CMD) for the FTP and delete after the execution. The password can be stored in a secure database for example, not 100 % secure, but the best you can do.
    Another option I did was an encrypted VBScript (also quite easy to open in plain text to some people).
    Finally it can be a binary e.g. an EXE with the FTP called as process in it.
    Arthur My Blog

  • Getting error while running sapinst.exe

    Hi Gurus,
    I have an error while running sapinst.exe.
    ===============================
    Error: Home directory is not available for user sapsdt
    Opened sylib722.dll
    exe dir is I:\usr\sap\***\tmp\3\sapinst_exe.10440.1359197818
    MessageLib initialized successfully.
    Creating file I:\usr\sap\***\tmp\3\sapinst_exe.10440.1359197818\dev_sap_kernel_test_26_Jan_2013_05_57_02.
    Removed file I:\usr\sap\***\tmp\3\sapinst_exe.10440.1359197818\dev_sap_kernel_test_26_Jan_2013_05_57_02.
    Initialized SAP kernel tracing to file I:\usr\sap\***\tmp\3\sapinst_exe.10440.1359197818\dev_sap_kernel
    Opened I:\usr\sap\PD3\tmp\3\sapinst_exe.10440.1359197818/iaguieng722.dll
    Initialized SAP kernel tracing to file dev_sap_kernel
    receiving and sending on port 21200
    existence check for user PD3ADM returned true.
    inserted account (***ADM, S-1-5-21-2072974133-1425365782-667646791-181569, USER) into the accountcache.
    Account sapsdt has ADS path 'WinNT://US5885SPAD/sapsdt'
    existence check for user sapsdt returned true.
    inserted account (sapsdt, S-1-5-21-1572296251-1555274763-1146236042-1004, USER) into the accountcache.
    Password set for account sapsdt.
    Environment variable SAPINST_JRE_HOME set to value 'I:/usr/sap/***/tmp/3/sapinst_exe.10440.1359197818/jre'.
    System call failed. Error 2 (The system cannot find the file specified.
    ) in execution of system call 'ATL::CRegKey::Open' with parameter (hKeyParent, SOFTWARE\Microsoft\Windows NT\CurrentVersion\ProfileList\S-1-5-21-1572296251-1555274763-1146236042-1004, 0x20019), line (95) in file (d:\depot\bas\720_rel\bc_720-2_rel\gen\optu\ntamd64\ins\sapinst\impl\src\syslib\synxcos.hpp), stack trace: sixxbmanagement.cpp: 2573: CSiComponentSet::startGUI()
    syxxbuser.cpp: 92: *** syslib entry point CSyUser::getHomeDirectoryPath(void) const ***
    synxcuser.cpp: 763: CSyPath CSyUserImpl::getHomeDirectory() const
    synxcuser.cpp: 671: CSyUserImpl::getProfileDirectory() const
    d:\depot\bas\720_rel\bc_720-2_rel\gen\optu\ntamd64\ins\sapinst\impl\src\syslib\synxcos.hpp: 87: CSyRegKey::sap_open(HKEY hKeyParent, const iastring & keyName, REGSAM samDesired)
    Exception thrown near line 95 in file d:\depot\bas\720_rel\bc_720-2_rel\gen\optu\ntamd64\ins\sapinst\impl\src\syslib\synxcos.hpp
    Stack trace:
    sixxbmanagement.cpp: 2573: CSiComponentSet::startGUI()
    syxxbuser.cpp: 92: *** syslib entry point CSyUser::getHomeDirectoryPath(void) const ***
    synxcuser.cpp: 763: CSyPath CSyUserImpl::getHomeDirectory() const
    synxcuser.cpp: 671: CSyUserImpl::getProfileDirectory() const
    d:\depot\bas\720_rel\bc_720-2_rel\gen\optu\ntamd64\ins\sapinst\impl\src\syslib\synxcos.hpp: 87: CSyRegKey::sap_open(HKEY hKeyParent, const iastring & keyName, REGSAM samDesired)
    At line 95 file d:\depot\bas\720_rel\bc_720-2_rel\gen\optu\ntamd64\ins\sapinst\impl\src\syslib\synxcos.hpp
    Call stack:
    sixxbmanagement.cpp: 2573: CSiComponentSet::startGUI()
    ======================================
    can someone please help me out for error.
    Thanks in advance

    check user profile in AD, add a path in the user profile Home folder directory of user SAPSDT, restart sapinst.

  • Error on /SafeMode: error while trying to run project uncaught exception thrown by method called

    i try run VS 2012 with /SafeMode. I create new empty Winform. When I start debug, I got:
    "error while trying to run project uncaught exception thrown by method called through reflection"

    Hi Matanya Zac,
    Did you restart your machine? How about installing the VS2012 update 4?
    >>error while trying to run project uncaught exception thrown by method
    Did you install the VS update in your VS IDE? I met this issue before which was related to the VS update:
    https://social.msdn.microsoft.com/Forums/vstudio/en-US/5ead8ee9-ea09-4060-88b0-ee2e2044ff82/error-while-trying-to-run-a-project-uncaught-exception-thrown-by-method-called-through-reflection?forum=vsdebug
    If still no help, I suggest you repair your VS, and then restart your machine, test the result.
    Best Regards,
    Jack
    We are trying to better understand customer views on social support experience, so your participation in this interview project would be greatly appreciated if you have time. Thanks for helping make community forums a great place.
    Click
    HERE to participate the survey.

  • Error while compiling the composite through custom ant script

    Hi,
    I am getting the following error while compiling the composite through custom built ant scripts which are intern call the ant-sca-package.xml. And the composite is created by upgrading the 10g bpels. But the same composite is successfully compiling from Jdeveloper (11.1.1.4).
    oad of wsdl "oramds:/soa/shared/workflow/NotificationService.wsdl" failed
    oracle.fabric.common.FabricException: Error in getting XML input stream: oramds:/soa/shared/workflow/NotificationService.wsdl: oracle.mds.exception.MDSException: MDS-00054: The file to be loaded oramds:/soa/shared/workflow/NotificationService.wsdl does not exist.
         at oracle.fabric.common.metadata.MetadataManagerImpl.getInputStreamFromAbsoluteURL(MetadataManagerImpl.java:280)
         at oracle.integration.platform.common.MDSMetadataManagerImpl.getInputStreamFromAbsoluteURL(MDSMetadataManagerImpl.java:555)
         at oracle.fabric.common.metadata.MetadataManagerImpl.getDocumentAsInputStream(MetadataManagerImpl.java:159)
         at oracle.integration.platform.common.MDSMetadataManagerImpl.getDocumentAsInputStream(MDSMetadataManagerImpl.java:417)
         at oracle.fabric.common.wsdl.WSDLManager.loadWSDL(WSDLManager.java:241)
         at oracle.fabric.common.wsdl.WSDLManager.loadWSDL(WSDLManager.java:304)
         at oracle.soa.scac.ValidateComposite.loadWSDLs(ValidateComposite.java:934)
         at oracle.soa.scac.ValidateComposite.doValidation(ValidateComposite.java:491)
         at oracle.soa.scac.ValidateComposite.run(ValidateComposite.java:150)
         at oracle.soa.scac.ValidateComposite.main(ValidateComposite.java:135)
    Caused by: java.io.IOException: oracle.mds.exception.MDSException: MDS-00054: The file to be loaded oramds:/soa/shared/workflow/NotificationService.wsdl does not exist.
         at oracle.mds.internal.net.AbstractOraMDSURLConnection.getPDocStream(AbstractOraMDSURLConnection.java:388)
         at oracle.mds.internal.net.AbstractOraMDSURLConnection.getInputStream(AbstractOraMDSURLConnection.java:176)
         at oracle.mds.internal.net.OraMDSURLConnection.getInputStream(OraMDSURLConnection.java:67)
         at java.net.URL.openStream(URL.java:1010)
         at oracle.fabric.common.metadata.MetadataManagerImpl.getInputStreamFromAbsoluteURL(MetadataManagerImpl.java:276)
         ... 9 more
    Caused by: oracle.mds.exception.MDSException: MDS-00054: The file to be loaded oramds:/soa/shared/workflow/NotificationService.wsdl does not exist.
         at oracle.mds.internal.net.AbstractOraMDSURLConnection.getPDocStream(AbstractOraMDSURLConnection.java:339)
    And in the following blog, its recommended to check for the adf-config.xml. But when upgrading the bpels from 10g to 11.1.1.4, I don't see any such file created by Jdeveloper.
    http://orasoa.blogspot.com/2010/08/ant-and-mds-composite-compile-error.html
    Not sure if I am missing some properties to add in by custom script while compiling.
    Thanks
    Sree
    Edited by: Sree on Jul 4, 2011 7:25 AM

    Hi Hussain,
    Thanks for the reply.
    Were you able to compile the form at the client side successfully?
    1) Were you able to compile the form at the client side successfully?:
    Ans: Yes, I was able to compile the form successfully at client side.
    2) Are you logged in as applmgr user? Have you sourced the application env file before compiling the form?
    Ans: No, I have not logged by applmgr user, i am using my own login. Yes I have sourced the application env file before compiling the form
    3) What does "echo $FORMS_PATH" return?
    Ans: echo $FORMS_PATH on server gives this path
    /u01/app/EBS00/apps/apps_st/appl/au/12.0.0/resource:/u01/app/EBS00/apps/apps_st/appl/au/12.0.0/resource/stub
    Can you please advise?
    Thanks,

  • Error while running web application through JDEV (10.1.3.0.3) in OC4J

    Error while running web application through JDEV (10.1.3.0.3) in OC4J.
    Here is the error message.
    07/10/02 14:45:28 Exception in thread "OC4J Launcher" oracle.classloader.util.AnnotatedNoClassDefFoundError:
         Missing class: javax.xml.bind.JAXBContext
         Dependent class: com.oracle.corba.ee.impl.orb.config.InternalSettingsORBConfigImpl
         Loader: oc4j:10.1.3
         Code-Source: /C:/jdev/j2ee/home/lib/oc4j-internal.jar
         Configuration: <code-source> in boot.xml in C:\jdev\j2ee\home\oc4j.jar
    The missing class is not available from any code-source or loader in the server.
    07/10/02 14:45:28      at oracle.classloader.PolicyClassLoader.handleClassNotFound (PolicyClassLoader.java:2073) [C:/jdev/j2ee/home/lib/pcl.jar (from system property java.class.path), by [email protected]]
         at oracle.classloader.PolicyClassLoader.internalLoadClass (PolicyClassLoader.java:1681) [C:/jdev/j2ee/home/lib/pcl.jar (from system property java.class.path), by [email protected]]
         at oracle.classloader.PolicyClassLoader.loadClass (PolicyClassLoader.java:1633) [C:/jdev/j2ee/home/lib/pcl.jar (from system property java.class.path), by [email protected]]
         at oracle.classloader.PolicyClassLoader.loadClass (PolicyClassLoader.java:1618) [C:/jdev/j2ee/home/lib/pcl.jar (from system property java.class.path), by [email protected]]
         at java.lang.ClassLoader.loadClassInternal (ClassLoader.java:319) [jre bootstrap, by jre.bootstrap]
         at com.oracle.corba.ee.impl.orb.config.InternalSettingsORBConfigImpl.init (InternalSettingsORBConfigImpl.java:46) [C:/jdev/j2ee/home/lib/oc4j-internal.jar (from <code-source> in boot.xml in C:\jdev\j2ee\home\oc4j.jar), by oc4j:10.1.3]
         at com.oracle.corba.ee.impl.orb.config.SunRIORBConfigImpl.init (SunRIORBConfigImpl.java:97) [C:/jdev/j2ee/home/lib/oc4j-internal.jar (from <code-source> in boot.xml in C:\jdev\j2ee\home\oc4j.jar), by oc4j:10.1.3]
         at com.oracle.iiop.server.IIOPServerExtensionProvider.configureOrb (IIOPServerExtensionProvider.java:26) [C:/jdev/j2ee/home/lib/oc4j-internal.jar (from <code-source> in boot.xml in C:\jdev\j2ee\home\oc4j.jar), by oc4j:10.1.3]
         at com.oracle.corba.ee.impl.orb.ORBServerExtensionProviderImpl.preInitApplicationServer (ORBServerExtensionProviderImpl.java:45) [C:/jdev/j2ee/home/lib/oc4j-internal.jar (from <code-source> in boot.xml in C:\jdev\j2ee\home\oc4j.jar), by oc4j:10.1.3]
         at com.evermind.server.ApplicationServer.serverExtensionPreInit (ApplicationServer.java:1031) [C:/jdev/j2ee/home/lib/oc4j-internal.jar (from <code-source> in boot.xml in C:\jdev\j2ee\home\oc4j.jar), by oc4j:10.1.3]
         at com.evermind.server.ApplicationServer.setConfig (ApplicationServer.java:861) [C:/jdev/j2ee/home/lib/oc4j-internal.jar (from <code-source> in boot.xml in C:\jdev\j2ee\home\oc4j.jar), by oc4j:10.1.3]
         at com.evermind.server.ApplicationServerLauncher.run (ApplicationServerLauncher.java:98) [C:/jdev/j2ee/home/lib/oc4j-internal.jar (from <code-source> in boot.xml in C:\jdev\j2ee\home\oc4j.jar), by oc4j:10.1.3]
         at java.lang.Thread.run (Thread.java:595) [jre bootstrap, by jre.bootstrap]

    Hi,
    The guide you were refering was pointing to 10.1.2 wizards.
    For the latest 10.1.3 tutorial, please follow the below tutorial link :
    http://www.oracle.com/technology/products/jdev/101/tutorials/WS/WSandAScontrol.htm
    Hope this helps,
    Sunil..

  • Error while running 'ldifde.exe' to import the schema file

    Hello,
    I'm doing a practical in exchange server. I have two servers, First one is the domain controller it's a Server 2012 R2 and the Second one is the server planing to install exchange 2010. it has server 2008 R2. My issue is when i'm trying to setup Exchange
    Server 2010 it comes error while installing "error while running 'ldifde.exe' to import the schema file" I tried to fix but i couldn't. Please if anyone know about this error give me a solution. 
    Regards.
    Ashane Deshapriya ( MCP )

    Can you run these commands from an elevated powershell and try to install exchange. 
    Import-Module ServerManager
    Add-WindowsFeature NET-Framework,RSAT-ADDS,Web-Server,Web-Basic-Auth,Web-Windows-Auth,Web-Metabase,Web-Net-Ext,Web-Lgcy-Mgmt-Console,WAS-Process-Model,RSAT-Web-Server,Web-ISAPI-Ext,Web-Digest-Auth,Web-Dyn-Compression,NET-HTTP-Activation,RPC-Over-HTTP-Proxy -Restart
    If that also fails please post the error.
    Thanks, MAS
    Please mark as helpful if you find my comment helpful or as an answer if it does answer your question. That will encourage me - and others - to take time out to help you.

  • Cannot overcome Exchange Server 2013 Install Error - "There was an error while running 'ldifde.exe' to import the schema file

    Hello,
    I am attempting to install Exchange 2013 on to a 2008R2 Server on a domain running 2008R2 DC's.  I have worked every error resolution I can find, but I can't get past this error.
    Error:
    The following error was generated when "$error.Clear();
    install-ExchangeSchema -LdapFileName ($roleInstallPath + "Setup\Data\"+$RoleSchemaPrefix + "schema27.ldf")
    " was run: "There was an error while running 'ldifde.exe' to import the schema file 'C:\Windows\Temp\ExchangeSetup\Setup\Data\schema27.ldf'. The error code is: 8224.
    Any assistance is appreciated.

    Are you running the installation from an ISO-file?
    If so, then copy the files (preferably
    Exchange 2013 w. SP1) to the local disk
    and run the install with elevated privileges.
    Martina Miskovic

  • Error while Submiting Support message through Web browser

    Hi Gurus
    I am geting error while submiting Support message through Web browser i.e BSP . Please find the error message below
    "Error: The system could not create the message because of an RFC connection "NONE " error Service-specific Csutomizing missing for transaction ZLFN"
    Note: ZLFN is our Service Desk Message type.
    Any ideas where i am doing wrong?
    Points will be rewarded
    Thanks
    Bhaskar

    Hello,
    check if when you configured your new transaction type ZLFN you have included a corresponding entry in view CRMC_SERVICE_H.
    If the transaction type is missing in this view, you have this error.
    Regards,
    Raquel Cunha

Maybe you are looking for