Error while trying to deploy a SOAP service to 9iAS

Hi,
I try to deploy the simple clock sample to Oracle 9iAS 9.0.3 and I get the following output:
This test uses a SOAP URL of http://avia.mindcti.com:7777/soap/servlet/soaproute
r
Deploying the simpleclock service...
Exception in thread "main" [SOAPException: faultCode=SOAP-ENV:IOException; msg=C
onnection refused: connect; targetException=java.net.ConnectException: Connectio
n refused: connect]
at oracle.soap.transport.http.OracleSOAPHTTPConnection.send(OracleSOAPHT
TPConnection.java:765)
at org.apache.soap.rpc.Call.invoke(Call.java:261)
at oracle.soap.client.ServiceManagerClient.invokeMethod(ServiceManagerCl
ient.java:122)
at oracle.soap.client.ServiceManagerClient.deploy(ServiceManagerClient.j
ava:135)
at oracle.soap.client.ServiceManagerClient.main(ServiceManagerClient.jav
a:229)
I get similar errors when trying to connect to the SOAP server from JDeveloper. What can be the problem?
Thanks in advance,
Avi

In 903 Oracle SOAP ( based on Apache SOAP) is not configured by deafult, since Oracle SOAP is a depricated feature;
Prefered way of building web services is using 'J2EE Web services'. But if you stilll want to use Oracle SOAP web services
You need to depoy the Oracle SOAP application that is there in soap directory.
thanks
Venky Ravipati

Similar Messages

  • Compilation Error while trying to Deploy my Web Service

    My main problem right now is that I can build my classes without error but when it is time to deploy the web service with Jdeveloper I am getting a compilation error without to get info about what is the error itself:
    Started application : RTAService-RTAService-WS
    Binding web application(s) to site default-web-site begins...
    Binding WebServices web-module for application RTAService-RTAService-WS to site default-web-site under context root RTAService-RTAService-context-root
    Operation failed with error:
    Error compiling :C:\Stephane\Jdeveloper\jdevstudio10131\j2ee\home\applications\RTAService-RTAService-WS\WebServices: compilation error occurred
    I don’t know where to look at for this issue. I don't get information about what compilation error it is.
    I am using the embedded oc4J application server coming with Jdeveloper Studio Edition 10.1.3.1.0_NT_0610009.1404.3984.
    I was able with the same configuration to deploy a very simple Web Service you have in your tutorials named GetDates
    This is the Class I try to deploy has a web service:
    package rtaservice;
    import javax.jws.WebService;
    @WebService(serviceName = "RTAWebService")
    public class RTAWebService {
    public RTAWebService() {
    public TransactionResult Process(Transaction Trans) {
    TransactionResult TransResult;
    TransResult = new TransactionResult();
    TransResult.Account_type ="";
    TransResult.Address_Line1 ="";
    TransResult.Amount ="";
    TransResult.Approval_Cd ="";
    TransResult.Approval_Cd_returned ="";
    TransResult.Approved ="";
    TransResult.Avs_Response_C ="";
    TransResult.Avs_Response_M ="";
    TransResult.BCFerries_Error_description ="";
    TransResult.BCFerries_Processing_Mode =true;
    TransResult.BCFerries_Resp_Code ="";
    TransResult.BCFerries_Trans_approved =true;
    TransResult.CardType ="";
    TransResult.CVV_Code ="";
    TransResult.CVV_response ="";
    TransResult.DateTime ="";
    TransResult.Display_Msg ="";
    TransResult.ExtendedOPId ="";
    TransResult.ID_Seq_Number ="";
    TransResult.Invoice_num ="";
    TransResult.Invoice_num_returned ="";
    TransResult.ISOResponseCode ="";
    TransResult.OperatorID ="";
    TransResult.OperatorLanguage ="";
    TransResult.OperatorMessage ="";
    TransResult.Receipt_Msg ="";
    TransResult.Receipt_Msg_Account ="";
    TransResult.ReceiptRefNum ="";
    TransResult.Response_Code ="";
    TransResult.RFU1 ="";
    TransResult.RFU2 ="";
    TransResult.Statement_Desc ="";
    TransResult.Term_ID ="";
    TransResult.Term_ID_Group ="";
    TransResult.Track2_Acc ="";
    TransResult.Trans_Code ="";
    TransResult.Transaction_Handle ="";
    TransResult.TransactionCounter ="";
    TransResult.TransactionHandle ="";
    TransResult.Zip ="";
    TransResult.Account_type_returned ="";
    return TransResult;
    There are 2 others classes to define the objects Transaction and Transaction Result
    package rtaservice;
    public class Transaction {
    public Transaction() {
    // Eigen parameters
    public String Invoice_num; // format AA XXXXXXXX with AA application name and XXXXXXXX unique invoice num
    public String Term_ID; // should be the merchant ID
    public String Term_ID_Group; // not used
    public String Trans_Code; // should be all the time 27 right now
    public String Track2_Acc; // ! there is a specific format to respect here
    // Track2_Acc contains the data as read by a card reader from track 2 starting by ;
    // for manually entered card the format is M<Credit card number>=<Expiry Date(YYMM)>0?
    public String Amount; // in Cents
    public String Approval_Cd;
    public String DateTime; // format is YYYYMMDDHHMMSS
    public String OperatorID; // Optional
    public String ExtendedOPId; // Optional
    public String OperatorLanguage; // Optional
    public String Account_type; // not use for now
    public String Statement_Desc; // not use for now
    public String CVV_Code;
    public String Address_Line1; // Optional
    public String Zip; // Optional
    public String TransactionHandle; // Optional
    // additional parameters for future use
    public String RFU1; // Reserved for future use
    public String RFU2; // Reserved for future use
    package rtaservice;
    public class TransactionResult extends Transaction {
    public TransactionResult() {
    public String BCFerries_Resp_Code;
    public String BCFerries_Error_description;
    public Boolean BCFerries_Trans_approved;
    public Boolean BCFerries_Processing_Mode;
    // Eigen parameters
    public String ID_Seq_Number;
    public String Display_Msg; // Optional
    public String Receipt_Msg; // Optional
    public String Response_Code;
    public String Approval_Cd_returned; // Optional
    public String ISOResponseCode;
    public String ReceiptRefNum;
    public String TransactionCounter;
    public String Approved;
    public String OperatorMessage;
    public String Receipt_Msg_Action; // Optional
    public String Receipt_Msg_Account;
    public String CardType;
    public String Invoice_num_returned; // Optional
    public String Account_type_returned;
    public String CVV_response;
    public String Avs_Response_C;
    public String Avs_Response_M;
    public String Transaction_Handle; // Optional
    Thanks for your time

    Hi mythri.
    Did you find a way out of this error? Could you share the solution with me? Because I am facing a problem that looks just like the one you had.
    Thanks in advance.
    Renan

  • Error while trying to deploy the application (invalid AccountType).

    Hello.
    Error while trying to deploy the planning application (EPMA).
    invalid AccountType
    Rejecting Member PL_Brt_L.2.
    invalid AccountType
    Rejecting Member PL_Brt_L.3.2.
    And not updated outline.
    PL_Brt_L.2 - Account Type = Revenue
    PL_Brt_L.3.2 - Account Type = Revenue
    If a change to the Revenue Expence, the error goes away and the outline changes.
    EPM 11.1.2.1
    1-st server: planning, essbase
    2-nd server: epma
    3-th server: oracle db
    thanks in advance

    Hi,
    I tried using dcmctl but still got the following error.
    Oracle 8i database is running but noone is using it except that this application uses it.
    Pls help
    D:\oraJ2EE\dcm\bin>dcmctl deployapplication -f d:\oraJ2ee\j2ee\elink\applications\advecto.ear -
    a myapp
    ADMN-300075
    D:\oraJ2EE\dcm\bin>dcmctl getError -v -d
    ADMN-300075
    Nested exception
    Base Exception:
    java.rmi.RemoteException:null; nested exception is:
    java.lang.OutOfMemoryError
    Nested exception
    Root Cause: null; nested exception is:
    java.lang.OutOfMemoryError
    java.rmi.RemoteException: null; nested exception is:
    java.lang.OutOfMemoryError
    java.lang.OutOfMemoryError
    <<no stack trace available>>
    Thanks
    Srinath

  • _OBJC_IVAR_$_        Referenced From Error while trying to deploy in iphone

    Hi All,
    I am facing one problem. any one who are aware of this project please help me.
    My problem is:
    i have Mac OS of 10.5.8 and xcode of 3.1.4
    while i am trying to implement a application of audio files i want the frame work called "AVFoundation.Framework" i didn't found that frame work in my library.
    so i added that framework from "MACOS10.4" .
    but in simulator 3.1 it works fine. while trying to deploy in my iphone i am getting error like:
    "-(avTouchcontroller updatecurrenttime)", referenced from:
    _OBJC_IVAR_$_ avTouchcontroller._ivlmeter_in in avTouchController.o

    Why don't you post here (again) and you might get some answers:
    http://discussions.apple.com/message.jspa?messageID=10512489#10512489

  • Error while trying to deploy a cube

    I am getting an error message while trying to deploy a cube. OWB Client version is 10.2.0.1.31 and the repository version is 10.2.0.1.0
    Below is the piece of code that generates the error:
    BEGIN
    CWM2_OLAP_CUBE.ADD_DIMENSION_TO_CUBE('EXPENSE_WH', 'REL_EXPENSE', 'EXPENSE_WH', 'REL_CATEGORY');
    END;
    Error report:
    ORA-06510: PL/SQL: unhandled user-defined exception
    ORA-06512: at "OLAPSYS.CWM2_OLAP_UTILITY", line 1660
    ORA-01403: no data found
    ORA-06512: at "OLAPSYS.CWM2_OLAP_CUBE", line 33
    ORA-06512: at "OLAPSYS.CWM2_OLAP_CUBE", line 55
    ORA-06512: at "OLAPSYS.CWM2_OLAP_CUBE", line 386
    ORA-06512: at line 2
    I would appreciate any help.

    Is the dependent dimension deployed to the catalog? Generally the no data found error indicates some dependent object is missing; either an implementing table or a dependent dimension.
    Cheers
    David

  • Error while trying to publish a web service in UDDI client

    hi
      i m getting this error when trying to publish my web service in UDDI client.I have
    configured my uddi client using Visual Administrator.I created a  local test registry.The name of my  registry is QuickCarRentalRegistry_Local.I created this at admin level.I also tried at level 1 Tier.But it was giving the same error.
    The error is "<b> Internet Explorer Script Error</b>".my ie version is 7.0
    In my alert window it displays error: 'ur_txt' is undefined.
    Regards
    mythri.

    Hi mythri.
    Did you find a way out of this error? Could you share the solution with me? Because I am facing a problem that looks just like the one you had.
    Thanks in advance.
    Renan

  • Error while trying to deploy BIDS Cube

    Hi
    I have created a Cube, and when I'm trying to deploy it I'm getting errors. First error it's on Calculations Tab on a Cube under Metadata: "Error loading metadata connection is not open"
    There's also another error: "Unable to query 'AdventureWorksDW_Cube' cube: A connection cannot be made to redirector. Ensure SQL-Browser is running. 
    Then another error is when I'm trying to deploy: same as above,  A connection cannot be made to redirector. Ensure SQL-Browser is running
    It is connection errors and I don't know what to do because my SQL-Browser is running. please help.

    Hi Sta.
    I would suggest you try to restart SQL Server Browser serice to see if this help.
    In addition, please also help to collect the following information to us for further investigaion:
    Is it a SSAS named instance or default instance? Have you try to specify "IP address\instance name" for the "Server" property?
    What's is the impersonation accounts information of the SSAS project?
    Please take a look at the following articles regarding SSAS project deployment:
    Deploying an Analysis Services Project:
    http://msdn.microsoft.com/en-us/library/ms166576(v=sql.110).aspx
    Set Impersonation Options (SSAS - Multidimensional):
    http://msdn.microsoft.com/en-us/library/ms187597.aspx
    I found an article regarding this issue for your reference, please see:
    http://www.sql-server-performance.com/2008/a-connection-cannot-be-made-to-redirector/
    Regards,
    Elvis Long
    TechNet Community Support

  • Error while trying to deploy the fusion order aplication

    i've succeded tu install the schemas, to deploy the store front module , and when i try to deploy the aplication i encounter one error :(
    this is my "build.properties" edited file:
    # Global build property set for SOA fusion order demo #
    # > author: clemens utschig (oracle corp) 2009 #
    # path for libraries and script imports
    oracle.home=D:\\Middleware\\JDEV\\jdeveloper\\
    ################ INTERNAL SEED PROPERTIES - BEGIN ##################
    # !!!!! DO NOT MODIFY !!!!! #
    # internal version number
    fod.version=2.3_ps3
    # common libs home
    oracle.common.home=${oracle.home}/../oracle_common
    # Sub directory for deployment artifacts
    deploy.sub.dir=deploy
    # sub directory for deployment / build scripts
    bin.sub.dir=bin
    # jee application homes
    creditauthorization.home=../CreditCardAuthorization
    orderapproval.home=../OrderApprovalHumanTask
    external.partnersupplier.home=../ExternalLegacyPartnerSupplierEjb
    # composite homes
    orderbookingsdo.composite.home=../OrderSDOComposite
    partnersupplier.composite.home=../PartnerSupplierComposite
    orderbooking.composite.home=../OrderBookingComposite
    b2b.composite.home=../B2BX12OrderGateway
    # adf service implementation context url
    storefrontservice.contextUri.adf=StoreFrontServiceHooks/StoreFrontService
    # sca composite based context url
    storefrontservice.contextUri.soa=soa-infra/services/${soa.partition.name}/OrderSDOComposite!1.0/StoreFrontService
    # ejb uri for the ExternalPartnerSupplierEJB
    partnersupplier.ejb.uri=WebLogicFusionOrderDemo-ExternalLegacyPartnerSupplierEjb-SessionEJB#com.otn.sample.fod.soa.externalps.IExternalPartnerSupplierService
    # ejb uri for the ExternalPartnerSupplierEJB JSca implementation via Spring C&I
    partnersupplier.jsca.ejb.uri=WebLogicFusionOrderDemo-ExternalLegacyPartnerSupplierJScaEjb
    ## global connection settings for deployer, rmi and others
    # admin server t3:// url - for deployment
    wls.url=t3://${admin.server.host}:${admin.server.port}
    # mgd server t3:// url - for ejb
    wls.mgd.server.url=t3://${managed.server.host}:${managed.server.rmi.port}
    # the jndi ctx factory
    java.naming.factory.initial=weblogic.jndi.WLInitialContextFactory
    ################## INTERNAL SEED PROPERTIES - END ####################
    # partition where the composites should be deployed to
    soa.partition.name=soaFusionOrderDemo
    # set to false if you want to use adf backed services.
    soa.only.deployment=true
    # deploy the b2b x12 order processing composite
    enable.b2b.composite=true
    # use a normal ejb3 for the external partner supplier (comment or set to false),
    # or use the new Weblogic SCA for Java EJB binding (uncomment and set to true)
    use.jsca.ejb.impl=true
    # file adapter directory - amend to your OS (use \\ for windows and / for unix)
    orderbooking.file.adapter.dir=/tmp
    # file adapter control directory - amend to your OS (use \\ for windows and / for unix)
    orderbooking.file.adapter.control.dir=/tmp/control
    # jndi name of the jms topic for orderbooking composite
    orderbooking.jms.topic.jndi=jms/DemoSupplierTopicUdd
    ###### Deployment server connection information
    # the admin server connection information - to seed the topics
    admin.server.host=RZV-PC
    admin.server.port=7001
    # the domain where soa infra is installed
    server.domain.name=soa_domain
    # connection information for the managed server, used for soa-deployment, http
    managed.server.host=RZV-PC
    managed.server.port=8001
    # rmi port for testing, ejb invocation and others
    managed.server.rmi.port=8001
    # credential information for the servers
    server.user=weblogic
    [email protected]
    # wls target server (for shiphome set to server_soa, for ADRS use AdminServer)
    server.targets=soa_server1
    # soa-server side oracle home directory - needed for deployment plans
    # and the weblogic sca library deployment (out of the ExternalPartnerSupplier project
    soa.server.oracle.home=D:\\AS11gR1SOA
    ####### for business event testing - this is to enqueue the business event
    # soa db main schema username
    soa.db.username=sys as sysdba
    # soa db password
    soa.db.password=razvan
    # soa db connect string => host:port:sid
    soa.db.connectstring=RZV-PC:1521:xe
    ##### MetaDataServices repository settings (used for SOA shared artifacts) #####
    # use "jdev" for local jdeveloper install, "db" for database
    # In case of "db" amend the below (jdbc) settings for the mds db
    foreign.mds.type=db
    # Note: BEFORE you deploy make sure you amend these settings to your REMOTE
    # db - that is backing soa-infra, set the above mds.type to "db" and run
    # the "importCommonServiceArtifactsIntoMds" target. This will import the common
    # shared artifacts of $OH/bin/soa-seed/ into the remote (RT) mds.
    # On a shiphome install this user is normally named sh_mds
    mds.db.userid=sys as sysdba
    mds.db.password=razvan
    # database connection string: [email protected]:port:sid
    mds.db.jdbc-url=jdbc:oracle:thin:@RZV-PC:1521:xe
    and this is the error i get :
    Buildfile: C:\fod\CompositeServices\bin\build.xml
    [echo] Ant: Apache Ant version 1.7.1 compiled on June 27 2008 Java: 1.6
    [echo] Using mds-type : db
    [input] skipping input as property server.password has already been set.
    init:
    [echo] SOA Suite 11g version:
    [java]
    [java] *****************************************************************************
    [java] Oracle SOA Server version 11.1.1.5.0
    [java] Build: 0
    [java] Build time: Mon Apr 18 18:05:14 PDT 2011
    [java] Build type: release
    [java] Source tag: PCBPEL_11.1.1.5.0_GENERIC_110418.1550.0174
    [java]
    [echo] soa infra mgmt home: D:\Middleware\JDEV\jdeveloper\
    setupWorkspaceForJdeveloperUse:
    [echo] !!! Setting up workspace for JDeveloper use, hence seeding adf-config, connections.xml and populating mds
    [echo] Ant: Apache Ant version 1.7.1 compiled on June 27 2008 Java: 1.6
    [echo] Using mds-type : db
    [input] skipping input as property server.password has already been set.
    init:
    [echo] SOA Suite 11g version:
    [java]
    [java] *****************************************************************************
    [java] Oracle SOA Server version 11.1.1.5.0
    [java] Build: 0
    [java] Build time: Mon Apr 18 18:05:14 PDT 2011
    [java] Build type: release
    [java] Source tag: PCBPEL_11.1.1.5.0_GENERIC_110418.1550.0174
    [java]
    [echo] soa infra mgmt home: D:\Middleware\JDEV\jdeveloper\
    createMDSConnections:
    [echo] Ant: Apache Ant version 1.7.1 compiled on June 27 2008 Java: 1.6
    [echo] Using mds-type : db
    [input] skipping input as property server.password has already been set.
    createMDSConnectionForDB:
    [echo] Creating ../.adf/META-INF/adf-config.xml for database backed MDS
    [input] skipping input as property mds.db.password has already been set.
    [copy] Copying 1 file to C:\fod\CompositeServices\.adf\META-INF
    [echo] Using jdbc:oracle:thin:@RZV-PC:1521:xe for db-based backing, with user sys as sysdba
    [echo] Ant: Apache Ant version 1.7.1 compiled on June 27 2008 Java: 1.6
    [echo] Using mds-type : db
    [input] skipping input as property server.password has already been set.
    createMDSConnectionForFileStore:
    [echo] Ant: Apache Ant version 1.7.1 compiled on June 27 2008 Java: 1.6
    [echo] Using mds-type : db
    [input] skipping input as property server.password has already been set.
    createMDSConnectionForServerFileStore:
    importCommonServiceArtifactsIntoMds:
    [java] Starting local filesystem import into mds ..
    [java] oracle.mds.config.MDSConfigurationException: MDS-01330: unable to load MDS configuration document
    [java] MDS-01329: unable to load element "persistence-config"
    [java] MDS-01370: MetadataStore configuration for metadata-store-usage "mstore-usage_1" is invalid.
    [java] ORA-06550: line 1, column 12:
    [java] PLS-00201: identifier 'MDS_INTERNAL_SHREDDED.GETREPOSITORYVERSION' must be declared
    [java] ORA-06550: line 1, column 7:
    [java] PL/SQL: Statement ignored
    [java]
    [java]
    [java]      at oracle.mds.config.PConfig.loadFromBean(PConfig.java:690)
    [java]      at oracle.mds.config.PConfig.<init>(PConfig.java:499)
    [java]      at oracle.mds.config.MDSConfig.loadFromBean(MDSConfig.java:707)
    [java]      at oracle.mds.config.MDSConfig.loadFromElement(MDSConfig.java:764)
    [java]      at oracle.mds.config.MDSConfig.<init>(MDSConfig.java:515)
    [java]      at oracle.mds.config.MDSConfig.<init>(MDSConfig.java:443)
    [java]      at com.otn.sample.fod.soa.util.MdsImportTask.getTargetMdsInstanceByAdfConfig(MdsImportTask.java:133)
    [java]      at com.otn.sample.fod.soa.util.MdsImportTask.execute(MdsImportTask.java:155)
    [java]      at com.otn.sample.fod.soa.util.MdsImportTask.main(MdsImportTask.java:84)
    [java] Caused by: oracle.mds.exception.MDSExceptionList: MDS-01329: unable to load element "persistence-config"
    [java] MDS-01370: MetadataStore configuration for metadata-store-usage "mstore-usage_1" is invalid.
    [java] ORA-06550: line 1, column 12:
    [java] PLS-00201: identifier 'MDS_INTERNAL_SHREDDED.GETREPOSITORYVERSION' must be declared
    [java] ORA-06550: line 1, column 7:
    [java] PL/SQL: Statement ignored
    [java]
    [java]
    [java]      at oracle.mds.config.PConfig.loadFromBean(PConfig.java:684)
    [java]      ... 8 more
    [java] Exception in thread "main" MDS-01330: unable to load MDS configuration document
    [java] MDS-01329: unable to load element "persistence-config"
    [java] MDS-01370: MetadataStore configuration for metadata-store-usage "mstore-usage_1" is invalid.
    [java] ORA-06550: line 1, column 12:
    [java] PLS-00201: identifier 'MDS_INTERNAL_SHREDDED.GETREPOSITORYVERSION' must be declared
    [java] ORA-06550: line 1, column 7:
    [java] PL/SQL: Statement ignored
    [java]
    [java]
    [java]      at com.otn.sample.fod.soa.util.MdsImportTask.execute(MdsImportTask.java:225)
    [java]      at com.otn.sample.fod.soa.util.MdsImportTask.main(MdsImportTask.java:84)
    BUILD FAILED
    C:\fod\CompositeServices\bin\build.xml:276: The following error occurred while executing this line:
    C:\fod\CompositeServices\bin\common-sca-tools.xml:414: Java returned: 1
    Total time: 4 seconds
    please help, i need this aplication for my final year project .
    Thanx

    this is the complete log:
    Buildfile: C:\fod\CompositeServices\bin\build.xml
    [echo] Ant: Apache Ant version 1.7.1 compiled on June 27 2008 Java: 1.6
    [echo] Using mds-type : db
    [input] skipping input as property server.password has already been set.
    init:
    [echo] SOA Suite 11g version:
    [java]
    [java] *****************************************************************************
    [java] Oracle SOA Server version 11.1.1.5.0
    [java] Build: 0
    [java] Build time: Mon Apr 18 18:05:14 PDT 2011
    [java] Build type: release
    [java] Source tag: PCBPEL_11.1.1.5.0_GENERIC_110418.1550.0174
    [java]
    [echo] soa infra mgmt home: D:\Middleware\JDEV\jdeveloper\
    compile-build-all:
    [echo] Building and compiling SOA Fusion Order Demo ..
    clean:
    [echo] Cleanup of OrderApprovalHumanTask
    [delete] Deleting: C:\fod\CompositeServices\OrderApprovalHumanTask\deploy\OrderApprovalHumanTask.war
    [delete] Deleting: C:\fod\CompositeServices\OrderApprovalHumanTask\deploy\OrderApprovalHumanTask.ear
    init:
    compile:
    [javac] Compiling 6 source files to C:\fod\CompositeServices\OrderApprovalHumanTask\public_html\WEB-INF\classes
    copy:
    [copy] Copying 191 files to C:\fod\CompositeServices\OrderApprovalHumanTask\public_html\WEB-INF\classes
    create-ear:
    [copy] Copying 4 files to C:\fod\CompositeServices\OrderApprovalHumanTask\public_html\WEB-INF\lib
    [war] Building war: C:\fod\CompositeServices\OrderApprovalHumanTask\deploy\OrderApprovalHumanTask.war
    [delete] Deleting directory C:\fod\CompositeServices\OrderApprovalHumanTask\public_html\WEB-INF\lib
    setupDeploymentEnvironment:
    [echo] Step1: copy template ./templates/connections.xml.seed to ../../.adf/META-INF/connections.xml
    [copy] Copying 1 file to C:\fod\CompositeServices\.adf\META-INF
    [echo] Step2: setup descriptor, soa-only? true, modifying ../../.adf/META-INF/connections.xml
    [echo] replacing ws-endpoint with RZV-PC:8001/soa-infra/services/soaFusionOrderDemo/OrderSDOComposite!1.0/StoreFrontService
    [echo] replacing ws-binding with {www.globalcompany.example.com}StoreFrontServiceBinding
    [mkdir] Created dir: C:\fod\CompositeServices\OrderApprovalHumanTask\deploy\adf\META-INF
    [copy] Copying 2 files to C:\fod\CompositeServices\OrderApprovalHumanTask\deploy\adf\META-INF
    [echo] Creating custom adf config for customization of connections.xml - datasource: jdbc/mds/MDS_LocalTxDataSource
    [mkdir] Created dir: C:\fod\CompositeServices\OrderApprovalHumanTask\deploy\lib
    [copy] Copying 1 file to C:\fod\CompositeServices\OrderApprovalHumanTask\deploy\lib
    [ear] Building ear: C:\fod\CompositeServices\OrderApprovalHumanTask\deploy\OrderApprovalHumanTask.ear
    [delete] Deleting directory C:\fod\CompositeServices\OrderApprovalHumanTask\deploy\adf
    [delete] Deleting directory C:\fod\CompositeServices\OrderApprovalHumanTask\deploy\lib
    create-deployable-composite:
    [echo] oracle.home = D:\Middleware\JDEV\jdeveloper\
    [input] skipping input as property compositeDir has already been set.
    [input] skipping input as property compositeName has already been set.
    [input] skipping input as property revision has already been set.
    clean:
    [echo] deleting C:\fod\CompositeServices\OrderBookingComposite\bin/..//deploy/sca_OrderBookingComposite_rev1.0.jar
    [delete] Deleting: C:\fod\CompositeServices\OrderBookingComposite\deploy\sca_OrderBookingComposite_rev1.0.jar
    init:
    scac-validate:
    [echo] Running scac-validate in C:\fod\CompositeServices\OrderBookingComposite\bin/..//composite.xml
    [echo] oracle.home = D:\Middleware\JDEV\jdeveloper\
    [input] skipping input as property compositeDir has already been set.
    [input] skipping input as property compositeName has already been set.
    [input] skipping input as property revision has already been set.
    scac:
    [scac] Validating composite "C:\fod\CompositeServices\OrderBookingComposite\bin/..//composite.xml"
    [scac] Composed "OrderProcessor" in 107.0 milliseconds [nodes 138=10+128, 1,290.0 nodes/sec]
    [scac] Compiled "OrderProcessor" in 2.057 seconds
    [scac] Gathered 14 files in 1.3 milliseconds
    [scac] Packaged "OrderProcessor" in 24.5 milliseconds
    [scac] Composed "InternalWarehouseService" in 8.0 milliseconds [nodes 6=0+6, 752.6 nodes/sec]
    [scac] Compiled "InternalWarehouseService" in 1.006 seconds
    [scac] Gathered 3 files in 0.8 milliseconds
    [scac] Packaged "InternalWarehouseService" in 6.0 milliseconds
    [scac] >>>>>>>>>>>>>>>>>>>>>>>>>>>>>>>>>>>>>>>>>>>>>>
    [scac] >> modified xmlbean locale class in use
    [scac] >>>>>>>>>>>>>>>>>>>>>>>>>>>>>>>>>>>>>>>>>>>>>>
    [scac] warning: location {ns:composite/ns:reference[@name='CreditCardAuthorizationService']}(170,128): Failed to Find Binding "CreditCardAuthorizationService":"{http://www.globalcompany.example.com/ns/CreditAuthorizationService}CreditAuthorizationPort" in WSDL Manager
    [scac] warning: location {ns:composite/ns:reference[@name='PartnerSupplierService']}(163,122): Failed to Find Binding "PartnerSupplierService":"{http://www.partnersupplier.example.com/ns/warehouse}ExternalPartnerSupplier_pt" in WSDL Manager
    [scac] warning: location {ns:composite/ns:reference[@name='StoreFrontService']}(180,162): Failed to Find Binding "StoreFrontService":"{www.globalcompany.example.com}StoreFrontServiceSoapHttpPort" in WSDL Manager
    [scac] warning: in OrderProcessor.bpel(223): <from> value type "{http://www.w3.org/2001/XMLSchema}long" is not compatible with <to> value type "{http://www.w3.org/2001/XMLSchema}string"
    [scac] warning: in OrderProcessor.bpel(310): <from> value type "{http://www.w3.org/2001/XMLSchema}decimal" is not compatible with <to> value type "{http://www.w3.org/2001/XMLSchema}string"
    [scac] warning: in OrderProcessor.bpel(310): <from> value type "{http://www.w3.org/2001/XMLSchema}integer" is not compatible with <to> value type "{http://www.w3.org/2001/XMLSchema}string"
    [scac] warning: in OrderProcessor.bpel(390): <from> value type "{http://www.w3.org/2001/XMLSchema}decimal" is not compatible with <to> value type "{http://www.w3.org/2001/XMLSchema}double"
    [scac] warning: in OrderProcessor.bpel(390): <from> value type "{http://www.w3.org/2001/XMLSchema}string" is not compatible with <to> value type "{http://www.w3.org/2001/XMLSchema}boolean"
    [scac] warning: in OrderProcessor.bpel(429): <from> value type "{http://www.w3.org/2001/XMLSchema}boolean" is not compatible with <to> value type "{http://www.w3.org/2001/XMLSchema}string"
    [scac] warning: in OrderProcessor.bpel(571): <from> value type "{http://www.w3.org/2001/XMLSchema}integer" is not compatible with <to> value type "{http://www.w3.org/2001/XMLSchema}string"
    package:
    [echo] oracle.home = D:\Middleware\JDEV\jdeveloper\
    [input] skipping input as property compositeDir has already been set.
    [input] skipping input as property compositeName has already been set.
    [input] skipping input as property revision has already been set.
    compile-source:
    [mkdir] Created dir: C:\fod\CompositeServices\OrderBookingComposite\dist
    [copy] Copying 139 files to C:\fod\CompositeServices\OrderBookingComposite\dist
    [copy] Warning: C:\fod\CompositeServices\OrderBookingComposite\src not found.
    [copy] Warning: C:\fod\CompositeServices\OrderBookingComposite\SCA-INF\src not found.
    [copy] Copying 6 files to C:\fod\CompositeServices\OrderBookingComposite\dist\SCA-INF\classes
    [jar] Building jar: C:\fod\CompositeServices\OrderBookingComposite\deploy\sca_OrderBookingComposite_rev1.0.jar
    [delete] Deleting directory C:\fod\CompositeServices\OrderBookingComposite\dist
    setupDeploymentEnvironment:
    [copy] Copying 1 file to C:\fod\CompositeServices\OrderBookingComposite\bin
    [echo] Setting up deployment plan, modifying orderbooking_deployment_plan.xml
    [echo] Replacing ws-endpoint with RZV-PC:8001/soa-infra/services/soaFusionOrderDemo/OrderSDOComposite!1.0/StoreFrontService
    [echo] Replacing soa server and wls server information
    [echo] -SOA: RZV-PC 8001
    [echo] Replacing file adapter endpoint with /tmp
    [echo] Disabling global bam sensors? true
    [echo] Amending jndi destination for jms topic jms/DemoSupplierTopicUdd
    [echo] Replacing soa partition name with soaFusionOrderDemo
    [echo] Replacing values for bam connection in connections.xml
    [echo] Bam server host: localhost
    [echo] Bam server host: 9001
    [echo] Bam server user: weblogic
    [echo] Spring lib path: D:\Middleware\JDEV\jdeveloper\/../oracle_common/modules/org.springframework_2.5.jar
    compile-classes:
    create-deployable-composite:
    [echo] oracle.home = D:\Middleware\JDEV\jdeveloper\
    [input] skipping input as property compositeDir has already been set.
    [input] skipping input as property compositeName has already been set.
    [input] skipping input as property revision has already been set.
    clean:
    [echo] deleting C:\fod\CompositeServices\PartnerSupplierComposite\bin/..//deploy/sca_PartnerSupplierComposite_rev1.0.jar
    [delete] Deleting: C:\fod\CompositeServices\PartnerSupplierComposite\deploy\sca_PartnerSupplierComposite_rev1.0.jar
    init:
    scac-validate:
    [echo] Running scac-validate in C:\fod\CompositeServices\PartnerSupplierComposite\bin/..//composite.xml
    [echo] oracle.home = D:\Middleware\JDEV\jdeveloper\
    [input] skipping input as property compositeDir has already been set.
    [input] skipping input as property compositeName has already been set.
    [input] skipping input as property revision has already been set.
    scac:
    [scac] Validating composite "C:\fod\CompositeServices\PartnerSupplierComposite\bin/..//composite.xml"
    [scac] Composed "ExternalPartnerSupplier" in 41.0 milliseconds [nodes 6=0+6, 146.4 nodes/sec]
    [scac] Compiled "ExternalPartnerSupplier" in 1.584 seconds
    [scac] Gathered 3 files in 0.8 milliseconds
    [scac] Packaged "ExternalPartnerSupplier" in 8.8 milliseconds
    [scac] ### clazz: interface com.otn.sample.fod.soa.internalsupplier.IInternalPartnerSupplier
    [scac] ### clazz: interface writequoterequest.partnersuppliercomposite.weblogicfusionorderdemo.file.adapter.pcbpel.com.oracle.xmlns.Write_ptt
    [scac] ### qname: {http://xmlns.oracle.com/pcbpel/adapter/file/WebLogicFusionOrderDemo/PartnerSupplierComposite/WriteQuoteRequest}Write_ptt
    [scac] ### clazz: interface com.otn.sample.fod.soa.externalps.IExternalPartnerSupplierService
    [scac] ### clazz: interface com.otn.sample.fod.soa.externalps.IExternalPartnerSupplierService
    [scac] ### clazz: interface com.otn.sample.fod.soa.internalsupplier.IInternalPartnerSupplier
    [scac] ### clazz: interface com.otn.sample.fod.soa.internalsupplier.IInternalPartnerSupplier
    [scac] ### clazz: interface com.otn.sample.fod.soa.internalsupplier.IInternalPartnerSupplier
    [scac] >>>>>>>>>>>>>>>>>>>>>>>>>>>>>>>>>>>>>>>>>>>>>>
    [scac] >> modified xmlbean locale class in use
    [scac] >>>>>>>>>>>>>>>>>>>>>>>>>>>>>>>>>>>>>>>>>>>>>>
    [scac] warning: in PartnerSupplierMediator.mplan: Case "ExternalPartnerSupplier.externalpartnersupplier_client.process" doesnt have any payload transformation Please make sure source and target message part name are same and of same type. Otherwise, target reference may fail to execute with error message like "Input sourcelike Null" or "Part not found"
    package:
    [echo] oracle.home = D:\Middleware\JDEV\jdeveloper\
    [input] skipping input as property compositeDir has already been set.
    [input] skipping input as property compositeName has already been set.
    [input] skipping input as property revision has already been set.
    compile-source:
    [echo] deleting .class files of C:\fod\CompositeServices\PartnerSupplierComposite\bin/..//SCA-INF/classes
    [javac] Compiling 18 source files to C:\fod\CompositeServices\PartnerSupplierComposite\SCA-INF\classes
    [javac] Note: Some input files use unchecked or unsafe operations.
    [javac] Note: Recompile with -Xlint:unchecked for details.
    [mkdir] Created dir: C:\fod\CompositeServices\PartnerSupplierComposite\dist
    [copy] Copying 66 files to C:\fod\CompositeServices\PartnerSupplierComposite\dist
    [copy] Warning: C:\fod\CompositeServices\PartnerSupplierComposite\SCA-INF\src not found.
    [copy] Copying 7 files to C:\fod\CompositeServices\PartnerSupplierComposite\dist\SCA-INF\classes
    [jar] Building jar: C:\fod\CompositeServices\PartnerSupplierComposite\deploy\sca_PartnerSupplierComposite_rev1.0.jar
    [delete] Deleting directory C:\fod\CompositeServices\PartnerSupplierComposite\dist
    [echo] Spring lib path: D:\Middleware\JDEV\jdeveloper\/../oracle_common/modules/org.springframework_2.5.jar
    setupDeploymentEnvironment:
    [copy] Copying 1 file to C:\fod\CompositeServices\PartnerSupplierComposite\bin
    [echo] Setting up deployment plan, modifying PartnerSupplierComposite_cfgplan.xml
    [echo] Replacing ejb-name with WebLogicFusionOrderDemo-ExternalLegacyPartnerSupplierJScaEjb
    [echo] Replacing file adapter endpoint with /tmp/quote
    create-deployable-composite:
    [echo] oracle.home = D:\Middleware\JDEV\jdeveloper\
    [input] skipping input as property compositeDir has already been set.
    [input] skipping input as property compositeName has already been set.
    [input] skipping input as property revision has already been set.
    clean:
    [echo] deleting C:\fod\CompositeServices\OrderSDOComposite\bin/..//deploy/sca_OrderSDOComposite_rev1.0.jar
    [delete] Deleting: C:\fod\CompositeServices\OrderSDOComposite\deploy\sca_OrderSDOComposite_rev1.0.jar
    init:
    scac-validate:
    [echo] Running scac-validate in C:\fod\CompositeServices\OrderSDOComposite\bin/..//composite.xml
    [echo] oracle.home = D:\Middleware\JDEV\jdeveloper\
    [input] skipping input as property compositeDir has already been set.
    [input] skipping input as property compositeName has already been set.
    [input] skipping input as property revision has already been set.
    scac:
    [scac] Validating composite "C:\fod\CompositeServices\OrderSDOComposite\bin/..//composite.xml"
    [scac] Composed "CustomerAndOrderService" in 140.2 milliseconds [nodes 63=1+62, 449.2 nodes/sec]
    [scac] Compiled "CustomerAndOrderService" in 1.814 seconds
    [scac] Gathered 5 files in 0.9 milliseconds
    [scac] Packaged "CustomerAndOrderService" in 11.9 milliseconds
    [scac] warning: in CustomerAndOrderService.bpel(254): <from> value type "{http://www.w3.org/2001/XMLSchema}anySimpleType" is not compatible with <to> value type "{http://www.w3.org/2001/XMLSchema}integer"
    [scac] warning: in CustomerAndOrderService.bpel(359): <from> value type "{http://www.w3.org/2001/XMLSchema}integer" is not compatible with <to> value type "{http://www.w3.org/2001/XMLSchema}long"
    [scac] warning: in CustomerAndOrderService.bpel(493): <from> value type "{http://www.w3.org/2001/XMLSchema}integer" is not compatible with <to> value type "{http://www.w3.org/2001/XMLSchema}long"
    package:
    [echo] oracle.home = D:\Middleware\JDEV\jdeveloper\
    [input] skipping input as property compositeDir has already been set.
    [input] skipping input as property compositeName has already been set.
    [input] skipping input as property revision has already been set.
    compile-source:
    [mkdir] Created dir: C:\fod\CompositeServices\OrderSDOComposite\dist
    [copy] Copying 12 files to C:\fod\CompositeServices\OrderSDOComposite\dist
    [copy] Warning: C:\fod\CompositeServices\OrderSDOComposite\src not found.
    [copy] Warning: C:\fod\CompositeServices\OrderSDOComposite\SCA-INF\src not found.
    [copy] Copying 6 files to C:\fod\CompositeServices\OrderSDOComposite\dist\SCA-INF\classes
    [jar] Building jar: C:\fod\CompositeServices\OrderSDOComposite\deploy\sca_OrderSDOComposite_rev1.0.jar
    [delete] Deleting directory C:\fod\CompositeServices\OrderSDOComposite\dist
    create-deployable-composite:
    [echo] oracle.home = D:\Middleware\JDEV\jdeveloper\
    [input] skipping input as property compositeDir has already been set.
    [input] skipping input as property compositeName has already been set.
    [input] skipping input as property revision has already been set.
    clean:
    [echo] deleting C:\fod\CompositeServices\B2BX12OrderGateway\bin/..//deploy/sca_B2BX12OrderGateway_rev1.0.jar
    [delete] Deleting: C:\fod\CompositeServices\B2BX12OrderGateway\deploy\sca_B2BX12OrderGateway_rev1.0.jar
    init:
    scac-validate:
    [echo] Running scac-validate in C:\fod\CompositeServices\B2BX12OrderGateway\bin/..//composite.xml
    [echo] oracle.home = D:\Middleware\JDEV\jdeveloper\
    [input] skipping input as property compositeDir has already been set.
    [input] skipping input as property compositeName has already been set.
    [input] skipping input as property revision has already been set.
    scac:
    [scac] Validating composite "C:\fod\CompositeServices\B2BX12OrderGateway\bin/..//composite.xml"
    [scac] Composed "B2BOrderProcessingEngine" in 89.0 milliseconds [nodes 45=2+43, 505.7 nodes/sec]
    [scac] Compiled "B2BOrderProcessingEngine" in 2.010 seconds
    [scac] Gathered 7 files in 1.0 milliseconds
    [scac] Packaged "B2BOrderProcessingEngine" in 13.9 milliseconds
    [scac] warning: location {ns:composite/ns:reference[@name='StoreFrontService']}(48,162): Failed to Find Binding "StoreFrontService":"{www.globalcompany.example.com}StoreFrontServiceSoapHttpPort" in WSDL Manager
    [scac] warning: location {ns:composite/ns:reference[@name='OrderBookingService']}(59,116): Failed to Find Binding "OrderBookingService":"{http://www.globalcompany.example.com/ns/OrderBookingService}OrderProcessor_pt" in WSDL Manager
    [scac] warning: in B2BOrderProcessingEngine.componentType: property "bpel.config.use.events" may not be understood by BPEL component B2BOrderProcessingEngine - it will likely be ignored.
    [scac] warning: in B2BOrderProcessingEngine.bpel(188): <from> value type "{http://www.w3.org/2001/XMLSchema}integer" is not compatible with <to> value type "{http://www.w3.org/2001/XMLSchema}string"
    package:
    [echo] oracle.home = D:\Middleware\JDEV\jdeveloper\
    [input] skipping input as property compositeDir has already been set.
    [input] skipping input as property compositeName has already been set.
    [input] skipping input as property revision has already been set.
    compile-source:
    [mkdir] Created dir: C:\fod\CompositeServices\B2BX12OrderGateway\dist
    [copy] Copying 27 files to C:\fod\CompositeServices\B2BX12OrderGateway\dist
    [copy] Warning: C:\fod\CompositeServices\B2BX12OrderGateway\src not found.
    [copy] Warning: C:\fod\CompositeServices\B2BX12OrderGateway\SCA-INF\src not found.
    [copy] Copying 6 files to C:\fod\CompositeServices\B2BX12OrderGateway\dist\SCA-INF\classes
    [jar] Building jar: C:\fod\CompositeServices\B2BX12OrderGateway\deploy\sca_B2BX12OrderGateway_rev1.0.jar
    [delete] Deleting directory C:\fod\CompositeServices\B2BX12OrderGateway\dist
    setupDeploymentEnvironment:
    [copy] Copying 1 file to C:\fod\CompositeServices\B2BX12OrderGateway\bin
    [echo] Setting up deployment plan, modifying B2BX12OrderGateway_deployment_plan.xml
    [echo] Replacing ws-endpoint with RZV-PC:8001/soa-infra/services/soaFusionOrderDemo/OrderSDOComposite!1.0/StoreFrontService
    [echo] Replacing soa server and wls server information
    [echo] -SOA: RZV-PC 8001
    [echo] Replacing communication style, eventbased? true
    [echo] Replacing soa partition name with soaFusionOrderDemo
    [echo] Wls home: D:\Middleware\JDEV\jdeveloper\/../wlserver_10.3
    [echo] Oracle home: D:\Middleware\JDEV\jdeveloper\
    init:
    compile:
    create-war:
    [echo] Deploying jsca shared lib? true
    [echo] Wls home: D:\Middleware\JDEV\jdeveloper\/../wlserver_10.3
    [echo] Oracle home: D:\Middleware\JDEV\jdeveloper\
    create-ear:
    [echo] global: true > ejb: ${use.ejb} jsca: true
    [echo] Deploying jsca shared lib? true
    [echo] Wls home: D:\Middleware\JDEV\jdeveloper\/../wlserver_10.3
    [echo] Oracle home: D:\Middleware\JDEV\jdeveloper\
    clean:
    [echo] Cleaning up external partner supplier ejb project ../classes/../deploy
    [delete] Deleting: C:\fod\CompositeServices\ExternalLegacyPartnerSupplierEjb\deploy\ExternalPartnerSupplierEjb.ear
    [echo] Deploying jsca shared lib? true
    [echo] Wls home: D:\Middleware\JDEV\jdeveloper\/../wlserver_10.3
    [echo] Oracle home: D:\Middleware\JDEV\jdeveloper\
    init:
    copy:
    [copy] Copying 5 files to C:\fod\CompositeServices\ExternalLegacyPartnerSupplierEjb\classes
    compile:
    [javac] Compiling 6 source files to C:\fod\CompositeServices\ExternalLegacyPartnerSupplierEjb\classes
    [javac] Note: C:\fod\CompositeServices\ExternalLegacyPartnerSupplierEjb\src\com\otn\sample\fod\soa\externalps\test\EpsSessionEJBClient.java uses unchecked or unsafe operations.
    [javac] Note: Recompile with -Xlint:unchecked for details.
    create-ejb-ear:
    [echo] Deploying jsca shared lib? true
    [echo] Wls home: D:\Middleware\JDEV\jdeveloper\/../wlserver_10.3
    [echo] Oracle home: D:\Middleware\JDEV\jdeveloper\
    init:
    copy:
    compile:
    create-jsca-ear:
    [mkdir] Created dir: C:\fod\CompositeServices\ExternalLegacyPartnerSupplierEjb\deploy\APP-INF\lib
    [copy] Copying 1 file to C:\fod\CompositeServices\ExternalLegacyPartnerSupplierEjb\deploy\APP-INF\lib
    [echo] ../classes/meta-inf/
    [jar] Building jar: C:\fod\CompositeServices\ExternalLegacyPartnerSupplierEjb\deploy\APP-INF\lib\ExternalPartnerSupplierScaModule.jar
    [jar] Building MANIFEST-only jar: C:\fod\CompositeServices\ExternalLegacyPartnerSupplierEjb\deploy\empty.jar
    [ear] Building ear: C:\fod\CompositeServices\ExternalLegacyPartnerSupplierEjb\deploy\ExternalPartnerSupplierEjb.ear
    compile-deploy-all:
    [echo] Deploying SOA Fusion Order Demo ..
    [echo] Deploying jsca shared lib? true
    [echo] Wls home: D:\Middleware\JDEV\jdeveloper\/../wlserver_10.3
    [echo] Oracle home: D:\Middleware\JDEV\jdeveloper\
    deploy-application:
    [echo] Deploying jsca shared lib? true
    [echo] Wls home: D:\Middleware\JDEV\jdeveloper\/../wlserver_10.3
    [echo] Oracle home: D:\Middleware\JDEV\jdeveloper\
    deploy-jsca-library:
    [wldeploy] weblogic.Deployer -remote -noexit -name weblogic-sca -source D:\wlserver_10.3\common\deployable-libraries\weblogic-sca-1.1.war -targets soa_server1 -adminurl t3://RZV-PC:7001 -user weblogic -password ******** -deploy -library
    [wldeploy] weblogic.Deployer invoked with options: -remote -noexit -name weblogic-sca -source D:\wlserver_10.3\common\deployable-libraries\weblogic-sca-1.1.war -targets soa_server1 -adminurl t3://RZV-PC:7001 -user weblogic -deploy -library
    [wldeploy] <Jun 5, 2011 1:53:36 PM GMT+02:00> <Info> <J2EE Deployment SPI> <BEA-260121> <Initiating deploy operation for application, weblogic-sca [archive: D:\wlserver_10.3\common\deployable-libraries\weblogic-sca-1.1.war], to soa_server1 .>
    [wldeploy] weblogic.Deployer -remote -upload -noexit -name ExternalPartnerSupplierEjb -source C:\fod\CompositeServices\ExternalLegacyPartnerSupplierEjb\deploy\ExternalPartnerSupplierEjb.ear -targets soa_server1 -adminurl t3://RZV-PC:7001 -user weblogic -password ******** -deploy
    [wldeploy] weblogic.Deployer invoked with options: -remote -upload -noexit -name ExternalPartnerSupplierEjb -source C:\fod\CompositeServices\ExternalLegacyPartnerSupplierEjb\deploy\ExternalPartnerSupplierEjb.ear -targets soa_server1 -adminurl t3://RZV-PC:7001 -user weblogic -deploy
    [wldeploy] <Jun 5, 2011 1:53:38 PM GMT+02:00> <Info> <J2EE Deployment SPI> <BEA-260121> <Initiating deploy operation for application, ExternalPartnerSupplierEjb [archive: C:\fod\CompositeServices\ExternalLegacyPartnerSupplierEjb\deploy\ExternalPartnerSupplierEjb.ear], to soa_server1 .>
    [wldeploy] Task 5 initiated: [Deployer:149026]deploy application ExternalPartnerSupplierEjb on soa_server1.
    [wldeploy] Task 5 failed: [Deployer:149026]deploy application ExternalPartnerSupplierEjb on soa_server1.
    [wldeploy] Target state: deploy failed on Server soa_server1
    [wldeploy] weblogic.management.DeploymentException: [J2EE:160149]Error while processing library references. Unresolved application library references, defined in weblogic-application.xml: [Extension-Name: weblogic-sca, exact-match: false].
    [wldeploy]
    [wldeploy]
    BUILD FAILED
    C:\fod\CompositeServices\bin\build.xml:172: The following error occurred while executing this line:
    C:\fod\CompositeServices\ExternalLegacyPartnerSupplierEjb\bin\build.xml:169: weblogic.Deployer$DeployerException: weblogic.deploy.api.tools.deployer.DeployerException: Task 5 failed: [Deployer:149026]deploy application ExternalPartnerSupplierEjb on soa_server1.
    Target state: deploy failed on Server soa_server1
    weblogic.management.DeploymentException: [J2EE:160149]Error while processing library references. Unresolved application library references, defined in weblogic-application.xml: [Extension-Name: weblogic-sca, exact-match: false].
    Total time: 1 minute 8 seconds

  • Help!!! Error while trying to Deploy on JRun 3.1

    Hello
    I'm trying to deploy my Ejbs for JRun 3.1. I have my deploy
    script as below:
    rem The base directory in which JRun is installed
    set JRUN_HOME=c:\JRun\3.1
    rem The Oracle JDBC Drivers
    set JDBC_DRIVER=%JRUN_HOME%\servers\lib\ojdbc14.jar
    set ECLIPSE_HOME=H:\eclipse\workspace
    rem The filename and location of the JAR file to build
    set JAR_FILE=%ECLIPSE_HOME%\lib\mtrack.jar
    rem The Classpath for EJB components
    set
    EJB_CP=%ECLIPSE_HOME%\lib\j2ee.jar;%JRUN_HOME%\lib\ejipt.jar;%ECLIPSE_HOME%\lib\jdom.jar; %ECLIPSE_HOME%\lib\xerces.jar;%ECLIPSE_HOME%\lib\ext\commons-fileupload-1.1.jar
    set
    JRUN_CP=%JRUN_HOME%\lib\install.jar;%JRUN_HOME%\lib\xt.jar;%JRUN_HOME%\lib\jrun.jar;%JRUN _HOME%\lib\jsp.jar;%JRUN_HOME%\lib\jsprt.jar;%JRUN_HOME%\lib\rhino.jar;%JRUN_HOME%\lib\ssi .jar;%JRUN_HOME%\lib\default_exports.jar;%JRUN_HOME%\lib\default_objects.jar;%JRUN_HOME%\l ib\ejipt.jar;%JRUN_HOME%\lib\ejipt_ejbeans.jar;%JRUN_HOME%\lib\ejipt_jms.jar;%JRUN_HOME%\l ib\ejipt_tools.jar;%JRUN_HOME%\lib\ejipt_client.jar
    set CP=.;%EJB_CP%;%JDBC_DRIVER%;%JAR_FILE%;%JRUN_CP%
    C:\java\jres\1.3.1\bin\java
    -Djava.security.policy=%JRUN_HOME%/lib/jrun.policy
    -Dejipt.home=%JRUN_HOME% -cp %CP% allaire.ejipt.tools.Deploy
    This script uses Jre 1.3.1 to deploy as I know that one works
    on another machine. Anyway, i get the following error, i starts
    doing the compilation and generating the stub then it fails:
    Generating EscalationManagerObject...
    Generating StatisticsManagerHomeObject...
    Generating StatisticsManagerObject...
    Compiling files...
    Exception: [15:24:29] java.io.IOException: CreateProcess:
    javac -classpath c:/JR
    un/3.1/servers/default/deploy/lib;c:/JRun/3.1/servers/default/deploy/mtrack.jar;
    lib/ejipt.jar;.;H:/eclipse/workspace/lib/j2ee.jar;c:/JRun/3.1/lib/ejipt.jar;H:/e
    clipse/workspace/lib/jdom.jar;H:/eclipse/workspace/lib/xerces.jar;H:/eclipse/wor
    kspace/lib/ext/commons-fileupload-1.1.jar;c:/JRun/3.1/servers/lib/ojdbc14.jar;H:
    /eclipse/workspace/lib/mtrack.jar;c:/JRun/3.1/lib/install.jar;c:/JRun/3.1/lib/xt
    .jar;c:/JRun/3.1/lib/jrun.jar;c:/JRun/3.1/lib/jsp.jar;c:/JRun/3.1/lib/jsprt.jar;
    c:/JRun/3.1/lib/rhino.jar;c:/JRun/3.1/lib/ssi.jar;c:/JRun/3.1/lib/default_export
    s.jar;c:/JRun/3.1/lib/default_objects.jar;c:/JRun/3.1/lib/ejipt.jar;c:/JRun/3.1/
    lib/ejipt_ejbeans.jar;c:/JRun/3.1/lib/ejipt_jms.jar;c:/JRun/3.1/lib/ejipt_tools.
    jar;c:/JRun/3.1/lib/ejipt_client.jar -d
    c:/JRun/3.1/servers/default/deploy/lib @
    c:/JRun/3.1/servers/default/deploy/src/list error=2
    at java.lang.Win32Process.create(Native Method)
    at java.lang.Win32Process.<init>(Unknown Source)
    at java.lang.Runtime.execInternal(Native Method)
    at java.lang.Runtime.exec(Unknown Source)
    at java.lang.Runtime.exec(Unknown Source)
    at java.lang.Runtime.exec(Unknown Source)
    at
    allaire.ejipt.tools.Deploy._compileFiles(allaire/ejipt/tools/Deploy.java:700)
    at
    allaire.ejipt.tools.Deploy.redeployJars(allaire/ejipt/tools/Deploy.java:236)
    at
    allaire.ejipt.tools.Deploy.deployJars(allaire/ejipt/tools/Deploy.java:184)
    at
    allaire.ejipt.tools.Deploy.main(allaire/ejipt/tools/Deploy.java:163)
    I'm completely stuck. Any help will be much appreciated.
    Thanks
    Pratim

    Hi dominikg,
    At first, You can try to restart the device-manager from system tray.
    If it doesn't help, then try the following:
    - stop the device manager
    - Remove c:\Docement and Settings\<your User>\javame-sdk folder.
    - Ran the device manager from <SDK>/bin directory
    - try to debug again.
    Did you tried to change port 51307 to another.
    Early access build had some problems with device manager, I hope that final release will be better :)
    BR,
    Igor

  • Error while trying to deploy the application using Enterprise manager website

    Hi,
    I am trying to deploy a huge ear file using enterprise manager website of Oracle 9iAs Rel 2.
    The deployment fails with the following error.
    Deployment failed: Nested exception Root Cause: null; nested exception is: java.lang.OutOfMemoryError. null; nested exception is: java.lang.OutOfMemoryError
    We are able to deploy the same ear file using stand-alone container.
    We are planning for deployment in few days to go it live.
    Pls suggest what could be the problem.
    Hardware Used:-
    DellServer Intel P3 dual processor 1.2GHz
    1GB RAM
    2GB virtual memory,
    40GB free hard-drive.
    Apart from 9ias enterprise edition, this system has Oracle database also on it. But the database is not being used at all by anyone.
    No other software is installed on the system
    Software:-
    Windows 2000 Server sp2
    Oracle 9ias Release 2 Enterprise Edition (Installed J2EE and Webcache)
    Oracle 8i Database 8.1.6.0.0
    Size of application:-
    130 EJBs (107 CMP + remaining Session Beans)
    1700 JSPs
    3 servlets
    Packaged properly into jar,war,ear structure.
    the size of ear file is about 13MB.
    Thanks
    Srinath

    Hi,
    I tried using dcmctl but still got the following error.
    Oracle 8i database is running but noone is using it except that this application uses it.
    Pls help
    D:\oraJ2EE\dcm\bin>dcmctl deployapplication -f d:\oraJ2ee\j2ee\elink\applications\advecto.ear -
    a myapp
    ADMN-300075
    D:\oraJ2EE\dcm\bin>dcmctl getError -v -d
    ADMN-300075
    Nested exception
    Base Exception:
    java.rmi.RemoteException:null; nested exception is:
    java.lang.OutOfMemoryError
    Nested exception
    Root Cause: null; nested exception is:
    java.lang.OutOfMemoryError
    java.rmi.RemoteException: null; nested exception is:
    java.lang.OutOfMemoryError
    java.lang.OutOfMemoryError
    <<no stack trace available>>
    Thanks
    Srinath

  • Error ,while trying to deploy an application using DB adapter

    Hi ,
    I am getting the below error while deploying the SOA application using DB adapter
    [11:46:00 AM] Sending archive - sca_DataBAdapter_rev2.jar
    [11:46:12 AM] Received HTTP response from the server, response code=500
    [11:46:12 AM] Error deploying archive sca_DataBAdapter_rev2.jar to partition "default" on server soa_server1 [http://computer:8001]
    [11:46:12 AM] HTTP error code returned [500]
    [11:46:12 AM] Error message from server:
    *There was an error deploying the composite on soa_server1: [JCABinding] [DataBAdapter.DBAdapter/2]Unable to complete unload due to: Cannot locate Java class oracle.tip.adapter.db.DBWriteInteractionSpec: Cannot locate Java class oracle.tip.adapter.db.DBWriteInteractionSpec.*
    [11:46:12 AM] Check server log for more details.
    [11:46:12 AM] Error deploying archive sca_DataBAdapter_rev2.jar to partition "default" on server soa_server1 [http://computer:8001]
    [11:46:12 AM] #### Deployment incomplete. ####
    [11:46:12 AM] Error deploying archive file:/C:/JDeveloper/mywork/DataBAdapter/DataBAdapter/deploy/sca_DataBAdapter_rev2.jar
    (oracle.tip.tools.ide.fabric.deploy.common.SOARemoteDeployer)
    Pls let me know if anyone has already faced the same!!!!!!!
    Edited by: 934914 on Jun 19, 2012 5:45 AM

    Hi Vijay,
    Data Base is up ,what am doing ..I have deployed the my DataBAadapter SOA app it was not working so I undeployed the DataBAadapter app ..now I am deploying it again and getting the below error.
    [12:52:33 AM] Sending internal deployment descriptor
    [12:52:33 AM] Sending archive - sca_DataBAdapter_rev2.jar
    [12:52:34 AM] Received HTTP response from the server, response code=500
    [12:52:34 AM] Error deploying archive sca_DataBAdapter_rev2.jar to partition "default" on server soa_server1 [http://192.168.0.105:8001]
    *[12:52:34 AM] HTTP error code returned [500]*
    *[12:52:34 AM] Error message from server:*
    *There was an error deploying the composite on soa_server1: [JCABinding] [DataBAdapter.DBAdapter/2]Unable to complete unload due to: Cannot locate Java class oracle.tip.adapter.db.DBWriteInteractionSpec: Cannot locate Java class oracle.tip.adapter.db.DBWriteInteractionSpec.*
    [12:52:34 AM] Check server log for more details.
    [12:52:34 AM] Error deploying archive sca_DataBAdapter_rev2.jar to partition "default" on server soa_server1 [http://192.168.0.105:8001]
    [12:52:34 AM] #### Deployment incomplete. ####
    [12:52:34 AM] Error deploying archive file:/C:/JDeveloper/mywork/DataBAdapter/DataBAdapter/deploy/sca_DataBAdapter_rev2.jar
    (oracle.tip.tools.ide.fabric.deploy.common.SOARemoteDeployer)

  • Error while trying to deploy 32 bit windows 7 using mdt

    I am trying to deploy 32 bit windows 7 on a 64 bit machine using MDT. After the initial loading it gives an error stating that windows failed to start.
    File:\Windows\system32\drivers\stm_tpm.sys
    status: 0xc000035a
    info: windows failed to load because a critical system driver is missing or corrupt.
    I tried disabling the drivers .. still seeing the same error.
    STMicroelectronics System tpmdrv.inf 1.00.04.14
    STMicroelectronics System tpmdrv.inf 1.00.04.15(1)
    STMicroelectronics System tpmdrv.inf 1.00.04.15(2)
    Can some one help me out..thank you very much

    If you are still getting the same error, then it would suggest that the drivers weren't removed from the image.
    IF this is the WInPE image generated by MDT, then be sure that you run a *Full* update of the deployment share.
    Keith Garner - Principal Consultant [owner] -
    http://DeploymentLive.com

  • Security Error while trying to deploy my project to the application server from jDeve

    Dear All,
    I'm trying to deploy my project to the application server from jDeveloer but i got the following error :
    Invoking Oracle9iAS admin tool...
    D:\Oracle\OUIHome\jdk\jre\bin\javaw.exe -jar D:\Oracle\OUIHome\j2ee\home\admin.jar ormi://M-AMIN:3101/ admin **** -deploy -file D:\Oracle\OUIHome\jdev\mywork\Portal\UserManager\userRegister.ear -deploymentName userRegister
    Security error: This operation was denied. The admin.jar utility can not be used to perform operations against OPMN managed OC4J instnaces. Please use Enterprise Manager or dcmctl instead. Refer to the Oracle9iAS Admin Guide or the OC4J User's Guide for more details.
    Exit status of Oracle9iAS admin tool (-deploy): 1
    #### Deployment incomplete. #### Sep 10, 2002 4:16:53 PM
    Any help will be appreciated
    Regards,
    Mohammed Amin

    In JDev 9.0.2, to deploy to the full 9iAS server (instead of just Oracle9iAS Containers for J2EE [OC4J]), you have to use Enterprise Manager or DCM to deploy your application.
    In JDev 9.0.3 Preview, there is a way to have JDev perform a deployment via DCM for you, if you install a DCM Servlet into 9iAS that comes with JDeveloper.
    By JDev 9.0.3 Production, if you also use Oracle9iAS 9.0.3 Production, it should be possible to deploy to iAS 9.0.3 out-of-the-box.

  • Errors while trying to deploy pda labview

    I'm a total newbie for what concerns PDA applications so maybe I got something wrong...
    I'm trying to build an example vi usign my pocketpc (2003) as a target using labview 8.0
    I installed first labview 8 then embedded c++ sp4 and then pocket pc sdk 2003.
    Finally I installed labview 8 pda module.
    but every time I try to build a vi (even the supplied examples) I get a
    " Error building executable. Unable to create file." An unknown error occured. Please contact National Instruments for more help
    my destination folder is \my documents on the PDA and a local folder on my pc, and I have access to both...
    I tried even build the same vi for a PDA emulator target and I get the same cryptic error message...
    any idea?

    Hi Democritos,
    Often this kind of error appears when you are trying to deploy to the PDA target something that the PDA does not support.
    I would start from this two document.
    Why Do I Receive An Unknown Error When Building a LabVIEW VI For PDA?
    How Can I Tell What Features for Controls and Indicators are Supported in the LabVIEW PDA Module?
    Another source of the same cryptic error message can be an improper installation of all the module needed to build PDA application, the first document suggested above point in this direction too.
    I would check the PDA module manual and verify the proper installation order.
    LabVIEW 8.0 PDA Module Help
    I hope you can dig out a solution from these documents.
    Write if you need further help
    FiloP
    It doesn't matter how beautiful your theory is, it doesn't matter how smart you are. If it doesn't agree with experiment, it's wrong.
    Richard P. Feynman

  • Errors while trying to deploy email portlet

    Hi,
    I am using Oracle JDeveloper 10.1.3. I am trying to register a portlet. The provider validation was unsuccessful. When trying to run it I get the following error messages:
    XML processing error: unable to create object of type edu.umt.portal.custom.CustomRenderCSS due to the following exception: oracle.classloader.util.AnnotatedClassNotFoundException: Missing class: edu.umt.portal.custom.CustomRenderCSS Dependent class: oracle.portal.utils.xml.v2.DefaultNodeHandler Loader: current-workspace-app.web.ceaiWebmailWeb:0.0.0 Code-Source: /C:/jdev/jdev/mywork/ceaiWebmail/ceaiWebmailWeb/public_html/WEB-INF/lib/ptlshare.jar Configuration: WEB-INF/lib/ directory in C:\jdev\jdev\mywork\ceaiWebmail\ceaiWebmailWeb\public_html\WEB-INF\lib This load was initiated at current-workspace-app.web.ceaiWebmailWeb:0.0.0 using the Class.forName() method. The missing class is not available from any code-source or loader in the system.
    can you help me in figuring out what is the problem.
    Thanks
    Abhishek

    Hi Democritos,
    Often this kind of error appears when you are trying to deploy to the PDA target something that the PDA does not support.
    I would start from this two document.
    Why Do I Receive An Unknown Error When Building a LabVIEW VI For PDA?
    How Can I Tell What Features for Controls and Indicators are Supported in the LabVIEW PDA Module?
    Another source of the same cryptic error message can be an improper installation of all the module needed to build PDA application, the first document suggested above point in this direction too.
    I would check the PDA module manual and verify the proper installation order.
    LabVIEW 8.0 PDA Module Help
    I hope you can dig out a solution from these documents.
    Write if you need further help
    FiloP
    It doesn't matter how beautiful your theory is, it doesn't matter how smart you are. If it doesn't agree with experiment, it's wrong.
    Richard P. Feynman

Maybe you are looking for