Mass processing - Error when processing Java programs / VMC out of memory

When running a mass update background process that updates the status of a service order in CRM the job fails due to error 'Error when processing Java programs'. I checked the VMC (SM52) and noticed that there is an error about the VMC running out of memory.
The background program can either be a PPF Action or a Z-ABAP program that performs the update. Both programs are performing a CRM_ORDER_INITIALIZE but it seems that the VMC is not releasing the memory fast enough.
Is there anyway we can force the VMC to release the memory after processing of each individual order?
Thanks!

I got  similar issue and it got resolved by useing CRM_ORDER_INITILAIZE. Initalization should happen after every Order processing and see that only one header guid is passed to the the FM. May not be good option ,but just try by putting wait for 5secs after CRM_ORDER_INITILAIZE.

Similar Messages

  • Error when compiling firefox...Out of memory: Kill process 6763

    I'm trying to compile the firefox version 15 as both 16.0.1 and I always get the same error, which I think leaves me with no ram even though I have 8 gigs, i try it with 8 gigs of swap but does exactly the same, here are all the facts about this problem, the only thing I have not tried is to change the compiler version, what do you think? this is a clear linkage error where the system breaks down after running out of physical memory...
    ERROR--->-using  yaourt -Sb or makepkg -s:
    /tmp/yaourt-tmp-enric/abs-firefox/src/mozilla-release/obj-x86_64-unknown-linux-gnu/toolkit/library/nsUnicharUtils.cpp:275:1: warning: always_inline function might not be inlinable [-Wattributes]
    /tmp/yaourt-tmp-enric/abs-firefox/src/mozilla-release/obj-x86_64-unknown-linux-gnu/toolkit/library/nsUnicharUtils.cpp:50:1: warning: always_inline function might not be inlinable [-Wattributes]
    /tmp/yaourt-tmp-enric/abs-firefox/src/mozilla-release/obj-x86_64-unknown-linux-gnu/toolkit/library/nsUnicharUtils.cpp:40:1: warning: always_inline function might not be inlinable [-Wattributes]
    rm -f libxul.so
    /tmp/yaourt-tmp-enric/abs-firefox/src/mozilla-release/obj-x86_64-unknown-linux-gnu/_virtualenv/bin/python /tmp/yaourt-tmp-enric/abs-firefox/src/mozilla-release/config/pythonpath.py -I../../config /tmp/yaourt-tmp-enric/abs-firefox/src/mozilla-release/config/expandlibs_exec.py --depend .deps/libxul.so.pp --target libxul.so --uselist -- c++ -pedantic -Wall -Wpointer-arith -Woverloaded-virtual -Werror=return-type -Wtype-limits -Wempty-body -Wno-ctor-dtor-privacy -Wno-overlength-strings -Wno-invalid-offsetof -Wno-variadic-macros -Wcast-align -Wno-long-long -march=native -O2 -pipe -fstack-protector --param=ssp-buffer-size=4 -D_FORTIFY_SOURCE=2 -fno-exceptions -fno-strict-aliasing -fno-rtti -ffunction-sections -fdata-sections -fno-exceptions -std=gnu++0x -pthread -pipe -DNDEBUG -DTRIMMED -g -fprofile-generate -O3 -fomit-frame-pointer -fPIC -shared -Wl,-z,defs -Wl,--gc-sections -Wl,-h,libxul.so -o libxul.so nsStaticXULComponents.i_o nsUnicharUtils.i_o nsBidiUtils.i_o nsSpecialCasingData.i_o nsUnicodeProperties.i_o nsRDFResource.i_o -lpthread -Wl,-O1,--sort-common,--as-needed,-z,relro -Wl,-rpath,/usr/lib/firefox -Wl,-z,noexecstack -fprofile-generate -Wl,-rpath-link,/tmp/yaourt-tmp-enric/abs-firefox/src/mozilla-release/obj-x86_64-unknown-linux-gnu/dist/bin -Wl,-rpath-link,/usr/lib ../../toolkit/xre/libxulapp_s.a ../../staticlib/components/libnecko.a ../../staticlib/components/libuconv.a ../../staticlib/components/libi18n.a ../../staticlib/components/libchardet.a ../../staticlib/components/libjar50.a ../../staticlib/components/libstartupcache.a ../../staticlib/components/libpref.a ../../staticlib/components/libhtmlpars.a ../../staticlib/components/libidentity.a ../../staticlib/components/libimglib2.a ../../staticlib/components/libgkgfx.a ../../staticlib/components/libgklayout.a ../../staticlib/components/libdocshell.a ../../staticlib/components/libembedcomponents.a ../../staticlib/components/libwebbrwsr.a ../../staticlib/components/libnsappshell.a ../../staticlib/components/libtxmgr.a ../../staticlib/components/libcommandlines.a ../../staticlib/components/libtoolkitcomps.a ../../staticlib/components/libpipboot.a ../../staticlib/components/libpipnss.a ../../staticlib/components/libappcomps.a ../../staticlib/components/libjsreflect.a ../../staticlib/components/libcomposer.a ../../staticlib/components/libtelemetry.a ../../staticlib/components/libjsinspector.a ../../staticlib/components/libjsdebugger.a ../../staticlib/components/libstoragecomps.a ../../staticlib/components/librdf.a ../../staticlib/components/libwindowds.a ../../staticlib/components/libjsctypes.a ../../staticlib/components/libjsperf.a ../../staticlib/components/libgkplugin.a ../../staticlib/components/libunixproxy.a ../../staticlib/components/libjsd.a ../../staticlib/components/libautoconfig.a ../../staticlib/components/libauth.a ../../staticlib/components/libcookie.a ../../staticlib/components/libpermissions.a ../../staticlib/components/libuniversalchardet.a ../../staticlib/components/libfileview.a ../../staticlib/components/libplaces.a ../../staticlib/components/libtkautocomplete.a ../../staticlib/components/libsatchel.a ../../staticlib/components/libpippki.a ../../staticlib/components/libwidget_gtk2.a ../../staticlib/components/libimgicon.a ../../staticlib/components/libprofiler.a ../../staticlib/components/libaccessibility.a ../../staticlib/components/libremoteservice.a ../../staticlib/components/libspellchecker.a ../../staticlib/components/libzipwriter.a ../../staticlib/components/libservices-crypto.a ../../staticlib/libjsipc_s.a ../../staticlib/libdomipc_s.a ../../staticlib/libdomplugins_s.a ../../staticlib/libmozipc_s.a ../../staticlib/libmozipdlgen_s.a ../../staticlib/libipcshell_s.a ../../staticlib/libgfxipc_s.a ../../staticlib/libhal_s.a ../../staticlib/libdombindings_s.a ../../staticlib/libxpcom_core.a ../../staticlib/libucvutil_s.a ../../staticlib/libchromium_s.a ../../staticlib/libsnappy_s.a ../../staticlib/libgtkxtbin.a ../../staticlib/libthebes.a ../../staticlib/libgl.a ../../staticlib/libycbcr.a -L../../dist/bin -L../../dist/lib /tmp/yaourt-tmp-enric/abs-firefox/src/mozilla-release/obj-x86_64-unknown-linux-gnu/dist/lib/libjs_static.a -lffi -Wl,-rpath-link,/usr/lib -L/usr/lib -lssl3 -lsmime3 -lnss3 -lnssutil3 -lcrmf -lXrender -lfreetype -lfontconfig -lsqlite3 -ljpeg -lpng -lz -lhunspell-1.3 -L/usr/lib -levent -lpixman-1 ../../dist/lib/libgkmedias.a -lasound -lrt -L../../dist/bin -L../../dist/lib -L/usr/lib -lplds4 -lplc4 -lnspr4 -lpthread -ldl ../../dist/lib/libmozalloc.a -ldbus-glib-1 -ldbus-1 -lgobject-2.0 -lglib-2.0 -lX11 -lXext -lpangoft2-1.0 -lfreetype -lfontconfig -lpangocairo-1.0 -lpango-1.0 -lcairo -lgobject-2.0 -lglib-2.0 -lgtk-x11-2.0 -latk-1.0 -lgio-2.0 -lpangoft2-1.0 -lfreetype -lfontconfig -lgdk-x11-2.0 -lpangocairo-1.0 -lgdk_pixbuf-2.0 -lpango-1.0 -lcairo -lgobject-2.0 -lglib-2.0 -lXt -lgthread-2.0 -lfreetype -lstartup-notification-1 -lvpx -ldl -lrt -lrt
    collect2: error: ld terminated with signal 9 [Matat]
    make[6]: *** [libxul.so] Error 1
    make[6]: Leaving directory `/tmp/yaourt-tmp-enric/abs-firefox/src/mozilla-release/obj-x86_64-unknown-linux-gnu/toolkit/library'
    make[5]: *** [libs_tier_platform] Error 2
    make[5]: Leaving directory `/tmp/yaourt-tmp-enric/abs-firefox/src/mozilla-release/obj-x86_64-unknown-linux-gnu'
    make[4]: *** [tier_platform] Error 2
    make[4]: Leaving directory `/tmp/yaourt-tmp-enric/abs-firefox/src/mozilla-release/obj-x86_64-unknown-linux-gnu'
    make[3]: *** [default] Error 2
    make[3]: Leaving directory `/tmp/yaourt-tmp-enric/abs-firefox/src/mozilla-release/obj-x86_64-unknown-linux-gnu'
    make[2]: *** [realbuild] Error 2
    make[2]: Leaving directory `/tmp/yaourt-tmp-enric/abs-firefox/src/mozilla-release'
    make[1]: *** [profiledbuild] Error 2
    make[1]: Leaving directory `/tmp/yaourt-tmp-enric/abs-firefox/src/mozilla-release'
    make: *** [build] Error 2
    dmesg output on  ld :
    [ 1521.353469] ld invoked oom-killer: gfp_mask=0x280da, order=0, oom_adj=0, oom_score_adj=0
    [ 1521.353474] Pid: 6763, comm: ld Not tainted 3.6.0 #1
    [ 1521.353475] Call Trace:
    [ 1521.353482] [<ffffffff814cc68e>] ? dump_header.isra.11+0x5d/0x18e
    [ 1521.353486] [<ffffffff812ae3dc>] ? ___ratelimit+0xac/0x120
    [ 1521.353489] [<ffffffff810e2fb5>] ? oom_kill_process+0x275/0x3b0
    [ 1521.353492] [<ffffffff810e2b10>] ? find_lock_task_mm+0x20/0x70
    [ 1521.353494] [<ffffffff810e3455>] ? out_of_memory+0x1c5/0x290
    [ 1521.353497] [<ffffffff810e742a>] ? __alloc_pages_nodemask+0x85a/0x870
    [ 1521.353500] [<ffffffff811048c4>] ? handle_pte_fault+0x8c4/0xb10
    [ 1521.353505] [<ffffffff81075ddf>] ? select_task_rq_fair+0x4cf/0x790
    [ 1521.353509] [<ffffffff8100a21f>] ? native_sched_clock+0xf/0x70
    [ 1521.353512] [<ffffffff8102b880>] ? do_page_fault+0x130/0x460
    [ 1521.353515] [<ffffffff810e6301>] ? get_page_from_freelist+0x311/0x670
    [ 1521.353519] [<ffffffff814d2275>] ? page_fault+0x25/0x30
    [ 1521.353523] [<ffffffff810df577>] ? file_read_actor+0x67/0x1f0
    [ 1521.353526] [<ffffffff810f6915>] ? shmem_file_aio_read+0x155/0x3a0
    [ 1521.353530] [<ffffffff81128832>] ? do_sync_read+0x92/0xd0
    [ 1521.353532] [<ffffffff811290c0>] ? vfs_read+0xa0/0x160
    [ 1521.353535] [<ffffffff811291c7>] ? sys_read+0x47/0xa0
    [ 1521.353537] [<ffffffff814d2275>] ? page_fault+0x25/0x30
    [ 1521.353540] [<ffffffff814d27fd>] ? system_call_fastpath+0x1a/0x1f
    [ 1521.353541] Mem-Info:
    [ 1521.353543] DMA per-cpu:
    [ 1521.353544] CPU 0: hi: 0, btch: 1 usd: 0
    [ 1521.353545] CPU 1: hi: 0, btch: 1 usd: 0
    [ 1521.353546] CPU 2: hi: 0, btch: 1 usd: 0
    [ 1521.353547] CPU 3: hi: 0, btch: 1 usd: 0
    [ 1521.353548] DMA32 per-cpu:
    [ 1521.353550] CPU 0: hi: 186, btch: 31 usd: 0
    [ 1521.353551] CPU 1: hi: 186, btch: 31 usd: 26
    [ 1521.353552] CPU 2: hi: 186, btch: 31 usd: 59
    [ 1521.353553] CPU 3: hi: 186, btch: 31 usd: 0
    [ 1521.353554] Normal per-cpu:
    [ 1521.353555] CPU 0: hi: 186, btch: 31 usd: 30
    [ 1521.353556] CPU 1: hi: 186, btch: 31 usd: 156
    [ 1521.353557] CPU 2: hi: 186, btch: 31 usd: 169
    [ 1521.353558] CPU 3: hi: 186, btch: 31 usd: 0
    [ 1521.353562] active_anon:1599337 inactive_anon:345122 isolated_anon:0
    active_file:140 inactive_file:222 isolated_file:0
    unevictable:17 dirty:0 writeback:0 unstable:0
    free:11562 slab_reclaimable:14927 slab_unreclaimable:21150
    mapped:6681 shmem:932329 pagetables:10868 bounce:0
    [ 1521.353567] DMA free:15892kB min:20kB low:24kB high:28kB active_anon:0kB inactive_anon:0kB active_file:0kB inactive_file:0kB unevictable:0kB isolated(anon):0kB isolated(file):0kB present:15644kB mlocked:0kB dirty:0kB writeback:0kB mapped:0kB shmem:0kB slab_reclaimable:0kB slab_unreclaimable:8kB kernel_stack:0kB pagetables:0kB unstable:0kB bounce:0kB writeback_tmp:0kB pages_scanned:0 all_unreclaimable? yes
    [ 1521.353568] lowmem_reserve[]: 0 3147 7925 7925
    [ 1521.353575] DMA32 free:23592kB min:4520kB low:5648kB high:6780kB active_anon:2754024kB inactive_anon:412764kB active_file:16kB inactive_file:44kB unevictable:0kB isolated(anon):0kB isolated(file):0kB present:3223060kB mlocked:0kB dirty:0kB writeback:0kB mapped:5892kB shmem:1294220kB slab_reclaimable:7144kB slab_unreclaimable:5108kB kernel_stack:216kB pagetables:8616kB unstable:0kB bounce:0kB writeback_tmp:0kB pages_scanned:715 all_unreclaimable? yes
    [ 1521.353576] lowmem_reserve[]: 0 0 4778 4778
    [ 1521.353582] Normal free:6764kB min:6860kB low:8572kB high:10288kB active_anon:3643324kB inactive_anon:967724kB active_file:544kB inactive_file:844kB unevictable:68kB isolated(anon):0kB isolated(file):0kB present:4892832kB mlocked:68kB dirty:0kB writeback:0kB mapped:20832kB shmem:2435096kB slab_reclaimable:52564kB slab_unreclaimable:79484kB kernel_stack:2968kB pagetables:34856kB unstable:0kB bounce:0kB writeback_tmp:0kB pages_scanned:2484 all_unreclaimable? yes
    [ 1521.353583] lowmem_reserve[]: 0 0 0 0
    [ 1521.353586] DMA: 1*4kB 0*8kB 1*16kB 0*32kB 2*64kB 1*128kB 1*256kB 0*512kB 1*1024kB 1*2048kB 3*4096kB = 15892kB
    [ 1521.353592] DMA32: 740*4kB 506*8kB 300*16kB 135*32kB 25*64kB 0*128kB 0*256kB 0*512kB 0*1024kB 1*2048kB 1*4096kB = 23872kB
    [ 1521.353599] Normal: 637*4kB 0*8kB 0*16kB 2*32kB 1*64kB 0*128kB 1*256kB 1*512kB 1*1024kB 1*2048kB 0*4096kB = 6516kB
    [ 1521.353605] 932908 total pagecache pages
    [ 1521.353606] 0 pages in swap cache
    [ 1521.353607] Swap cache stats: add 0, delete 0, find 0/0
    [ 1521.353608] Free swap = 0kB
    [ 1521.353609] Total swap = 0kB
    [ 1521.369740] 2094576 pages RAM
    [ 1521.369743] 80362 pages reserved
    [ 1521.369744] 36619 pages shared
    [ 1521.369745] 1993098 pages non-shared
    [ 1521.369746] [ pid ] uid tgid total_vm rss nr_ptes swapents oom_score_adj name
    [ 1521.369752] [ 2286] 0 2286 6258 269 16 0 -1000 systemd-udevd
    [ 1521.369754] [ 2293] 0 2293 153174 83 229 0 0 systemd-journal
    [ 1521.369757] [ 3585] 0 3585 4695 188 13 0 0 mount.ntfs-3g
    [ 1521.369759] [ 3615] 0 3615 3547 140 12 0 0 crond
    [ 1521.369761] [ 3616] 0 3616 6708 2523 18 0 0 preload
    [ 1521.369763] [ 3617] 0 3617 17762 297 38 0 0 cupsd
    [ 1521.369765] [ 3619] 0 3619 43562 313 52 0 0 NetworkManager
    [ 1521.369767] [ 3620] 84 3620 6988 70 20 0 0 avahi-daemon
    [ 1521.369769] [ 3621] 0 3621 6515 72 18 0 0 systemd-logind
    [ 1521.369770] [ 3622] 81 3622 4595 285 14 0 -900 dbus-daemon
    [ 1521.369772] [ 3626] 0 3626 2275 32 9 0 0 agetty
    [ 1521.369774] [ 3627] 0 3627 6693 53 19 0 0 kdm
    [ 1521.369776] [ 3628] 84 3628 6957 52 18 0 0 avahi-daemon
    [ 1521.369778] [ 3631] 0 3631 45316 12716 91 0 0 X
    [ 1521.369780] [ 4287] 0 4287 15666 128 36 0 0 kdm
    [ 1521.369782] [ 5131] 102 5131 92417 912 41 0 0 polkitd
    [ 1521.369784] [ 5132] 0 5132 53222 346 41 0 0 colord
    [ 1521.369786] [ 5163] 0 5163 129753 991 153 0 0 colord-sane
    [ 1521.369788] [11395] 0 11395 523912 258 62 0 0 console-kit-dae
    [ 1521.369790] [11468] 1000 11468 3668 111 13 0 0 startkde
    [ 1521.369792] [11480] 1000 11480 3970 37 13 0 0 dbus-launch
    [ 1521.369794] [11481] 1000 11481 4839 401 15 0 0 dbus-daemon
    [ 1521.369796] [11507] 1000 11507 4068 94 12 0 0 gpg-agent
    [ 1521.369798] [11510] 1000 11510 3760 87 11 0 0 ssh-agent
    [ 1521.369799] [11524] 1000 11524 1013 21 7 0 -300 start_kdeinit
    [ 1521.369801] [11525] 1000 11525 85821 1591 149 0 -300 kdeinit4
    [ 1521.369803] [11528] 1000 11528 188590 3072 227 0 0 kded4
    [ 1521.369805] [11534] 1000 11534 108217 2084 173 0 0 kwalletd
    [ 1521.369807] [11539] 1000 11539 107913 2348 173 0 0 kglobalaccel
    [ 1521.369809] [11542] 0 11542 55597 601 43 0 0 upowerd
    [ 1521.369811] [11555] 1000 11555 1047 18 7 0 0 kwrapper4
    [ 1521.369813] [11556] 1000 11556 127307 2185 174 0 0 ksmserver
    [ 1521.369814] [11568] 0 11568 49409 269 33 0 0 udisks-daemon
    [ 1521.369816] [11573] 0 11573 12394 89 28 0 0 udisks-daemon
    [ 1521.369818] [11577] 1000 11577 214097 12177 260 0 0 kwin
    [ 1521.369820] [11590] 1000 11590 93530 1489 131 0 0 kactivitymanage
    [ 1521.369822] [11621] 1000 11621 343123 3417 215 0 0 knotify4
    [ 1521.369824] [11631] 1000 11631 175587 4370 239 0 0 krunner
    [ 1521.369826] [11633] 1000 11633 246522 16714 342 0 0 plasma-desktop
    [ 1521.369828] [11636] 1000 11636 216148 5325 253 0 0 lancelot
    [ 1521.369830] [11639] 1000 11639 50634 268 35 0 0 mission-control
    [ 1521.369831] [11643] 1000 11643 37597 405 39 0 0 akonadi_control
    [ 1521.369833] [11645] 1000 11645 357276 722 81 0 0 akonadiserver
    [ 1521.369835] [11652] 1000 11652 377776 6206 70 0 0 mysqld
    [ 1521.369837] [11738] 1000 11738 76786 1061 110 0 0 akonadi_agent_l
    [ 1521.369839] [11739] 1000 11739 76783 1056 111 0 0 akonadi_agent_l
    [ 1521.369841] [11740] 1000 11740 75143 1033 111 0 0 akonadi_agent_l
    [ 1521.369843] [11741] 1000 11741 75144 1042 110 0 0 akonadi_agent_l
    [ 1521.369845] [11742] 1000 11742 75800 1048 112 0 0 akonadi_agent_l
    [ 1521.369847] [11743] 1000 11743 75800 1054 107 0 0 akonadi_agent_l
    [ 1521.369848] [11744] 1000 11744 76786 1064 108 0 0 akonadi_agent_l
    [ 1521.369850] [11745] 1000 11745 76780 1073 111 0 0 akonadi_agent_l
    [ 1521.369852] [11746] 1000 11746 84215 1305 155 0 0 akonadi_maildis
    [ 1521.369854] [11747] 1000 11747 92098 1211 138 0 0 akonadi_nepomuk
    [ 1521.369856] [11774] 1000 11774 59745 591 76 0 0 nepomukserver
    [ 1521.369858] [11777] 1000 11777 287924 2235 149 0 0 nepomukservices
    [ 1521.369860] [11795] 1000 11795 100823 10181 51 0 0 virtuoso-t
    [ 1521.369861] [11801] 1000 11801 93041 786 99 0 0 pulseaudio
    [ 1521.369863] [11802] 133 11802 41125 46 17 0 0 rtkit-daemon
    [ 1521.369865] [11811] 1000 11811 17253 140 36 0 0 gconf-helper
    [ 1521.369867] [11813] 1000 11813 11527 127 26 0 0 gconfd-2
    [ 1521.369869] [11816] 1000 11816 68886 1148 123 0 0 kuiserver
    [ 1521.369871] [11837] 1000 11837 58146 1047 105 0 0 nepomukservices
    [ 1521.369873] [11839] 1000 11839 53655 966 98 0 0 nepomukservices
    [ 1521.369875] [11840] 1000 11840 92263 1128 107 0 0 nepomukservices
    [ 1521.369877] [11841] 1000 11841 109750 1232 107 0 0 nepomukservices
    [ 1521.369878] [12942] 1000 12942 41975 542 78 0 0 kwrited
    [ 1521.369880] [12944] 1000 12944 246808 6774 195 0 0 ktorrent
    [ 1521.369882] [12954] 1000 12954 93430 1212 139 0 0 polkit-kde-auth
    [ 1521.369884] [12957] 1000 12957 70673 1126 130 0 0 nepomukcontroll
    [ 1521.369886] [12959] 1000 12959 92309 1654 138 0 0 kgpg
    [ 1521.369888] [12966] 1000 12966 109879 2164 176 0 0 klipper
    [ 1521.369890] [13009] 1000 13009 86477 1682 131 0 0 kio_http_cache_
    [ 1521.369892] [17302] 1000 17302 270535 59165 488 0 0 firefox
    [ 1521.369894] [17322] 1000 17322 10407 86 26 0 0 gvfsd
    [ 1521.369896] [17324] 1000 17324 50365 171 31 0 0 gvfs-fuse-daemo
    [ 1521.369897] [18462] 1000 18462 138761 5014 199 0 0 konsole
    [ 1521.369899] [18464] 1000 18464 4227 156 13 0 0 bash
    [ 1521.369901] [19535] 1000 19535 3885 324 13 0 0 yaourt
    [ 1521.369903] [19680] 1000 19680 3800 253 13 0 0 makepkg
    [ 1521.369905] [22861] 1000 22861 174765 6917 209 0 0 dolphin
    [ 1521.369907] [24940] 1000 24940 12258 2121 27 0 0 Xvfb
    [ 1521.369909] [24941] 1000 24941 2944 134 11 0 0 make
    [ 1521.369911] [25116] 1000 25116 2946 137 11 0 0 make
    [ 1521.369913] [25337] 1000 25337 3013 200 11 0 0 make
    [ 1521.369915] [ 473] 1000 473 2977 169 12 0 0 make
    [ 1521.369917] [ 3719] 1000 3719 3006 176 12 0 0 make
    [ 1521.369919] [10784] 1000 10784 3006 175 13 0 0 make
    [ 1521.369921] [12252] 1000 12252 115351 9567 175 0 0 kvirc
    [ 1521.369922] [26014] 1000 26014 4256 168 13 0 0 bash
    [ 1521.369925] [30177] 1000 30177 4255 167 14 0 0 bash
    [ 1521.369926] [30976] 1000 30976 86977 3634 138 0 0 plugin-containe
    [ 1521.369928] [ 915] 1000 915 87003 1648 132 0 0 kio_file
    [ 1521.369930] [ 916] 1000 916 109277 2635 176 0 0 kio_thumbnail
    [ 1521.369932] [ 1186] 1000 1186 4227 157 13 0 0 bash
    [ 1521.369934] [ 2105] 1000 2105 86873 1689 132 0 0 klauncher
    [ 1521.369936] [ 2473] 1000 2473 87003 1648 132 0 0 kio_file
    [ 1521.369938] [ 3468] 1000 3468 141313 5962 206 0 0 kate
    [ 1521.369940] [ 6331] 1000 6331 109512 2225 174 0 0 kate
    [ 1521.369942] [ 6733] 1000 6733 2983 150 12 0 0 make
    [ 1521.369943] [ 6760] 1000 6760 17243 1559 39 0 0 python
    [ 1521.369945] [ 6761] 1000 6761 1882 30 9 0 0 c++
    [ 1521.369947] [ 6762] 1000 6762 1816 23 9 0 0 collect2
    [ 1521.369949] [ 6763] 1000 6763 812215 809141 1588 0 0 ld
    [color=#FF40BF][ 1521.369951] Out of memory: Kill process 6763 (ld) score 402 or sacrifice child
    [ 1521.369953] Killed process 6763 (ld) total-vm:3248860kB, anon-rss:3236396kB, file-rss:168kB[/color]
    gcc -v
    Using built-in specs.
    COLLECT_GCC=gcc
    COLLECT_LTO_WRAPPER=/usr/lib/gcc/x86_64-unknown-linux-gnu/4.7.2/lto-wrapper
    Target: x86_64-unknown-linux-gnu
    Configured with: /build/src/gcc-4.7.2/configure --prefix=/usr --libdir=/usr/lib --libexecdir=/usr/lib --mandir=/usr/share/man --infodir=/usr/share/info --with-bugurl=https://bugs.archlinux.org/ --enable-languages=c,c++,ada,fortran,go,lto,objc,obj-c++ --enable-shared --enable-threads=posix --with-system-zlib --enable-__cxa_atexit --disable-libunwind-exceptions --enable-clocale=gnu --disable-libstdcxx-pch --enable-libstdcxx-time --enable-gnu-unique-object --enable-linker-build-id --with-ppl --enable-cloog-backend=isl --disable-ppl-version-check --disable-cloog-version-check --enable-lto --enable-gold --enable-ld=default --enable-plugin --with-plugin-ld=ld.gold --with-linker-hash-style=gnu --disable-multilib --disable-libssp --disable-build-with-cxx --disable-build-poststage1-with-cxx --enable-checking=release
    Thread model: posix
    gcc version 4.7.2 (GCC)
    cat /proc/meminfo
    MemTotal: 8056856 kB
    MemFree: 1240336 kB
    Buffers: 278356 kB
    Cached: 4591784 kB
    SwapCached: 0 kB
    Active: 2700172 kB
    Inactive: 3860720 kB
    Active(anon): 2498432 kB
    Inactive(anon): 2441488 kB
    Active(file): 201740 kB
    Inactive(file): 1419232 kB
    Unevictable: 68 kB
    Mlocked: 68 kB
    SwapTotal: 0 kB
    SwapFree: 0 kB
    Dirty: 124 kB
    Writeback: 0 kB
    AnonPages: 1690996 kB
    Mapped: 218032 kB
    Shmem: 3249176 kB
    Slab: 172972 kB
    SReclaimable: 90332 kB
    SUnreclaim: 82640 kB
    KernelStack: 3264 kB
    PageTables: 38384 kB
    NFS_Unstable: 0 kB
    Bounce: 0 kB
    WritebackTmp: 0 kB
    CommitLimit: 4028428 kB
    Committed_AS: 6713700 kB
    VmallocTotal: 34359738367 kB
    VmallocUsed: 92972 kB
    VmallocChunk: 34359642076 kB
    HugePages_Total: 0
    HugePages_Free: 0
    HugePages_Rsvd: 0
    HugePages_Surp: 0
    Hugepagesize: 2048 kB
    DirectMap4k: 10240 kB
    DirectMap2M: 7237632 kB
    /etc/makepkg.conf
    # ARCHITECTURE, COMPILE FLAGS
    CARCH="x86_64"
    CHOST="x86_64-unknown-linux-gnu"
    CFLAGS="-march=native -O2 -pipe -fstack-protector --param=ssp-buffer-size=4 -D_FORTIFY_SOURCE=2"
    CXXFLAGS="${CFLAGS}"
    LDFLAGS="-Wl,-O1,--sort-common,--as-needed,-z,relro"
    MAKEFLAGS="-j5"
    thanks a lot
    Last edited by papu (2012-10-13 17:35:38)

    yes it's true it take 4gigs of 8 gigs i have,  but when i was using gentoo never had this problem when i was compiling any package and then my pc was 4gigs.
    df -hT
    Filesystem Type Size Used Avail Use% Mounted on
    rootfs rootfs 51G 7.7G 41G 17% /
    dev devtmpfs 3.9G 0 3.9G 0% /dev
    run tmpfs 3.9G 1.6M 3.9G 1% /run
    /dev/sdb2 ext4 51G 7.7G 41G 17% /
    tmpfs tmpfs 3.9G 76K 3.9G 1% /dev/shm
    tmpfs tmpfs 3.9G 0 3.9G 0% /sys/fs/cgroup
    tmpfs tmpfs 3.9G 56K 3.9G 1% /tmp
    /dev/sdc1 fuseblk 299G 237G 62G 80% /mnt/share
    /dev/sdb1 ext2 183M 28M 146M 16% /boot
    /dev/sdb3 ext4 18G 6.2G 11G 37% /home
    i am using vanilla kernel 3.6.0
    cat /etc/fstab
    # /etc/fstab: static file system information
    # <file system> <dir> <type> <options> <dump> <pass>
    tmpfs /tmp tmpfs nodev,nosuid 0 0
    # /dev/sdb2
    UUID=412194cb-8953-4d02-94b4-d25d21bd7126 / ext4 rw,relatime,barrier=0 0 1
    #/dev/sdb1
    UUID=8bc28611-e3ee-4079-b311-33b9d4a0f36a /boot ext2 rw,relatime 0 2
    #/dev/sdb3
    UUID=2d6d63e0-a59f-439f-9c11-f6673055e65a /home ext4 rw,relatime,barrier=0 0 2
    #/dev/sdc1
    UUID=60F0F9D3F0F9AF80 /mnt/share ntfs-3g umask=0 0 0
    what i have to do ?
    thanks so much. friends!
    Last edited by papu (2012-10-13 19:44:17)

  • Getting error when calling Java program from JSP page.

    Hi All,
    I'm getting below error msg, previously the page use to display and also java program use to run properly, but suddenly today i came across this error. May be some settings have been changed on my server, since number of developers uses this common webserver here.
    Any help would be much appreciated. Pls let me know if if anyone requires much info regarding this one.
    javax.servlet.ServletException: sun/tools/javac/Main
         at java.lang.Throwable.fillInStackTrace(Native Method)
         at java.lang.Throwable.fillInStackTrace(Compiled Code)
         at java.lang.Throwable.(Compiled Code)
         at java.lang.Exception.(Compiled Code)
         at javax.servlet.ServletException.(Compiled Code)
         at org.apache.jasper.servlet.JspServlet.service(Compiled Code)
         at javax.servlet.http.HttpServlet.service(Compiled Code)
         at org.apache.tomcat.core.ServletWrapper.doService(Compiled Code)
         at org.apache.tomcat.core.Handler.service(Compiled Code)
         at org.apache.tomcat.core.ServletWrapper.service(Compiled Code)
         at org.apache.tomcat.facade.RequestDispatcherImpl.doForward
    Root cause:
    java.lang.NoClassDefFoundError: sun/tools/javac/Main
         at org.apache.jasper.compiler.SunJavaCompiler.compile(Compiled Code)
         at org.apache.jasper.compiler.Compiler.compile(Compiled Code)
         at org.apache.jasper.servlet.JspServlet.doLoadJSP(Compiled Code)
         at org.apache.jasper.servlet.JasperLoader12.loadJSP(Compiled Code)
         at org.apache.jasper.servlet.JspServlet.loadJSP(Compiled Code)
         at org.apache.jasper.servlet.JspServlet$JspServletWrapper.loadIfNecessary(Compiled Code)
         at org.apache.jasper.servlet.JspServlet$JspServletWrapper.service(Compiled Code)
         at org.apache.jasper.servlet.JspServlet.serviceJspFile(Compiled Code)
         at org.apache.jasper.servlet.JspServlet.service(Compiled Code)
    Message was edited by:
    shukla_arvind

    did u happen to upgrade ur jdk?????

  • Error when processing your request -syntax eror in program /1BEA/SAPLCRMB_O

    Hi All,
    I have regenerated Billing Application in CRM 7.0. From then I am getting a dump on Web UI . Error as below.
    Error when processing your request
    The URL http://hostname/sap/bc/bsp/sap/crm_ui_frame/bspwdApplication.do was not called due to an error.
    The following error processed in the system: "syntax error in program /1BEA/SAPLCRMB_O".
    This Dump does not occur every time. now & then I am getting the dump but not every time. mostly it comes when I process any thing for the first time on UI.
    Please help me out to fix this dump. it is a standard program so we can not correct the program. Please let me know if there is any other way to fix this problem.
    Thanks in advance
    JM

    Hi,
    This is not a standard program, this is a generated program through billing engine. I guess you'd have to regenerate the program. Talk to your functional folks who created this.
    Regards
    Prasenjit

  • Error when processing your request

    Error when processing your request
    What has happened?
    The URL http://vinay:8000/sap/bc/webdynpro/sap/zfirst_web was not called due to an error.
    Note
         The following error text was processed in the system NSP : Die URL enthält keine vollständige Domainangabe (vinay statt vinay.).
         The error occurred on the application server vinay_NSP_00 and in the work process 0 .
         The termination type was: RABAX_STATE
         The ABAP call stack was:
    Method: CHECK of program CX_FQDN=======================CP
    Method: STARTUP_CHECKS of program CL_WDR_CLIENT_ABSTRACT_HTTP===CP
    Method: HANDLE_REQUEST of program CL_WDR_CLIENT_ABSTRACT_HTTP===CP
    Method: IF_HTTP_EXTENSION~HANDLE_REQUEST of program CL_WDR_MAIN_TASK==============CP
    Method: EXECUTE_REQUEST of program CL_HTTP_SERVER================CP
    Function: HTTP_DISPATCH_REQUEST of program SAPLHTTP_RUNTIME
    Module: %_HTTP_START of program SAPMHTTP
    What can I do?
         If the termination type was RABAX_STATE, then you can find more information on the cause of the termination in the system NSP in transaction ST22.
         If the termination type was ABORT_MESSAGE_STATE, then you can find more information on the cause of the termination on the application server vinay_NSP_00 in transaction SM21.
         If the termination type was ERROR_MESSAGE_STATE, then you can search for more information in the trace file for the work process 0 in transaction ST11 on the application server vinay_NSP_00 . In some situations, you may also need to analyze the trace files of other work processes.
         If you do not yet have a user ID, contact your system administrator.
    Error code: ICF-IE-http -c: 001 -u: BCUSER -l: E -s: NSP -i: vinay_NSP_00 -w: 0 -d: 20090622 -t: 074756 -v: RABAX_STATE -e: UNCAUGHT_EXCEPTION
    HTTP 500 - Internal Server Error
    Your SAP Internet Communication Framework Team

    Hi Thomas,
    I realize this is a rather old discussion, but I wonder if you know whether running transaction SGEN to generate the loads for either all web dynpros or just a particular transport containing a custom web dynpro would resolve the slow response time and timeout. After a customer message with SAP, this was their suggestion, however our Basis team is skeptical that this will have the desired effect. We noticed the issue when moving from development to QA so we won't know if this is the solution until we try it in production upon go-live.
    Cheers,
    Amy

  • Error When Processing Picking List Script.

    Hi Experts,
    I have created Script for Picking List,
    I am getting the below error when processing ...
    Error Info...   VN 073: Errors occurred while processing output
    Its working fine when Standard Script SD_PICK_SINGLE is used ..
    Pls Help.
    Regards

    Hi Raghu,
    Before processing your picking list form make sure you have created a output type for it and you have assigned your form name and program name to that output type. you can see this in TCODE: NACE
    Thanks,
    Pritesh

  • Error when processing asset under construction (AuC) for WBS element message no cj824

    Hi,
    i am getting error message when i change dates in activities.
    Error when processing asset under construction (AuC) for WBS element
    Message no. CJ 824
    i have checked related post but did not find any solution. also check SAP Note but not related to my issue.
    Please guide.
    thanks
    Sunil

    Hi Ken,
    Please check below screens:
    according to this error message AUC has some missing field or some incorrect value. but when i checked via program RAUNVA00 which will display
    Incomplete Assets - Detail List.
    but this program does not return any incompleteness.
    i found many threads and SAP Not but none of is related to my program. this problem comes when i change dates in activity and save the project.
    Please suggest what to do now.
    thanks
    Sunil

  • Error when processing

    Dear All,
    As the required configuration is done and R/3 and when i am trying to bring this application through SE80 BSP Application with HCM_Learning and execute, I am getting the following error in the Explorer Screen. Kindly request you to advice me on this. I have given the details of the error below.
    Error when processing your request
    What has happened?
    The URL http://r3devsuz.suzlon.com:8000/sap/bc/bsp/sap/HCM_LEARNING/traininghome.htm was not called due to an error.
    Note
    The following error text was processed in the system DEV : Exception condition "INITIAL_LEARNER" raised.
    The error occurred on the application server r3devsuz_DEV_00 and in the work process 0 .
    The termination type was: RABAX_STATE
    The ABAP call stack was:
    Function: LSOF_LEARNER_GET_ACTIVITIES of program SAPLLSO_FRONTEND
    Method: ONINITIALIZATION of program CLO267CI12QAAMONPBLHCNROVQJS5CP
    Method: %_ONINITIALIZATION of program CL_O267CI12QAAMONPBLHCNROVQJS5CP
    Method: DO_REQUEST of program CL_BSP_PAGE===================CP
    Method: ON_REQUEST of program CL_BSP_RUNTIME================CP
    Method: IF_HTTP_EXTENSION~HANDLE_REQUEST of program CL_HTTP_EXT_BSP===============CP
    Method: EXECUTE_REQUEST of program CL_HTTP_SERVER================CP
    Function: HTTP_DISPATCH_REQUEST of program SAPLHTTP_RUNTIME
    Module: %_HTTP_START of program SAPMHTTP

    Hi Ravi,
    Since your The termination type was: RABAX_STATE
    Goto the Tcode ST22 and check for the ABAP Dump analysis.
    Also the initial page for the BSP application "HCM_LEARNING" is "leso.htm".
    Did you activate the service? in the Tcode SICF.
    Hope this helps you.
    Regards,
    Subbu.

  • SNC: ASN - Error when processing your request

    Dear experts,
    we are implementing SMI scenario with SNC 5.1, we have created in SNC Web UI a Replenishment Order and we have published it now Iu2019m trying to create an ASN releted to that RO but I have another strange error with ASN, could you please have a look and tell me your opinion?
    From RO details I click on u201CCreate ASN for Itemsu201D, I insert all the information needed and all checks are successifully passed, but when I try to publish it the following error screen appears me.
    This error appears also when I try to save a draft of the ASN.
    Error when processing your request
    What has happened?
    The URL <url> was not called due to an error.
    Note
    The following error text was processed in the system <System name>: Syntax error in program /1BCPPF/CL_100SCABOL_DLV_X====CP .
    The error occurred on the application server <application server> and in the work process 0 .
    The termination type was: RABAX_STATE
    The ABAP call stack was:
    Method: EVALUATE of program CL_METHOD_CONDITION_PPF=======CP
    Method: EVALUATE of program CL_CONDITION_PPF==============CP
    Method: IF_DETERMINATION_PPF~DETERMINE of program CL_RULE_DETERMINATION_PPF=====CP
    Method: DETERMINE of program CL_TTYPE_PPF==================CP
    Method: DETERMINE of program CL_CONTEXT_MANAGER_PPF========CP
    Method: DETERMINE of program CL_MANAGER_PPF================CP
    Method: SEND_SNL of program /SCMB/CL_SVDELIVERY===========CP
    Method: SAVE_SNL of program /SCMB/CL_SVDELIVERY===========CP
    Method: SAVE of program /SCA/CL_SVDELIVERY============CP
    Function: /SCA/BOL_RFC_DLV_CHANGE of program /SCA/SAPLBOL_DLV
    What can I do?
    If the termination type was RABAX_STATE, then you can find more information on the cause of the termination in the system <system number> in transaction ST22.
    If the termination type was ABORT_MESSAGE_STATE, then you can find more information on the cause of the termination on the application server <server> in transaction SM21.
    If the termination type was ERROR_MESSAGE_STATE, then you can search for more information in the trace file for the work process 0 in transaction ST11 on the application server <server>. In some situations, you may also need to analyze the trace files of other work processes.
    If you do not yet have a user ID, contact your system administrator.
    HTTP 500 - Internal Server Error
    Your SAP Internet Communication Framework Team 
    I've checked and reactivated all ODMs related to ASN, according to the SAP Note 1019289 (SNC5.1 Order Documents: Required Customizing).
    Could you please give me your opinion about this?
    Thank you very much in advance,
    Nicola
    Edited by: PTP Team Consultants on Nov 1, 2011 4:29 PM

    Hi Martin,
    Thank you for your answer.
    This is the error analysis in transaction ST22:
    Error analysis
        The following syntax error was found in the program
         /1BCPPF/CL_100SCABOL_DLV_X====CP :
        "The field "LV_EVAL_OUTCOME" is unknown, but there is a field with the "
        "similar name "RULE_EVALUATION_OUTCOME". "RULE_EVALUATION_OUTCOME"."
    Thank you,
    Nicola
    Edited by: PTP Team Consultants on Nov 3, 2011 12:32 PM

  • SC-Error when processing your request.

    Hi ,
    when click the Shop link in the SRm portal, it gives the below error message.
    Error when processing your request.
    The Error occured on the application server p1bfsp23_FSP_44
    There Termination TYPE was : ABORT_MESSAGE_STATE
    The ABAP  call stack was :
    Form:OUTPUT_EXPRESS_MESSAGES of program SAPLBBP_SC_UI_ITS
    Form:EXTERNAL_SCREEN_DETERMINE of Program  SAPLBBP_SC_UI_ITS
    Module:EXTERNAL_SCREEN_DETERMINE of Program  SAPLBBP_SC_UI_ITS
    Please assist me on this.
    Thanks,
    Dev

    Hi Devaraj,
    Please provide the below information from the full dump (transaction st22):
    Runtime Errors
    Exception
    Short text
    Information on where terminated
    Active Calls/Events
    With this information it will be possible to have a better idea about what could be causing this dump.
    Best regards,
    Christian Zeuch

  • MSS Reports - Error when processing your request

    Hi Experts,
    We got the following error, while executing MSS reports. Would really appreciate kind guidance to reslove the issue.
    Error as below:
    Error when processing your request
    What has happened?
    The URL http://m2003075d.**********/sap/bc/gui/sap/its/HRWPC_FC_EXEC was not called due to an error.
    (Intentionally kept **** to kept confidentiality about the client)
    Note
    The following error text was processed in the system ECQ : Template interpretation cancelled, syntax error.
    The error occurred on the application server M2003075D_ECQ_00 and in the work process 0 .
    The termination type was: RABAX_STATE
    The ABAP call stack was:
    SYSTEM-EXIT of program SAPLSLVC_FULLSCREEN
    Function: REUSE_ALV_GRID_DISPLAY of program SAPLSLVC_FULLSCREEN
    Form: DISPLAY_LIST of program RPTQTA10
    END-OF-SELECTION of program RPTQTA10
    What can I do?
    If the termination type was RABAX_STATE, then you can find more information on the cause of the termination in the system ECQ in transaction ST22.
    If the termination type was ABORT_MESSAGE_STATE, then you can find more information on the cause of the termination on the application server M2003075D_ECQ_00 in transaction SM21.
    If the termination type was ERROR_MESSAGE_STATE, then you can search for more information in the trace file for the work process 0 in transaction ST11 on the application server M2003075D_ECQ_00 . In some situations, you may also need to analyze the trace files of other work processes.
    If you do not yet have a user ID, contact your system administrator.
    Error code: ICF-IE-http -c: 200 -u: MANAGER1 -l: E -s: ECQ -i: M2003075D_ECQ_00 -w: 0 -d: 20090710 -t: 160454 -v: RABAX_STATE -e: ITS_CANT_LOAD_INCLUDE
    HTTP 500 - Internal Server Error
    Your SAP Internet Communication Framework Team
    Thanks in advance,
    Aashish

    Hi,
    You need to Publish the services in a proper sequence, then only it will get activated.
    Also switch between SAP GUI for windows and SAP gui for HTML, because if you are accessing the system through network, problem may arise.
    Try switching between these launchpads, might help you.
    Publish the WEBGUI first, SHUFFLER then, and dont forget to publish completely, else it wont work.

  • Error in BPM - Error when processing node '0000000065' ParForEach index

    Hi All,
    I have an issue .. I have done 1:n mapping successfully and would like to place the Send step in loop instead of a Block .. The reason being I have the count of how many times the Send step should executed for multiline.. I need to receive an Acknowledgement for each send step.. If I dont receive the required number of Acknowledgements then .. I need to revert back some Creations which is a business requirement ..
    So .. I have initialized a container operation variable i to '0' .. Then the loop condition is i < count .. Send the multi-container .. Receive the Response .. If dont receive the desired response for any one of the multi-line then I need to do a cancellation process in a loop again .. So .. now I am getting an Exception "Error when processing node '0000000065' (ParForEach index 000000)
    Message no. SWP088" in the loop step ..
    It is fine if somebody can suggest alternate logic can be applied as well but first preference to use a loop which consumes lesser system resources ..
    Kindly look into the Issue
    Regards,
    Raj
    Edited by: raj2112 on Sep 21, 2010 2:34 PM

    if you use a loop step, you will send one message per time. ussing block step you have parallel processing ussing ParForEach. now is for  X reason the item cannot be created, do a roll back in the target system. the problem here you will do the rollback once the last message reach.
    the other posibility is to handle application ack in the sender step. it will let you know it the message was processed success and this ack could be the end condition of your block step. but you cannot use this with loop step.
    take a look to this
    http://help.sap.com/saphelp_nw04/helpdata/en/55/65c844539349e9b1450581ab44a5e6/frameset.htm

  • Error when processing Network

    Dear all.
    I create a sales order in tcode va01 and input a wbs element E-000009.1 in the field of WBS Element at Account assignment tab of one item detail.When save the sales order,sap pop up a message box with text "Sales order has no CO object".The detail message content was pasted at bottom.When confirm the first message box,sap pop up the second message box with text "Error when processing Network".The detail message content was pasted at bottom.
    So I need the experts give me some useful advice and reference to resolve the problem.
    Thank you.
    Regards
    Yoda
    Sales order has no CO object
    Message no. CO323
    Diagnosis
    The production order should be settled on the sales order.
    The requirements type of the sales order, however, refers to an account assignment category that does not allow settlement using the sales order (key consumption posting).
    Procedure
    1. Check which requirements type in entered in the relevant sales order item
    Display sales order
    2. Check the settings for this requirements type in Customizing
    (See Control sales order-related production).
    Error when processing Network
    Message no. V1380
    Diagnosis
    A technical error has occurred. On calling up the assembly interface, exception 2 was triggered. The exceptions have the following meanings:
    1 = External block
    2 = General error
    3 = Insufficient data for the interface
    4 = Order was not found
    5 = Update has been rejected
    6 = Final document number for Network is not issued
    Procedure
    Inform your system administrator.

    Dear shashank.
    Thanks for you reply.
    1.I have checked the sales order and the requ. type was KMNP.In tran OVZH the requ. type KMNP use the ReqCl 202.In tran OVZG I checked the ReqCl 202 and the "Acct.assig.cat." was Q and the Consumption was P.
    2.In tran cj20n I checked the wbs element.Its operative indicator was billing elements.
    3.In tran mm03 I try to found the field of "req type / strategy".But I could not this field.Could you tell me the "req type / strategy" field was in which view?
    Thank you so much.
    Regards
    Yoda

  • Soap response Error when processing XML CF.

    Hello,
    I have problems with soap response and wondered if you could give some advice.
    Every time I send my message via soap I get the following error:
    com.sap.aii.af.ra.ms.api.RecoverableException: SOAP: response message contains an error XIAdapter/HTTP/ADAPTER.HTTP_EXCEPTION - HTTP 500 Error when processing XML CF.
    Is it possible that the communication is aborted and  my response message mapping is never started?
    (Additional info: I tried to create an integration process and am not able to evaluate the response.)
    Thanks a lot for your help.
    Regards,
    Julia

    hi,
    do you see any more error details in :
    http://xiserver:port/MessagingSystem/monitor
    did you check logs in visual admin ?
    >>>>Is it possible that the communication is aborted and my response message mapping is never started?
    yes - if the response is not ok the mapping may not be started
    Regards,
    michal
    <a href="/people/michal.krawczyk2/blog/2005/06/28/xipi-faq-frequently-asked-questions"><b>XI / PI FAQ - Frequently Asked Questions</b></a>

  • Processing error when doing a drillthrough agianst a Rolap dimension, working with MOLAP

    Hi,
    I'm having a drillthrough dimension (fact) that i'm using for drillthrough scripts. One thing that I have come a cross is that I get processing errors when I run queries agianst a ROLAP dimension where as it works agianst the same dimension set
    as MOLAP. This is kind of confusing me.
    The error message i get is like this one:
    Errors in the OLAP storage engine: The process operation ended because the number of errors encountered during processing reached the defined
    limit of allowable errors for the operation.
    Errors in the OLAP storage engine: An error occurred while the 'Journal NO' attribute of the 'GLFact' dimension from the 'XXX' database was being processed.
    I found a article about this
    http://sqlblog.com/blogs/marco_russo/archive/2009/01/17/issues-executing-a-drillthrough-with-a-rolap-dimension.aspx
    But I have set KeyDuplicate, Keynotfound, Nullkeyconvertedtounknown and NullKeynotallowed to ignoreerror and still it doesn't work.
    So my questions are 2:
    1. Do anyone have a solution for me? Or having any thoughts about this?
    2. When switching over to MOLAP the processingtime takes about 30 min. How can i decrease this to a minimum?
    This is all implemented in SSAS 2005.

    I'm getting the exact same error when attempting to drill down on a rolap dimension associated to the cube.  the cube is molap, but the dimension is rolap to reduce processing time (processing dimension using molap spike my 4 core processing to 100%
    for 4 minutes due to all the select DISTINCT on the attributes (about 10)). 
    I too have seen the article about KeyDuplicate but I think this is a different issue.  Anyone figure out the problem?
    Version: SSAS 2012 SP2
    Example of error:
    Server: The current operation was cancelled because another operation in the transaction failed. Errors in the OLAP storage engine: An error occurred while the 'City' attribute of the 'NameAddress'
    dimension from the 'MyDatabase' database was being processed. Errors in the OLAP storage engine: The process operation ended because the number of errors encountered during processing reached the defined limit of allowable errors for the operation.

Maybe you are looking for


HashFlare