Object CL_SWF_XI_MSG_BROKER method SEND_SYNCHRON cannot be executed

Hi there,
We are getting this error in our BPM:
Object CL_SWF_XI_MSG_BROKER method SEND_SYNCHRON cannot be executed
while sending a message synchronously. This doesn't happen for all the sync send, but I see sometimes. Why do we see this inconsistency in the sync send step of the BPM?
Has anyone encountered this problem, and fixed it? Your help is greatly appreciated.
Thanks a lot.
Karma

Hi
First of all check the mapping i.e transformation step in the BPM (Sync mapping). This you can check from the workflow log. Check all these interface mappings are using correct message type and interfaces
Have a look into these SAP notes-830803,710445
Regards
krishna

Similar Messages

  • Object CL_SWF_XI_MSG_BROKER method CALL_TRANSFORMATION cannot be executed

    Hi all,
    I am getting error in one of the BPM mapping steps.
    The error description is as below:
    Error handling for work item 000000013183
    Work item 000000013186: Object CL_SWF_XI_MSG_BROKER method CALL_TRANSFORMATION cannot be executed
    com/sap/xi/tf/_MM_352_Validated_To_353_File_com.sap.aii.utilxi.misc.api.BaseRuntimeExceptionRunti
    The mapping works fine for a set of data.
    But when the validations fail for another set of data it gives the above error.
    Please let me know if you have info on this error.
    Best regards,
    Thangesh

    Hi,
    The scenario is File<->XI->IDoc.
    In BPM, we do validations & if the validation fails, the file is sent back to the Filerserver.
    The File format is a nested structure.
    The File format is as below:
       >Header record
       >Customer
       >Address
       >Address
       >Partner details
            >>Address
            >>Address
       >Partner details 
           >>Address
           >>Address
       >Trailer record
    <b>The mapping works fine for a set of data:</b>
    The mapping works fine if the File structure contains single record per structure/node.
    <b>But the validations fail for another set of data & it gives the above error:</b>
    But the mapping fails if the File structure is complex or nested structure. i.e., more than one record per structure.
    could you kindly suggest how to handle this error?
    best regards,
    Thangesh

  • Method SENDTASKDESCRIPTION cannot be executed

    Hi,
         I am getting error message while creating attachment in the work item but it was working fine in Development and quality.. only happens in production... without attachment my workflow works fine.. the only problem is attachment.. Pls guide me how to resolve it..
    Error :-   Work item 000000575666: Object 000000575666 method SENDTASKDESCRIPTION c
    Document <FOL33000000000004RAW35000000027513> could not be sent
    Error handling for work item 000000575666...
    Regards,
    Roops.

    Hello,
    I'll see if I can find anything, I assume you've searched as well though.
    Please make sure you're getting all of the error messages in the workflow log, try Extras > All Errors.
    Does it only happen for some users? Check SU53 or ST01 for authorization problems.
    Check that it finds at least one recipient and that it is a valid user.
    Also check SOST for any errors.
    Anyone else have ideas?
    regards
    Rick Bakker
    Hanabi Technology

  • Workflow error: method of object cannot be executed

    HI,
       I extended mkpf to zmkpf and added a method to it.
       when ran the workflow.I am getting the following errors.
    Notification of completion cannot be generated                                 
    Problems occurred when generating a mail                                       
    Error '9' when calling service 'SO_OBJECT_SEND'                                
    Error handling for work item 000000440554                                      
    Work item 000000440554: Object ZMKPF method GET_PR_MAILID cannot be executed   
    Object does not exist                                                          
    Object does not exist             
    my binding to task and method:
    zmkpf  - WIOBJECT_ID  export
    mailid import.
    Please suggest how i can fix this error.
    Thanks in advance,
    Nuthan.

    Hi Nuthan
    It's difficult to say what out access to the concrete issue.
    but, make sure that the correct object is binded in to the task and that you do not have any bindings from the task to the method.
    But if its working in foreground but not in background it could be because there are some dialog steps in the task, have you checked if you're getting any shortdumps.
    if not you can try to debug your background task with this little trick:
    1. Create an endless loop in the start of your method, make sure you can break out of it using the debugger (while X is initial, and then set X to 1 in the debugger)
    2. In sm50 your now able to find the running process, from in here you can debug the process (I don't remember the menu)
    3. After debug remember to delete the loop again
    Regards
    Morten Nielsen

  • Object BUS2030 method CREATEQUOTATION can't be executed

    Hi, am modifying the standard Workflow template 'AD_SD_AG' (WS23000025).
    <b>In my User-ID</b>:
    When i create any Inquiry (via IDOC), the BUS2030-Created event triggers this workflow and Quotationis created by the method 'CEATEQUOTATION'
    <b>in End Users ID:</b>
    when the same process is carried out, Workflow is end up with an error as mentioned above.
    The errors are like:
    1) Object BUS2030 method CREATEQUOTATION cannot be executed
    2) Exception '1001' is not defined for method 'CREATEQUOTATION' object type
        BUS2030.
    I am totally confused why it is so happening, Executing in one users ID and not in the another User ID.
    Also please give me suggestions how to handle Exceptions for the BUS2030-CREATEQUOTATION method in the Workflow.
    Thanks & regards in advance.
    Any replys are rewarede

    Hi mike,
    I checked with SU53, the authorization object is missing for that user.  I need to check this still, if it works once object is assigned to that user.
    In workflow am getting the error like below, please suggest me on this:
    Exception 1001 is not defined for the method CREATEQUOTATION object type BUS2030.
    regards
    Manju

  • WF Error: Object CL_HRASR00_WF_COMPONENTS method WI_EXECUTION_VIA_R3_INBOX

    I am using the standard task 17900100 to allow a manager to 'edit' an adobe form (not just approve or reject). The issue below does not occur every time but sometimes there is an error in the workflow log. The error message is as follows:
    Object CL_HRASR00_WF_COMPONENTS method WI_EXECUTION_VIA_R3_INBOX cannot be executed.
    I can see in the log that the agent was selected correctly but the task has not been sent to the agent. When I use transaction SWPR to restart the workflow (without making any changes), it restarts just fine and the task is sent to the agent's UWL inbox.
    Does anyone know why I may be getting this error and how to prevent it? Could be related to a timing issue since it only occurs occassionally and not for every WF instance?
    Thanks,
    Derrick

    Hi Derrick,
    Did you find any solution to this issue? I am also facing the same issue.
    I checked in application log SLG1 and the following error is logged:
    Person is already being processed by user 01CPxxxxxxxx. (message number PBAS_SERVICE001)
    However, this is happenning in some occassions but not everytime I execute 'Send' button in UWL workitem (Task TS33700021).
    Regards,
    Sumit

  • Work item 000000399133: Object 000000399133 method SENDTASKDESCRIPTION can

    hi experts,
                       sometimes frequently i get this kind of wrror after executing my workflow.
    Work item 000000399133: Object 000000399133 method SENDTASKDESCRIPTION cannot be executed..how to correct this??what might be the problem?

    HI,
    Please check user to whom you are sending mail are populated OR not ,Please check your rule  .
    For confirmation just hardcode user and then trigger the workflow .
    regards,
    Deepanker Dwivedi

  • Error:Work item 000000001099:Object FLOWITEM method EXECUTE cannot be execu

    Hello experts,
    I have created a Sales order workflow whr after creation sales order will go to 1 person inbox and he will check the SO thoroughly and thn i hv added a user decision step for APPROVED or REJECTED for same person.
    Now after creation of sales order it goin to the person inbox for checkin SO but when he is saving it thn decision screen with button APPROVED or REJCTED is not coming and m getting error :Work item 000000001099: Object FLOWITEM method EXECUTE cannot be executed. and error: Error when processing node '0000000024' (ParForEach index 000000)
    i checked the agent mapping for both step....and thr is no error in agent mappin...in both steps i have mapped same rule with responsibility IDs
    PLz suggest urgently wht can be cause of error.
    Regards
    Nitin

    Hi Nitin,
    I think this seems to be an agent assignment issue.
    To debug this issue go to the workflow log and check if the agents are correctly being picked by the rule or not. Simulate the rule and check for the agents being picked.
    In the workflow log, check the agent for the User Decision step. If there is no agent found then there might be some issue with the data passed to rule.
    Hope this helps!
    Regards,
    Saumya

  • PO release workflow - Object FLOWITEM method EXECUTE  - WL821

    Hello,
    I have copied and slightly mofidified std wf WS20000075 (BUS2012). It was successfully tested in DEV.
    Then, after transport to QA, I get the following error in tc SWEL:
    Work item 000000001111: Object FLOWITEM method EXECUTE cannot be executed
    Error when processing node '0000000093' (ParForEach index 000000)
    Agent determination for step '0000000093' failed
    Workflow WS90100001 no. 000000001111 activity 0000000093 role 'AC20000027': No agent found
    Resolution of rule AC20000027 for task TS20000166: no agent found
    Error when processing node '0000000093' (ParForEach index 000000)
    Error when creating a component of type 'Schritt'
    Error when creating a work item
    The top error is detailled as below:
    Work item 000000001111: Object FLOWITEM method EXECUTE cannot be executed
        Message no. WL821
    Any clue on how to fix this this error?
    Best regards,
    Peter

    Hi Rick
    I have same issue and following are details.
    1. I have copied standard workflow and task 166 is throwing error.
    "Resolution of rule AC20000027 for task TS20000166: no agent found"
    2. I have recreated the step but still the workflow is throwing error.
    3. If I execute the rule individually (PFAC_DIS) with a specific PO then the rule works fine. The rule executes the below mentioned exit successfully.
    4. I am using exit to determine the agent, the workflow works fine if I don't use the exit. The exit is EXIT_SAPLEBNF_005. I am just pulling the agent from a ztable.
    Please advise if you can help as I have not seen anyone answering.
    by the way irrespective of the explicit rule update in the workflow the step executes AC20000027 by default.
    Can you please help asap. Thank you.
    regards
    barin

  • BPM error: exception cx_merge_split occured,object FLOWITEM method EXECUTE

    Hi Guys
    I am working on a interface involving BPM.....
    I am facing this problem while executing the interface...
    I am getting error texts as below:
    exception cx_merge_split occured,
    object FLOWITEM method EXECUTE
    I am trying to fix it....Please provide any iputs on this...
    Thanx in adavance.

    Is your Transformation step designed for multimapping (n:1 or 1:n)?
    If yes the payload seems to be incorrect....did you check the working of your mapping (MM/ IM) using the expected payload structure...
    the transformation step in BPM has been given exception as System Error
    There is one block step before the transformation step...in which exception is not given...?can this be the cause??
    Does it mean...you have a Block step in your BPM and your Transformation Step is placed in it....the Block should have an exception handling branch...have the exception handling logic as per your need....the Block step needs to use Exception Handler...same Handler to be used in the Transformation Step's System Error section.
    Press F7 and check if your BPM is giving any warning message.
    Regards,
    Abhishek.

  • Error: "The search cannot be executed because the table has pending changes that would be lost."

    Hello,
    I'm working a developing an OA page that will displays the contents of an Oracle table and allows the user to update records in a table as needed.
    When I hit submit button to save the changes in the update page, the control goes back to main page (where all the table records are displayed). It displays the updated record with the new information.However when I hit "Go" button on the mainPG, I get the error "The search cannot be executed because the table has pending changes that would be lost. and the changes are not committed.
    ANy suggestions on where I should look will be greatly appreciated.
    Posting code for my controller
    =======================
              if ( pageContext.getParameter("saveRate") != null )
              personam.invokeMethod("saveRateToDatabase");
    Code from my AM
    =============
        public void saveRateToDatabase()
          getOADBTransaction().commit();
          System.out.println("40--After commit has been executed");
    Code from my VORowImpl
    ===================
    package cggv.oracle.apps.gl.server;
    import oracle.apps.fnd.framework.server.OAViewRowImpl;
    import oracle.jbo.domain.Date;
    import oracle.jbo.domain.Number;
    import oracle.jbo.server.AttributeDefImpl;
    // ---    File generated by Oracle ADF Business Components Design Time.
    // ---    Custom code may be added to this class.
    // ---    Warning: Do not modify method signatures of generated methods.
    public class xxCggGlRatesVORowImpl extends OAViewRowImpl {
        public static final int RATEID = 0;
        public static final int FROMCURRENCY = 1;
        public static final int TOCURRENCY = 2;
        public static final int FROMCONVERSIONDATE = 3;
        public static final int TOCONVERSIONDATE = 4;
        public static final int USERCONVERSIONTYPE = 5;
        public static final int CONVERSIONRATE = 6;
        public static final int MODEFLAG = 7;
        /**This is the default constructor (do not remove)
        public xxCggGlRatesVORowImpl() {
        /**Gets the attribute value for the calculated attribute RateId
        public Number getRateId() {
            return (Number) getAttributeInternal(RATEID);
        /**Sets <code>value</code> as the attribute value for the calculated attribute RateId
        public void setRateId(Number value) {
            setAttributeInternal(RATEID, value);
            //populateAttribute(RATEID, value);
        /**Gets the attribute value for the calculated attribute FromCurrency
        public String getFromCurrency() {
            return (String) getAttributeInternal(FROMCURRENCY);
        /**Sets <code>value</code> as the attribute value for the calculated attribute FromCurrency
        public void setFromCurrency(String value) {
            setAttributeInternal(FROMCURRENCY, value);      
        /**Gets the attribute value for the calculated attribute ToCurrency
        public String getToCurrency() {
            return (String) getAttributeInternal(TOCURRENCY);
        /**Sets <code>value</code> as the attribute value for the calculated attribute ToCurrency
        public void setToCurrency(String value) {
            setAttributeInternal(TOCURRENCY, value);
        /**Gets the attribute value for the calculated attribute FromConversionDate
        public Date getFromConversionDate() {
            return (Date) getAttributeInternal(FROMCONVERSIONDATE);
        /**Sets <code>value</code> as the attribute value for the calculated attribute FromConversionDate
        public void setFromConversionDate(Date value) {
            setAttributeInternal(FROMCONVERSIONDATE, value);      
        /**Gets the attribute value for the calculated attribute ToConversionDate
        public Date getToConversionDate() {
            return (Date) getAttributeInternal(TOCONVERSIONDATE);
        /**Sets <code>value</code> as the attribute value for the calculated attribute ToConversionDate
        public void setToConversionDate(Date value) {
            setAttributeInternal(TOCONVERSIONDATE, value);       
        /**Gets the attribute value for the calculated attribute UserConversionType
        public String getUserConversionType() {
            return (String) getAttributeInternal(USERCONVERSIONTYPE);
        /**Sets <code>value</code> as the attribute value for the calculated attribute UserConversionType
        public void setUserConversionType(String value) {
            setAttributeInternal(USERCONVERSIONTYPE, value);
        /**Gets the attribute value for the calculated attribute ConversionRate
        public Number getConversionRate() {
            return (Number) getAttributeInternal(CONVERSIONRATE);
        /**Sets <code>value</code> as the attribute value for the calculated attribute ConversionRate
        public void setConversionRate(Number value) {
            setAttributeInternal(CONVERSIONRATE, value);
        /**Gets the attribute value for the calculated attribute ModeFlag
        public String getModeFlag() {
            return (String) getAttributeInternal(MODEFLAG);
        /**Sets <code>value</code> as the attribute value for the calculated attribute ModeFlag
        public void setModeFlag(String value) {
            setAttributeInternal(MODEFLAG, value);      
        /**getAttrInvokeAccessor: generated method. Do not modify.
        protected Object getAttrInvokeAccessor(int index,
                                               AttributeDefImpl attrDef) throws Exception {
            switch (index) {
            case RATEID:
                return getRateId();
            case FROMCURRENCY:
                return getFromCurrency();
            case TOCURRENCY:
                return getToCurrency();
            case FROMCONVERSIONDATE:
                return getFromConversionDate();
            case TOCONVERSIONDATE:
                return getToConversionDate();
            case USERCONVERSIONTYPE:
                return getUserConversionType();
            case CONVERSIONRATE:
                return getConversionRate();
            case MODEFLAG:
                return getModeFlag();
            default:
                return super.getAttrInvokeAccessor(index, attrDef);
        /**setAttrInvokeAccessor: generated method. Do not modify.
        protected void setAttrInvokeAccessor(int index, Object value,
                                             AttributeDefImpl attrDef) throws Exception {
            switch (index) {
            case RATEID:
                setRateId((Number)value);
                return;
            case FROMCURRENCY:
                setFromCurrency((String)value);
                return;
            case TOCURRENCY:
                setToCurrency((String)value);
                return;
            case FROMCONVERSIONDATE:
                setFromConversionDate((Date)value);
                return;
            case TOCONVERSIONDATE:
                setToConversionDate((Date)value);
                return;
            case USERCONVERSIONTYPE:
                setUserConversionType((String)value);
                return;
            case CONVERSIONRATE:
                setConversionRate((Number)value);
                return;
            case MODEFLAG:
                setModeFlag((String)value);
                return;
            default:
                super.setAttrInvokeAccessor(index, value, attrDef);
                return;
        /**Gets xxCggGlRatesEO entity object.
        public xxCggGlRatesEOImpl getxxCggGlRatesEO() {
            return (xxCggGlRatesEOImpl)getEntity(0);

    Hi,
    Check these links:
    Oracle Apps: Search cannot be executed because the table has pending changes that would be lost
    Re: Getting error in search page search cannot be executed
    http://jneelmani.blogspot.in/2009/11/oaf-search-cannot-be-executed-because.html
    --Sushant

  • "Error:The search cannot be executed because the table has pending changes that would be lost", after DELETE

    Good day,
    On Search Page, I have searched for the record(s) then deleted a record and got confirmation message i.e. Record has deleted. Next when I search for any record I'm getting below error.
    Error
    The search cannot be executed because the table has pending changes that would be lost.
    Could you please help me to fix this issue. Your response is highly appreciated.
    Item properties:
    Item Style : Image
    Action Type: Fire Action
    Event : delete
    Below is the code using in CO and AM
    Controller (processFormRequest):
    if ("delete".equals(pageContext.getParameter(EVENT_PARAM)))
              // The user has clicked a "Delete" icon so we want to display a "Warning"
              // dialog asking if she really wants to delete the employee. Note that we
              // configure the dialog so that pressing the "Yes" button submits to
              // this page so we can handle the action in this processFormRequest( ) method.
              String visit_id = pageContext.getParameter("visit_id");
              String employeeName = pageContext.getParameter("last_name") + ", " + pageContext.getParameter("first_name");
              MessageToken[] tokens = { new MessageToken("EMP_NAME", employeeName)};
              OAException mainMessage = new OAException("FND", "XXXX_EMP_DELETE_WARN", tokens);
              // Note that even though we're going to make our Yes/No buttons submit a
              // form, we still need some non-null value in the constructor's Yes/No
              // URL parameters for the buttons to render, so we just pass empty
              // Strings for this.
              OADialogPage dialogPage = new OADialogPage(OAException.WARNING,
                mainMessage, null, "", "");
              // Always use Message Dictionary for any Strings you want to display.
              String yes = pageContext.getMessage("AK", "FWK_TBX_T_YES", null);
              String no = pageContext.getMessage("AK", "FWK_TBX_T_NO", null);
              // We set this value so the code that handles this button press is
              // descriptive.
    dialogPage.setOkButtonItemName("DeleteYesButton");
              // The following configures the Yes/No buttons to be submit buttons,
              // and makes sure that we handle the form submit in the originating
              // page (the "Employee" summary) so we can handle the "Yes"
              // button selection in this controller.
    dialogPage.setOkButtonToPost(true);
    dialogPage.setNoButtonToPost(true);
    dialogPage.setPostToCallingPage(true);
              // Now set our Yes/No labels instead of the default OK/Cancel.
    dialogPage.setOkButtonLabel(yes);
    dialogPage.setNoButtonLabel(no);
              // We need to keep hold of the employeeNumber and employeeName.
              // The OADialogPage gives us a convenient means
              // of doing this. Note that the use of the Hashtable is 
              // most appropriate for passing multiple parameters. See the OADialogPage
              // javadoc for an alternative when dealing with a single parameter.
              java.util.Hashtable formParams = new java.util.Hashtable(1);
    formParams.put("visit_id", visit_id);
    formParams.put("empName", employeeName);
    dialogPage.setFormParameters(formParams);
              pageContext.redirectToDialogPage(dialogPage);
        else if (pageContext.getParameter("DeleteYesButton") != null)
              // User has confirmed that she wants to delete this employee.
              // Invoke a method on the AM to set the current row in the VO and
              // call remove() on this row.
              String employeeNumber = pageContext.getParameter("visit_id");
              String employeeName = pageContext.getParameter("empName");
              Serializable[] parameters = { employeeNumber };
             // OAApplicationModule am = pageContext.getApplicationModule(webBean);
    am.invokeMethod("deleteEmployee", parameters);
              // Now, redisplay the page with a confirmation message at the top. Note
              // that the deleteEmployee() method in the AM commits, and our code
              // won't get this far if any exceptions are thrown.
              MessageToken[] tokens = { new MessageToken("EMP_NAME", employeeName) };
              OAException message = new OAException("FND",
                "XXXX_EMP_DELETE_CONFIRM", tokens, OAException.CONFIRMATION, null);
    pageContext.putDialogMessage(message);
    Application Module:
      public void deleteEmployee(String visit_id)
            // First, we need to find the selected employee in our VO.
            // When we find it, we call remove( ) on the row which in turn
            // calls remove on the associated EmployeeEOImpl object.
            int empToDelete = Integer.parseInt(visit_id);
              OAViewObject vo = (OAViewObject)getNonEmployeesSummaryVO1();
        NonEmployeesSummaryVORowImpl row = null;
            // This tells us the number of rows that have been fetched in the
            // row set, and will not pull additional rows in like some of the
            // other "get count" methods.
           int fetchedRowCount = vo.getFetchedRowCount();
            // We use a separate iterator -- even though we could step through the
            // rows without it -- because we don't want to affect row currency.
            RowSetIterator deleteIter = vo.createRowSetIterator("deleteIter");
    if (fetchedRowCount > 0)
              deleteIter.setRangeStart(0);
              deleteIter.setRangeSize(fetchedRowCount);
              for (int i = 0; i < fetchedRowCount; i++)
                row = (NonEmployeesSummaryVORowImpl)deleteIter.getRowAtRangeIndex(i);
                // For performance reasons, we generate ViewRowImpls for all
                // View Objects. When we need to obtain an attribute value,
                // we use the named accessors instead of a generic String lookup.
                // Number primaryKey = (Number)row.getAttribute("EmployeeId");
                Number primaryKey = row.getVisitId();
                if (primaryKey.compareTo(empToDelete) == 0)
                  // This performs the actual delete.
                  row.remove();
                    getTransaction().commit();
                  break; // only one possible selected row in this case
            // Always close the iterator when you're done.
            deleteIter.closeRowSetIterator();
          } // end deleteEmployee
    Thanks,
    Ravi

    Hi
    Check this link Getting error in search page search cannot be executed
    Regards,
    Dilip

  • Search cannot be executed because the table has pending changes

    I'm getting the following error ..... The search cannot be executed because the table has pending changes that would be lost .... in the following scenario ....
    My 1st page is a search page with resulting rows from which the user can select specific rows to process ..... next button will populate the VO for the 2nd page by manually looping thru the selected rows in the VO of the 1st page. Loop logic is in the AM and it calls a method in the VORowImpl that uses setAttributeInternal .... the 2nd page displays the selected rows .....
    Pressing the back button of the 2nd page will display the 1st page and if the user tries to do a new search .... the error shows up.
    Any suggestions on how to handle this?
    Thank you.

    It seems to me that you are using the same VO on both the pages. If that is the case try to use separate VO for each page.
    And as suggested by Sumit, Never use/ rely on browser back button. Instead put a Back button on the second page through you can handle the event yourself rather than leaving on the mercy of browser.
    --Saroj                                                                                                                                                                                                                                                                                                                                                                                                                                                                                                                                                                                                                                                                                               

  • [SOLVED] C Compiler Cannot Create Executables

    I am aware that there is already a thread on this here however it failed to solve my issue. I have installed the multilib-devel packages as the referenced post suggested, but I still receive the following error message when attempting to compile wine-mono package either with makepkg or with yaourt.
    checking build system type... x86_64-unknown-linux-gnu
    checking host system type... x86_64-w64-mingw32
    checking target system type... x86_64-w64-mingw32
    checking for a BSD-compatible install... /usr/bin/install -c
    checking whether build environment is sane... yes
    checking for x86_64-w64-mingw32-strip... no
    checking for strip... strip
    configure: WARNING: using cross tools not prefixed with host triplet
    checking for a thread-safe mkdir -p... /bin/mkdir -p
    checking for gawk... gawk
    checking whether make sets $(MAKE)... yes
    checking how to create a ustar tar archive... gnutar
    checking whether to enable maintainer-specific portions of Makefiles... no
    checking whether ln -s works... yes
    checking host platform characteristics... ok
    checking for x86_64-w64-mingw32-gcc... no
    checking for gcc... gcc
    checking for x86_64-w64-mingw32-gcc... gcc
    checking whether the C compiler works... no
    configure: error: in `/tmp/yaourt-tmp-sensei/aur-wine-mono/src/wine-mono-0.0.4/build-cross-x86_64':
    configure: error: C compiler cannot create executables
    See `config.log' for more details
    My config.log:
    This file contains any messages produced by compilers while
    running configure, to aid debugging if configure makes a mistake.
    It was created by mono configure 2.11.1, which was
    generated by GNU Autoconf 2.69. Invocation command line was
    $ ../mono/configure --prefix=/home/sensei/Downloads/Builds/wine-mono/src/wine-mono-0.0.4/build-cross-x86_64-install --build=x86_64-unknown-linux-gnu --target=x86_64-w64-mingw32 --host=x86_64-w64-mingw32 --with-tls=none --disable-mcs-build --enable-win32-dllmain=yes --with-libgc-threads=win32 PKG_CONFIG=false mono_cv_clang=no
    ## Platform. ##
    hostname = archmage
    uname -m = x86_64
    uname -r = 3.3.8-1-ARCH
    uname -s = Linux
    uname -v = #1 SMP PREEMPT Tue Jun 5 15:20:32 CEST 2012
    /usr/bin/uname -p = unknown
    /bin/uname -X = unknown
    /bin/arch = unknown
    /usr/bin/arch -k = unknown
    /usr/convex/getsysinfo = unknown
    /usr/bin/hostinfo = unknown
    /bin/machine = unknown
    /usr/bin/oslevel = unknown
    /bin/universe = unknown
    PATH: /usr/local/bin
    PATH: /usr/bin
    PATH: /bin
    PATH: /usr/local/sbin
    PATH: /usr/sbin
    PATH: /sbin
    PATH: /usr/bin/core_perl
    PATH: /home/sensei/Documents/Scripts
    ## Core tests. ##
    configure:2970: checking build system type
    configure:2984: result: x86_64-unknown-linux-gnu
    configure:3004: checking host system type
    configure:3017: result: x86_64-w64-mingw32
    configure:3037: checking target system type
    configure:3050: result: x86_64-w64-mingw32
    configure:3099: checking for a BSD-compatible install
    configure:3167: result: /usr/bin/install -c
    configure:3178: checking whether build environment is sane
    configure:3233: result: yes
    configure:3292: checking for x86_64-w64-mingw32-strip
    configure:3322: result: no
    configure:3332: checking for strip
    configure:3348: found /usr/bin/strip
    configure:3359: result: strip
    configure:3371: WARNING: using cross tools not prefixed with host triplet
    configure:3384: checking for a thread-safe mkdir -p
    configure:3423: result: /bin/mkdir -p
    configure:3430: checking for gawk
    configure:3446: found /usr/bin/gawk
    configure:3457: result: gawk
    configure:3468: checking whether make sets $(MAKE)
    configure:3490: result: yes
    configure:3565: checking how to create a ustar tar archive
    configure:3578: tar --version
    tar (GNU tar) 1.26
    Copyright (C) 2011 Free Software Foundation, Inc.
    License GPLv3+: GNU GPL version 3 or later <http://gnu.org/licenses/gpl.html>.
    This is free software: you are free to change and redistribute it.
    There is NO WARRANTY, to the extent permitted by law.
    Written by John Gilmore and Jay Fenlason.
    configure:3581: $? = 0
    configure:3621: tardir=conftest.dir && eval tar --format=ustar -chf - "$tardir" >conftest.tar
    configure:3624: $? = 0
    configure:3628: tar -xf - <conftest.tar
    configure:3631: $? = 0
    configure:3644: result: gnutar
    configure:3654: checking whether to enable maintainer-specific portions of Makefiles
    configure:3663: result: no
    configure:3680: checking whether ln -s works
    configure:3684: result: yes
    configure:3737: checking host platform characteristics
    configure:4029: result: ok
    configure:4090: checking for x86_64-w64-mingw32-gcc
    configure:4120: result: no
    configure:4130: checking for gcc
    configure:4146: found /usr/bin/gcc
    configure:4157: result: gcc
    configure:4187: checking for x86_64-w64-mingw32-gcc
    configure:4214: result: gcc
    configure:4483: checking for C compiler version
    configure:4492: gcc --version >&5
    gcc (GCC) 4.7.0 20120505 (prerelease)
    Copyright (C) 2012 Free Software Foundation, Inc.
    This is free software; see the source for copying conditions. There is NO
    warranty; not even for MERCHANTABILITY or FITNESS FOR A PARTICULAR PURPOSE.
    configure:4503: $? = 0
    configure:4492: gcc -v >&5
    Using built-in specs.
    COLLECT_GCC=gcc
    COLLECT_LTO_WRAPPER=/usr/lib/gcc/x86_64-unknown-linux-gnu/4.7.0/lto-wrapper
    Target: x86_64-unknown-linux-gnu
    Configured with: /build/src/gcc-4.7-20120505/configure --prefix=/usr --libdir=/usr/lib --libexecdir=/usr/lib --mandir=/usr/share/man --infodir=/usr/share/info --with-bugurl=https://bugs.archlinux.org/ --enable-languages=c,c++,ada,fortran,go,lto,objc,obj-c++ --enable-shared --enable-threads=posix --with-system-zlib --enable-__cxa_atexit --disable-libunwind-exceptions --enable-clocale=gnu --disable-libstdcxx-pch --enable-libstdcxx-time --enable-gnu-unique-object --enable-linker-build-id --with-ppl --enable-cloog-backend=isl --enable-lto --enable-gold --enable-ld=default --enable-plugin --with-plugin-ld=ld.gold --with-linker-hash-style=gnu --disable-multilib --disable-libssp --disable-build-with-cxx --disable-build-poststage1-with-cxx --enable-checking=release
    Thread model: posix
    gcc version 4.7.0 20120505 (prerelease) (GCC)
    configure:4503: $? = 0
    configure:4492: gcc -V >&5
    gcc: error: unrecognized command line option '-V'
    gcc: fatal error: no input files
    compilation terminated.
    configure:4503: $? = 1
    configure:4492: gcc -qversion >&5
    gcc: error: unrecognized command line option '-qversion'
    gcc: fatal error: no input files
    compilation terminated.
    configure:4503: $? = 1
    configure:4523: checking whether the C compiler works
    configure:4545: gcc -march=x86-64 -mtune=generic -O2 -pipe -fstack-protector --param=ssp-buffer-size=4 -D_FORTIFY_SOURCE=2 -DWINVER=0x0500 -D_WIN32_WINNT=0x0500 -D_WIN32_IE=0x0501 -D_UNICODE -DUNICODE -DWIN32_THREADS -DFD_SETSIZE=1024 -DGC_NOT_DLL -Wl,-O1,--sort-common,--as-needed,-z,relro,--hash-style=gnu -lmswsock -lws2_32 -lole32 -loleaut32 -lpsapi -lversion -ladvapi32 -lwinmm -lkernel32 conftest.c >&5
    /usr/bin/ld: cannot find -lmswsock
    /usr/bin/ld: cannot find -lws2_32
    /usr/bin/ld: cannot find -lole32
    /usr/bin/ld: cannot find -loleaut32
    /usr/bin/ld: cannot find -lpsapi
    /usr/bin/ld: cannot find -lversion
    /usr/bin/ld: cannot find -ladvapi32
    /usr/bin/ld: cannot find -lwinmm
    /usr/bin/ld: cannot find -lkernel32
    collect2: error: ld returned 1 exit status
    configure:4549: $? = 1
    configure:4587: result: no
    configure: failed program was:
    | /* confdefs.h */
    | #define PACKAGE_NAME "mono"
    | #define PACKAGE_TARNAME "mono"
    | #define PACKAGE_VERSION "2.11.1"
    | #define PACKAGE_STRING "mono 2.11.1"
    | #define PACKAGE_BUGREPORT "http://bugzilla.xamarin.com/enter_bug.cgi?classification=Mono"
    | #define PACKAGE_URL ""
    | #define PACKAGE "mono"
    | #define VERSION "2.11.1"
    | #define HOST_WIN32 1
    | #define DISABLE_PORTABILITY 1
    | #define PLATFORM_NO_SYMLINKS 1
    | #define TARGET_WIN32 1
    | #define MINGW_CROSS_COMPILE 1
    | /* end confdefs.h. */
    |
    | int
    | main ()
    | {
    |
    | ;
    | return 0;
    | }
    configure:4592: error: in `/home/sensei/Downloads/Builds/wine-mono/src/wine-mono-0.0.4/build-cross-x86_64':
    configure:4594: error: C compiler cannot create executables
    See `config.log' for more details
    ## Cache variables. ##
    ac_cv_build=x86_64-unknown-linux-gnu
    ac_cv_env_CCASFLAGS_set=
    ac_cv_env_CCASFLAGS_value=
    ac_cv_env_CCAS_set=
    ac_cv_env_CCAS_value=
    ac_cv_env_CCC_set=
    ac_cv_env_CCC_value=
    ac_cv_env_CC_set=
    ac_cv_env_CC_value=
    ac_cv_env_CFLAGS_set=set
    ac_cv_env_CFLAGS_value='-march=x86-64 -mtune=generic -O2 -pipe -fstack-protector --param=ssp-buffer-size=4 -D_FORTIFY_SOURCE=2'
    ac_cv_env_CPPFLAGS_set=
    ac_cv_env_CPPFLAGS_value=
    ac_cv_env_CPP_set=
    ac_cv_env_CPP_value=
    ac_cv_env_CXXCPP_set=
    ac_cv_env_CXXCPP_value=
    ac_cv_env_CXXFLAGS_set=set
    ac_cv_env_CXXFLAGS_value='-march=x86-64 -mtune=generic -O2 -pipe -fstack-protector --param=ssp-buffer-size=4 -D_FORTIFY_SOURCE=2'
    ac_cv_env_CXX_set=
    ac_cv_env_CXX_value=
    ac_cv_env_LDFLAGS_set=set
    ac_cv_env_LDFLAGS_value=-Wl,-O1,--sort-common,--as-needed,-z,relro,--hash-style=gnu
    ac_cv_env_LIBS_set=
    ac_cv_env_LIBS_value=
    ac_cv_env_XMKMF_set=
    ac_cv_env_XMKMF_value=
    ac_cv_env_build_alias_set=set
    ac_cv_env_build_alias_value=x86_64-unknown-linux-gnu
    ac_cv_env_host_alias_set=set
    ac_cv_env_host_alias_value=x86_64-w64-mingw32
    ac_cv_env_target_alias_set=set
    ac_cv_env_target_alias_value=x86_64-w64-mingw32
    ac_cv_host=x86_64-w64-mingw32
    ac_cv_path_install='/usr/bin/install -c'
    ac_cv_path_mkdir=/bin/mkdir
    ac_cv_prog_AWK=gawk
    ac_cv_prog_CC=gcc
    ac_cv_prog_ac_ct_CC=gcc
    ac_cv_prog_ac_ct_STRIP=strip
    ac_cv_prog_make_make_set=yes
    ac_cv_target=x86_64-w64-mingw32
    am_cv_prog_tar_ustar=gnutar
    mono_cv_clang=no
    ## Output variables. ##
    ACLOCAL='${SHELL} /home/sensei/Downloads/Builds/wine-mono/src/wine-mono-0.0.4/mono/missing --run aclocal-1.12'
    ALPHA_FALSE=''
    ALPHA_TRUE=''
    AMD64_FALSE=''
    AMD64_TRUE=''
    AMDEPBACKSLASH=''
    AMDEP_FALSE=''
    AMDEP_TRUE=''
    AMTAR='$${TAR-tar}'
    API_VER='2.0'
    AR=''
    ARM_FALSE=''
    ARM_TRUE=''
    AS=''
    AUTOCONF='${SHELL} /home/sensei/Downloads/Builds/wine-mono/src/wine-mono-0.0.4/mono/missing --run autoconf'
    AUTOHEADER='${SHELL} /home/sensei/Downloads/Builds/wine-mono/src/wine-mono-0.0.4/mono/missing --run autoheader'
    AUTOMAKE='${SHELL} /home/sensei/Downloads/Builds/wine-mono/src/wine-mono-0.0.4/mono/missing --run automake-1.12'
    AWK='gawk'
    BOEHM_DEFINES=''
    BUILD_EXEEXT=''
    BUILD_GLIB_CFLAGS=''
    BUILD_GLIB_LIBS=''
    BUILD_MCS_FALSE=''
    BUILD_MCS_TRUE=''
    CC='gcc'
    CCAS=''
    CCASDEPMODE=''
    CCASFLAGS=''
    CCDEPMODE=''
    CC_FOR_BUILD=''
    CFLAGS='-march=x86-64 -mtune=generic -O2 -pipe -fstack-protector --param=ssp-buffer-size=4 -D_FORTIFY_SOURCE=2'
    CFLAGS_FOR_BUILD=''
    CPP=''
    CPPFLAGS=' -DWINVER=0x0500 -D_WIN32_WINNT=0x0500 -D_WIN32_IE=0x0501 -D_UNICODE -DUNICODE -DWIN32_THREADS -DFD_SETSIZE=1024 -DGC_NOT_DLL'
    CROSS_COMPILING_FALSE=''
    CROSS_COMPILING_TRUE=''
    CXX=''
    CXXCPP=''
    CXXDEPMODE=''
    CXXFLAGS='-march=x86-64 -mtune=generic -O2 -pipe -fstack-protector --param=ssp-buffer-size=4 -D_FORTIFY_SOURCE=2'
    CYGPATH_W='echo'
    DEFS=''
    DEPDIR=''
    DISABLE_EXECUTABLES_FALSE=''
    DISABLE_EXECUTABLES_TRUE=''
    DISABLE_JIT_FALSE=''
    DISABLE_JIT_TRUE=''
    DISABLE_PROFILER_FALSE=''
    DISABLE_PROFILER_TRUE=''
    DISABLE_SHARED_HANDLES=''
    DLLTOOL=''
    DOLT_BASH=''
    DSYMUTIL=''
    DTRACE=''
    DTRACEFLAGS=''
    DTRACE_G_REQUIRED_FALSE=''
    DTRACE_G_REQUIRED_TRUE=''
    DUMPBIN=''
    ECHO_C=''
    ECHO_N='-n'
    ECHO_T=''
    EGREP=''
    ENABLE_DTRACE_FALSE=''
    ENABLE_DTRACE_TRUE=''
    ENABLE_LLVM_FALSE=''
    ENABLE_LLVM_TRUE=''
    ENABLE_NUNIT_TESTS_FALSE=''
    ENABLE_NUNIT_TESTS_TRUE=''
    EXEEXT=''
    FGREP=''
    GETTEXT_MACRO_VERSION=''
    GLIB_CFLAGS=''
    GLIB_LIBS=''
    GMODULE_CFLAGS=''
    GMODULE_LIBS=''
    GMSGFMT=''
    GMSGFMT_015=''
    GREP=''
    HAVE_MSGFMT=''
    HAVE_OPROFILE_FALSE=''
    HAVE_OPROFILE_TRUE=''
    HAVE_ZLIB_FALSE=''
    HAVE_ZLIB_TRUE=''
    HOST_CC='gcc'
    HOST_WIN32_FALSE='#'
    HOST_WIN32_TRUE=''
    HPPA_FALSE=''
    HPPA_TRUE=''
    IA64_FALSE=''
    IA64_TRUE=''
    INCLUDED_LIBGC_FALSE=''
    INCLUDED_LIBGC_TRUE=''
    INSTALL_4_0_FALSE=''
    INSTALL_4_0_TRUE=''
    INSTALL_DATA='${INSTALL} -m 644'
    INSTALL_MOBILE_FALSE=''
    INSTALL_MOBILE_TRUE=''
    INSTALL_MONODROID_FALSE=''
    INSTALL_MONODROID_TRUE=''
    INSTALL_MONOTOUCH_FALSE=''
    INSTALL_MONOTOUCH_TRUE=''
    INSTALL_PROGRAM='${INSTALL}'
    INSTALL_SCRIPT='${INSTALL}'
    INSTALL_STRIP_PROGRAM='$(install_sh) -c -s'
    INTERP_SUPPORTED_FALSE=''
    INTERP_SUPPORTED_TRUE=''
    INTL=''
    JIT_SUPPORTED_FALSE=''
    JIT_SUPPORTED_TRUE=''
    LD=''
    LDFLAGS='-Wl,-O1,--sort-common,--as-needed,-z,relro,--hash-style=gnu -lmswsock -lws2_32 -lole32 -loleaut32 -lpsapi -lversion -ladvapi32 -lwinmm -lkernel32'
    LIBC=''
    LIBGC_CPPFLAGS=''
    LIBGC_LIBS=''
    LIBGC_STATIC_LIBS=''
    LIBICONV=''
    LIBMONO_LA=''
    LIBOBJS=''
    LIBS=''
    LIBTOOL=''
    LIPO=''
    LLVM_CFLAGS=''
    LLVM_CONFIG=''
    LLVM_CXXFLAGS=''
    LLVM_LDFLAGS=''
    LLVM_LIBS=''
    LN_S='cp'
    LOADED_LLVM_FALSE=''
    LOADED_LLVM_TRUE=''
    LTCOMPILE=''
    LTCXXCOMPILE=''
    LTLIBICONV=''
    LTLIBOBJS=''
    M68K_FALSE=''
    M68K_TRUE=''
    MAINT='#'
    MAINTAINER_MODE_FALSE=''
    MAINTAINER_MODE_TRUE='#'
    MAKEINFO='${SHELL} /home/sensei/Downloads/Builds/wine-mono/src/wine-mono-0.0.4/mono/missing --run makeinfo'
    MANIFEST_TOOL=''
    MIPS_FALSE=''
    MIPS_GCC_FALSE=''
    MIPS_GCC_TRUE=''
    MIPS_SGI_FALSE=''
    MIPS_SGI_TRUE=''
    MIPS_TRUE=''
    MKDIR_P='/bin/mkdir -p'
    MONO_DEBUGGER_SUPPORTED_FALSE=''
    MONO_DEBUGGER_SUPPORTED_TRUE=''
    MONO_DL_NEED_USCORE=''
    MONO_NACL_ALIGN_MASK_OFF=''
    MOONLIGHT_BOEHM_FALSE=''
    MOONLIGHT_BOEHM_TRUE=''
    MOONLIGHT_DEFINES=''
    MOONLIGHT_FALSE=''
    MOONLIGHT_SGEN_FALSE=''
    MOONLIGHT_SGEN_TRUE=''
    MOONLIGHT_TRUE=''
    MSGFMT=''
    MSGFMT_015=''
    MSGMERGE=''
    NACL_CODEGEN_FALSE=''
    NACL_CODEGEN_TRUE=''
    NM=''
    NMEDIT=''
    NO_VERSION_SCRIPT_FALSE=''
    NO_VERSION_SCRIPT_TRUE=''
    OBJDUMP=''
    OBJEXT=''
    ONLY_MOONLIGHT_FALSE=''
    ONLY_MOONLIGHT_TRUE=''
    OPROFILE_CFLAGS=''
    OPROFILE_LIBS=''
    OTOOL64=''
    OTOOL=''
    PACKAGE='mono'
    PACKAGE_BUGREPORT='http://bugzilla.xamarin.com/enter_bug.cgi?classification=Mono'
    PACKAGE_NAME='mono'
    PACKAGE_STRING='mono 2.11.1'
    PACKAGE_TARNAME='mono'
    PACKAGE_URL=''
    PACKAGE_VERSION='2.11.1'
    PATH_SEPARATOR=':'
    PKG_CONFIG='false'
    PLATFORM_ANDROID_FALSE=''
    PLATFORM_ANDROID_TRUE='#'
    PLATFORM_DARWIN_FALSE=''
    PLATFORM_DARWIN_TRUE='#'
    PLATFORM_LINUX_FALSE=''
    PLATFORM_LINUX_TRUE='#'
    PLATFORM_SIGPOSIX_FALSE=''
    PLATFORM_SIGPOSIX_TRUE='#'
    POWERPC64_FALSE=''
    POWERPC64_TRUE=''
    POWERPC_FALSE=''
    POWERPC_TRUE=''
    RANLIB=''
    S390_FALSE=''
    S390_TRUE=''
    S390x_FALSE=''
    S390x_TRUE=''
    SED=''
    SET_MAKE=''
    SGEN_DEFINES=''
    SHARED_MONO_FALSE=''
    SHARED_MONO_TRUE=''
    SHELL='/bin/sh'
    SPARC64_FALSE=''
    SPARC64_TRUE=''
    SPARC_FALSE=''
    SPARC_TRUE=''
    SQLITE3=''
    SQLITE=''
    STATIC_MONO_FALSE=''
    STATIC_MONO_TRUE=''
    STRIP='strip'
    SUPPORT_BOEHM_FALSE=''
    SUPPORT_BOEHM_TRUE=''
    SUPPORT_SGEN_FALSE=''
    SUPPORT_SGEN_TRUE=''
    TARGET_WIN32_FALSE='#'
    TARGET_WIN32_TRUE=''
    USE_BATCH_FILES_FALSE=''
    USE_BATCH_FILES_TRUE=''
    USE_JIT_FALSE=''
    USE_JIT_TRUE=''
    USE_NLS=''
    VERSION='2.11.1'
    X11=''
    X86_FALSE=''
    X86_TRUE=''
    XATTR_LIB=''
    XGETTEXT=''
    XGETTEXT_015=''
    XGETTEXT_EXTRA_OPTIONS=''
    XMKMF=''
    ac_ct_AR=''
    ac_ct_CC='gcc'
    ac_ct_CXX=''
    ac_ct_DUMPBIN=''
    am__EXEEXT_FALSE=''
    am__EXEEXT_TRUE=''
    am__fastdepCCAS_FALSE=''
    am__fastdepCCAS_TRUE=''
    am__fastdepCC_FALSE=''
    am__fastdepCC_TRUE=''
    am__fastdepCXX_FALSE=''
    am__fastdepCXX_TRUE=''
    am__include=''
    am__isrc=' -I$(srcdir)'
    am__leading_dot='.'
    am__nodep=''
    am__quote=''
    am__tar='tar --format=ustar -chf - "$$tardir"'
    am__untar='tar -xf -'
    arch_target=''
    bindir='${exec_prefix}/bin'
    build='x86_64-unknown-linux-gnu'
    build_alias='x86_64-unknown-linux-gnu'
    build_cpu='x86_64'
    build_os='linux-gnu'
    build_vendor='unknown'
    datadir='${datarootdir}'
    datarootdir='${prefix}/share'
    docdir='${datarootdir}/doc/${PACKAGE_TARNAME}'
    docs_dir=''
    dvidir='${docdir}'
    exec_prefix='NONE'
    export_ldflags=''
    host='x86_64-w64-mingw32'
    host_alias='x86_64-w64-mingw32'
    host_cpu='x86_64'
    host_os='mingw32'
    host_vendor='w64'
    htmldir='${docdir}'
    ikvm_native_dir=''
    includedir='${prefix}/include'
    infodir='${datarootdir}/info'
    install_sh='${SHELL} /home/sensei/Downloads/Builds/wine-mono/src/wine-mono-0.0.4/mono/install-sh'
    libdir='${exec_prefix}/lib'
    libexecdir='${exec_prefix}/libexec'
    libgc_dir=''
    libgdiplus_loc=''
    libmono_cflags='-mno-cygwin -mms-bitfields -mwindows'
    libmono_ldflags='-mno-cygwin -mms-bitfields -mwindows'
    libsuffix=''
    localedir='${datarootdir}/locale'
    localstatedir='${prefix}/var'
    mandir='${datarootdir}/man'
    mcs_topdir=''
    mcs_topdir_from_srcdir=''
    mkdir_p=''
    mono_build_root=''
    mono_cfg_dir=''
    mono_runtime=''
    oldincludedir='/usr/include'
    pdfdir='${docdir}'
    prefix='/home/sensei/Downloads/Builds/wine-mono/src/wine-mono-0.0.4/build-cross-x86_64-install'
    program_transform_name='s&^&x86_64-w64-mingw32-&'
    psdir='${docdir}'
    reloc_libdir='lib'
    sbindir='${exec_prefix}/sbin'
    sharedstatedir='${prefix}/com'
    subdirs=''
    sysconfdir='${prefix}/etc'
    target='x86_64-w64-mingw32'
    target_alias='x86_64-w64-mingw32'
    target_cpu='x86_64'
    target_os='mingw32'
    target_vendor='w64'
    ## confdefs.h. ##
    /* confdefs.h */
    #define PACKAGE_NAME "mono"
    #define PACKAGE_TARNAME "mono"
    #define PACKAGE_VERSION "2.11.1"
    #define PACKAGE_STRING "mono 2.11.1"
    #define PACKAGE_BUGREPORT "http://bugzilla.xamarin.com/enter_bug.cgi?classification=Mono"
    #define PACKAGE_URL ""
    #define PACKAGE "mono"
    #define VERSION "2.11.1"
    #define HOST_WIN32 1
    #define DISABLE_PORTABILITY 1
    #define PLATFORM_NO_SYMLINKS 1
    #define TARGET_WIN32 1
    #define MINGW_CROSS_COMPILE 1
    configure: exit 77
    My makepkg.conf:
    # /etc/makepkg.conf
    # SOURCE ACQUISITION
    #-- The download utilities that makepkg should use to acquire sources
    # Format: 'protocol::agent'
    #DLAGENTS=('ftp::/usr/bin/wget -4 -c --passive-ftp -t 3 --waitretry=3 -O %o %u'
    # 'http::/usr/bin/wget -c -t 3 --waitretry=3 -O %o %u'
    # 'https::/usr/bin/wget -c -t 3 --waitretry=3 --no-check-certificate -O %o %u'
    #Curl as default DLAGENT
    DLAGENTS=('ftp::/usr/bin/curl -fC - --ftp-pasv --retry 3 --retry-delay 3 -o %o %u'
    'http::/usr/bin/curl -fLC - --retry 3 --retry-delay 3 -o %o %u'
    'https::/usr/bin/curl -fLC - --retry 3 --retry-delay 3 -o %o %u'
    'rsync::/usr/bin/rsync -z %u %o'
    'scp::/usr/bin/scp -C %u %o')
    # Other common tools:
    # /usr/bin/snarf
    # /usr/bin/lftpget -c
    # /usr/bin/curl
    # ARCHITECTURE, COMPILE FLAGS
    CARCH="x86_64"
    CHOST="x86_64-unknown-linux-gnu"
    #-- Exclusive: will only run on x86_64
    # -march (or -mcpu) builds exclusively for an architecture
    # -mtune optimizes for an architecture, but builds for whole processor family
    CFLAGS="-march=x86-64 -mtune=generic -O2 -pipe -fstack-protector --param=ssp-buffer-size=4 -D_FORTIFY_SOURCE=2"
    CXXFLAGS="-march=x86-64 -mtune=generic -O2 -pipe -fstack-protector --param=ssp-buffer-size=4 -D_FORTIFY_SOURCE=2"
    LDFLAGS="-Wl,-O1,--sort-common,--as-needed,-z,relro,--hash-style=gnu"
    #-- Make Flags: change this for DistCC/SMP systems
    #MAKEFLAGS="-j2"
    I am running a x64 arch with multilib and multilib-testing enabled. This is the first time I have encountered this error. Thank you in advance for all advice and suggestions.
    Edited: added makepkg.conf
    Last edited by mynameisneo (2012-06-13 19:04:09)

    In your config.log:
    /usr/bin/ld: cannot find -lmswsock
    /usr/bin/ld: cannot find -lws2_32
    /usr/bin/ld: cannot find -lole32
    /usr/bin/ld: cannot find -loleaut32
    /usr/bin/ld: cannot find -lpsapi
    /usr/bin/ld: cannot find -lversion
    /usr/bin/ld: cannot find -ladvapi32
    /usr/bin/ld: cannot find -lwinmm
    /usr/bin/ld: cannot find -lkernel32
    Try find these files which package provides!
    Edit: maybe package 'wine' provides this but as I see these libs are in /usr/lib/wine.
    Last edited by uzsolt (2012-06-13 18:07:08)

  • [SOLVED]C compiler cannot create executables DUE TO MISSING DEV. PACKS

    Hi there, I was trying to build "lib32-libpcap" from AUR using yaourt when the gcc(?) reported an error as following:
    ==> Starting build()...
    checking build system type... x86_64-unknown-linux-gnu
    checking host system type... x86_64-unknown-linux-gnu
    checking target system type... x86_64-unknown-linux-gnu
    checking for gcc... gcc -m32
    checking for C compiler default output file name...
    configure: error: C compiler cannot create executables
    See `config.log' for more details.
    ==> ERROR: A failure occurred in build().
    Aborting...
    The content of the "config.log" file:
    This file contains any messages produced by compilers while
    running configure, to aid debugging if configure makes a mistake.
    It was created by configure, which was
    generated by GNU Autoconf 2.61. Invocation command line was
    $ ./configure --prefix=/usr --libdir=/usr/lib32 --enable-ipv6
    ## Platform. ##
    hostname = mzws
    uname -m = x86_64
    uname -r = 3.2.8-1-ARCH
    uname -s = Linux
    uname -v = #1 SMP PREEMPT Mon Feb 27 21:51:46 CET 2012
    /usr/bin/uname -p = unknown
    /bin/uname -X = unknown
    /bin/arch = x86_64
    /usr/bin/arch -k = unknown
    /usr/convex/getsysinfo = unknown
    /usr/bin/hostinfo = unknown
    /bin/machine = unknown
    /usr/bin/oslevel = unknown
    /bin/universe = unknown
    PATH: /usr/local/bin
    PATH: /usr/bin
    PATH: /bin
    PATH: /usr/local/sbin
    PATH: /usr/sbin
    PATH: /sbin
    PATH: /usr/bin/core_perl
    ## Core tests. ##
    configure:1794: checking build system type
    configure:1812: result: x86_64-unknown-linux-gnu
    configure:1834: checking host system type
    configure:1849: result: x86_64-unknown-linux-gnu
    configure:1871: checking target system type
    configure:1886: result: x86_64-unknown-linux-gnu
    configure:2036: checking for gcc
    configure:2063: result: gcc -m32
    configure:2301: checking for C compiler version
    configure:2308: gcc -m32 --version >&5
    gcc (GCC) 4.6.2 20120120 (prerelease)
    Copyright (C) 2011 Free Software Foundation, Inc.
    This is free software; see the source for copying conditions. There is NO
    warranty; not even for MERCHANTABILITY or FITNESS FOR A PARTICULAR PURPOSE.
    configure:2311: $? = 0
    configure:2318: gcc -m32 -v >&5
    Using built-in specs.
    COLLECT_GCC=gcc
    COLLECT_LTO_WRAPPER=/usr/lib/gcc/x86_64-unknown-linux-gnu/4.6.2/lto-wrapper
    Target: x86_64-unknown-linux-gnu
    Configured with: /build/src/gcc-4.6-20120120/configure --prefix=/usr --libdir=/usr/lib --libexecdir=/usr/lib --mandir=/usr/share/man --infodir=/usr/share/info --with-bugurl=https://bugs.archlinux.org/ --enable-languages=c,c++,ada,fortran,go,lto,objc,obj-c++ --enable-shared --enable-threads=posix --with-system-zlib --enable-__cxa_atexit --disable-libunwind-exceptions --enable-clocale=gnu --disable-libstdcxx-pch --enable-libstdcxx-time --enable-gnu-unique-object --enable-linker-build-id --with-ppl --enable-cloog-backend=isl --enable-lto --enable-gold --enable-ld=default --enable-plugin --with-plugin-ld=ld.gold --disable-multilib --disable-libssp --enable-checking=release
    Thread model: posix
    gcc version 4.6.2 20120120 (prerelease) (GCC)
    configure:2321: $? = 0
    configure:2328: gcc -m32 -V >&5
    gcc: error: unrecognized option '-V'
    gcc: fatal error: no input files
    compilation terminated.
    configure:2331: $? = 1
    configure:2354: checking for C compiler default output file name
    configure:2381: gcc -m32 -march=x86-64 -mtune=generic -O2 -pipe -fstack-protector --param=ssp-buffer-size=4 -D_FORTIFY_SOURCE=2 -Wl,-O1,--sort-common,--as-needed,-z,relro,--hash-style=gnu conftest.c >&5
    /usr/bin/ld: skipping incompatible /usr/lib/gcc/x86_64-unknown-linux-gnu/4.6.2/libgcc.a when searching for -lgcc
    /usr/bin/ld: cannot find -lgcc
    /usr/bin/ld: skipping incompatible /usr/lib/gcc/x86_64-unknown-linux-gnu/4.6.2/../../../libgcc_s.so when searching for -lgcc_s
    /usr/bin/ld: skipping incompatible /usr/lib/libgcc_s.so when searching for -lgcc_s
    /usr/bin/ld: cannot find -lgcc_s
    collect2: ld returned 1 exit status
    configure:2384: $? = 1
    configure:2422: result:
    configure: failed program was:
    | /* confdefs.h. */
    | #define PACKAGE_NAME ""
    | #define PACKAGE_TARNAME ""
    | #define PACKAGE_VERSION ""
    | #define PACKAGE_STRING ""
    | #define PACKAGE_BUGREPORT ""
    | /* end confdefs.h. */
    |
    | int
    | main ()
    | {
    |
    | ;
    | return 0;
    | }
    configure:2429: error: C compiler cannot create executables
    See `config.log' for more details.
    ## Cache variables. ##
    ac_cv_build=x86_64-unknown-linux-gnu
    ac_cv_env_CC_set=set
    ac_cv_env_CC_value='gcc -m32'
    ac_cv_env_CFLAGS_set=set
    ac_cv_env_CFLAGS_value='-march=x86-64 -mtune=generic -O2 -pipe -fstack-protector --param=ssp-buffer-size=4 -D_FORTIFY_SOURCE=2'
    ac_cv_env_CPPFLAGS_set=
    ac_cv_env_CPPFLAGS_value=
    ac_cv_env_CPP_set=
    ac_cv_env_CPP_value=
    ac_cv_env_LDFLAGS_set=set
    ac_cv_env_LDFLAGS_value=-Wl,-O1,--sort-common,--as-needed,-z,relro,--hash-style=gnu
    ac_cv_env_LIBS_set=
    ac_cv_env_LIBS_value=
    ac_cv_env_build_alias_set=
    ac_cv_env_build_alias_value=
    ac_cv_env_host_alias_set=
    ac_cv_env_host_alias_value=
    ac_cv_env_target_alias_set=
    ac_cv_env_target_alias_value=
    ac_cv_host=x86_64-unknown-linux-gnu
    ac_cv_prog_ac_ct_CC='gcc -m32'
    ac_cv_target=x86_64-unknown-linux-gnu
    ## Output variables. ##
    ADDLARCHIVEOBJS=''
    ADDLOBJS=''
    BT_SRC=''
    CAN_SRC=''
    CC='gcc -m32'
    CFLAGS='-march=x86-64 -mtune=generic -O2 -pipe -fstack-protector --param=ssp-buffer-size=4 -D_FORTIFY_SOURCE=2'
    CPP=''
    CPPFLAGS=''
    DEFS=''
    DYEXT=''
    ECHO_C=''
    ECHO_N='-n'
    ECHO_T=''
    EGREP=''
    EXEEXT=''
    GREP=''
    HAVE_LINUX_TPACKET_AUXDATA=''
    INSTALL_DATA=''
    INSTALL_PROGRAM=''
    INSTALL_SCRIPT=''
    LDFLAGS='-Wl,-O1,--sort-common,--as-needed,-z,relro,--hash-style=gnu'
    LIBOBJS=''
    LIBS=''
    LTLIBOBJS=''
    MAN_FILE_FORMATS=''
    MAN_MISC_INFO=''
    OBJEXT=''
    PACKAGE_BUGREPORT=''
    PACKAGE_NAME=''
    PACKAGE_STRING=''
    PACKAGE_TARNAME=''
    PACKAGE_VERSION=''
    PATH_SEPARATOR=':'
    PCAP_SUPPORT_BT=''
    PCAP_SUPPORT_CAN=''
    PCAP_SUPPORT_USB=''
    RANLIB=''
    SHELL='/bin/sh'
    SHLICC2=''
    SSRC=''
    USB_SRC=''
    V_CCOPT='-O'
    V_DEFS=''
    V_FINDALLDEVS=''
    V_INCLS=''
    V_LEX=''
    V_PCAP=''
    V_RPATH_OPT=''
    V_SHLIB_CMD=''
    V_SHLIB_OPT=''
    V_SONAME_OPT=''
    V_YACC=''
    ac_ct_CC='gcc -m32'
    bindir='${exec_prefix}/bin'
    build='x86_64-unknown-linux-gnu'
    build_alias=''
    build_cpu='x86_64'
    build_os='linux-gnu'
    build_vendor='unknown'
    datadir='${datarootdir}'
    datarootdir='${prefix}/share'
    docdir='${datarootdir}/doc/${PACKAGE}'
    dvidir='${docdir}'
    exec_prefix='NONE'
    host='x86_64-unknown-linux-gnu'
    host_alias=''
    host_cpu='x86_64'
    host_os='linux-gnu'
    host_vendor='unknown'
    htmldir='${docdir}'
    includedir='${prefix}/include'
    infodir='${datarootdir}/info'
    libdir='/usr/lib32'
    libexecdir='${exec_prefix}/libexec'
    localedir='${datarootdir}/locale'
    localstatedir='${prefix}/var'
    mandir='${datarootdir}/man'
    oldincludedir='/usr/include'
    pdfdir='${docdir}'
    prefix='/usr'
    program_transform_name='s,x,x,'
    psdir='${docdir}'
    sbindir='${exec_prefix}/sbin'
    sharedstatedir='${prefix}/com'
    sysconfdir='${prefix}/etc'
    target='x86_64-unknown-linux-gnu'
    target_alias=''
    target_cpu='x86_64'
    target_os='linux-gnu'
    target_vendor='unknown'
    ## confdefs.h. ##
    #define PACKAGE_NAME ""
    #define PACKAGE_TARNAME ""
    #define PACKAGE_VERSION ""
    #define PACKAGE_STRING ""
    #define PACKAGE_BUGREPORT ""
    configure: exit 77
    and the makepkg.conf:
    # /etc/makepkg.conf
    # SOURCE ACQUISITION
    #-- The download utilities that makepkg should use to acquire sources
    # Format: 'protocol::agent'
    DLAGENTS=('ftp::/usr/bin/curl -fC - --ftp-pasv --retry 3 --retry-delay 3 -o %o %u'
    'http::/usr/bin/curl -fLC - --retry 3 --retry-delay 3 -o %o %u'
    'https::/usr/bin/curl -fLC - --retry 3 --retry-delay 3 -o %o %u'
    'rsync::/usr/bin/rsync -z %u %o'
    'scp::/usr/bin/scp -C %u %o')
    # Other common tools:
    # /usr/bin/snarf
    # /usr/bin/lftpget -c
    # /usr/bin/wget
    # ARCHITECTURE, COMPILE FLAGS
    CARCH="x86_64"
    CHOST="x86_64-unknown-linux-gnu"
    #-- Compiler and Linker Flags
    # -march (or -mcpu) builds exclusively for an architecture
    # -mtune optimizes for an architecture, but builds for whole processor family
    CFLAGS="-march=x86-64 -mtune=generic -O2 -pipe -fstack-protector --param=ssp-buffer-size=4 -D_FORTIFY_SOURCE=2"
    CXXFLAGS="-march=x86-64 -mtune=generic -O2 -pipe -fstack-protector --param=ssp-buffer-size=4 -D_FORTIFY_SOURCE=2"
    LDFLAGS="-Wl,-O1,--sort-common,--as-needed,-z,relro,--hash-style=gnu"
    #-- Make Flags: change this for DistCC/SMP systems
    #MAKEFLAGS="-j2"
    # BUILD ENVIRONMENT
    # Defaults: BUILDENV=(fakeroot !distcc color !ccache check !sign)
    # A negated environment option will do the opposite of the comments below.
    #-- fakeroot: Allow building packages as a non-root user
    #-- distcc: Use the Distributed C/C++/ObjC compiler
    #-- color: Colorize output messages
    #-- ccache: Use ccache to cache compilation
    #-- check: Run the check() function if present in the PKGBUILD
    #-- sign: Generate PGP signature file
    BUILDENV=(fakeroot !distcc color !ccache check !sign)
    #-- If using DistCC, your MAKEFLAGS will also need modification. In addition,
    #-- specify a space-delimited list of hosts running in the DistCC cluster.
    #DISTCC_HOSTS=""
    #-- Specify a directory for package building.
    #BUILDDIR=/tmp/makepkg
    # GLOBAL PACKAGE OPTIONS
    # These are default values for the options=() settings
    # Default: OPTIONS=(strip docs libtool emptydirs zipman purge !upx)
    # A negated option will do the opposite of the comments below.
    #-- strip: Strip symbols from binaries/libraries
    #-- docs: Save doc directories specified by DOC_DIRS
    #-- libtool: Leave libtool (.la) files in packages
    #-- emptydirs: Leave empty directories in packages
    #-- zipman: Compress manual (man and info) pages in MAN_DIRS with gzip
    #-- purge: Remove files specified by PURGE_TARGETS
    #-- upx: Compress binary executable files using UPX
    OPTIONS=(strip docs libtool emptydirs zipman purge !upx)
    #-- File integrity checks to use. Valid: md5, sha1, sha256, sha384, sha512
    INTEGRITY_CHECK=(md5)
    #-- Options to be used when stripping binaries. See `man strip' for details.
    STRIP_BINARIES="--strip-all"
    #-- Options to be used when stripping shared libraries. See `man strip' for details.
    STRIP_SHARED="--strip-unneeded"
    #-- Options to be used when stripping static libraries. See `man strip' for details.
    STRIP_STATIC="--strip-debug"
    #-- Manual (man and info) directories to compress (if zipman is specified)
    MAN_DIRS=({usr{,/local}{,/share},opt/*}/{man,info})
    #-- Doc directories to remove (if !docs is specified)
    DOC_DIRS=(usr/{,local/}{,share/}{doc,gtk-doc} opt/*/{doc,gtk-doc})
    #-- Files to be removed from all packages (if purge is specified)
    PURGE_TARGETS=(usr/{,share}/info/dir .packlist *.pod)
    # PACKAGE OUTPUT
    # Default: put built package and cached source in build directory
    #-- Destination: specify a fixed directory where all packages will be placed
    #PKGDEST=/home/packages
    #-- Source cache: specify a fixed directory where source files will be cached
    #SRCDEST=/home/sources
    #-- Source packages: specify a fixed directory where all src packages will be placed
    #SRCPKGDEST=/home/srcpackages
    #-- Packager: name/email of the person or organization building packages
    #PACKAGER="John Doe <[email protected]>"
    #-- Specify a key to use for package signing
    #GPGKEY=""
    # EXTENSION DEFAULTS
    # WARNING: Do NOT modify these variables unless you know what you are
    # doing.
    PKGEXT='.pkg.tar.xz'
    SRCEXT='.src.tar.gz'
    # vim: set ft=sh ts=2 sw=2 et:
    Am running a up-to-date x64 Arch with [multilib] enabled; perhaps it's a silly mistake I made somewhere but I'm no dev and so cannot figure out what went wrong in the config.log....please help with your kindness and thanks in advance!
    Last edited by karbon (2012-03-10 04:28:58)

    Thanks for your replies:)
    Allan wrote:Are you really up-to-date?   gcc-4.6.3 was put in [core] four days ago but you still seem to have 4.6.2.
    Well...at least as up-to-date as on March 2nd(when I did last system-wide upgrade); trying to update system tonight to see whether this works.
    stronnag wrote:If you have multilib and testing enabled, you also need  multilib-testing, otherwise (as I know from bitter experience), you get these hard to track down errors.
    Nope I didn't enable [testing]; I've discovered some packages in [multilib], namely gcc-multilib or something similar(with the -multilib subfix) and some of these packages belong to the group "multilib-devel". Is installing these packages a must for compiling 32-bit packages?

Maybe you are looking for