Object failed to run due to an error while processing on the Job Server

when i am scheduling a report ith email notification i am getting  below error
error msg: Object failed to run due to an error while processing on the Job Server
i have configured email notification in bo cmc and server also SMTP enabled. while scheduling report to ueser i am getting error and even mails are delivered to users as well.

hi prithvi,
i am able to schedule reports to other destinations and reports are delivered as per the requirement.
i am able to telnet SMTP server from Adaptive job server machine on SMTP port.
have to check errors on log file....
@ COULD YOU  PLEASE LET ME KNOW USER CAN SEND A MAIL TO USER  IN SAME DOMAIN . WHILE SCHEDULING A REPORT AND AS OPTION AVAILABLE  IN 4.0 LAUNCH PAD CAN HE SEND A MAIL DIRECTLY  AFTER RUNNING REPORT.

Similar Messages

  • Object failed to run due to insufficient security privileges

    Recently migrated from BO XI and Crystal XI to bo 4.1sp2 and Crystal 2013.The recurring crystal reports were migared to new environemnt and schulded to run 1st of the month.There are 300+ reports.The report detail says all these reports are schduled by Adminisatrtor because It was migrated by administartor account.
    First of the month all reports failed and error is 'object failed to run due to insufficient security privileges.
    And In the event viewer, there were warning from source BusinessObject_cms
    "The security for the object identified by 41173 could not be verified during schedule attempt."
    Can someone help me to find out the root cause of this issue.thanks.

    Hello,
    There are many possible root causes.
    First check that the migration was complete successfully using the Import Wizard or UMT.
    Otherwise, this may occur if the owner was not migrated properly or if the universe contains some row level security..
    I hope this helps.
    Thanks & Regards,
    Insaf

  • SCOM 2012 SP1 - PowerShell Script failed to run - 3 alerts appear after every reboot of the SCOM Server

    Brand new SCOM 2012 SP1 install with Update Rollup 1 applied
    Single server, local SQL install, SQL Server 2012 SP1
    Hyper-V VM running on Server 2012.  VM has 8GB Ram, single vCPU
    Going through initial management pack importing and configuration, at this point I have the Windows Server 2012 and SQL 2012 MP's installed.
    See screenshot
    http://i.imgur.com/l0Molh1.png
    I am getting the following alerts in my SCOM console and cannot find a resolution to fix the issue.  I don't want to set an override, as an override will prevent the PowerShell alert in other instances, where I might want to receive an alert.
    Looking at the alert description, it states "The Data Access service is either not running or not yet initialized"
    The SCOM Console launches and responds fine, and I get no other errors.  I check the Data Access service and it is online.  I have left the system alone for a couple of hours and no other errors.  I then closed those alerts and restarted the
    server, and they came right back in, so I know that this is something that is happening at either server startup of during the start of the SCOM services.
    Is it possible that SCOM is trying to execute these scripts and the Data Access service has not come online yet?
    Has anyone else come across this before?

    Please try the method in the following thread:
    Note: As there is operations related to Registry, please perform a backup before doing this.
    OpsMgr 2012 - Power Shell Script failed to run 
    http://social.technet.microsoft.com/Forums/de-DE/systemcenterde/thread/4be37f8d-1e7b-450c-8cb9-f1e95f3b2bd0/
    Thanks.
    Nicholas Li
    TechNet Community Support

  • Error While Importing into The Target Server

    Imported the export dump into the Target server.
    while running the import I am getting the following errors in the Transport set Import log file.
    13-JUL-05 15:00:11][ERROR] id = NULL context = style_pre_check user = ORCLADMIN The Unique Identifier of the source style KNPC_PORTAL does not match the target style KNPC_PORTAL
    Precheck failed for the whole KNPC_Page group and HRMs page group.
    Precheck failed for LOV REPORTS_COMPONENT_LOV
    Precheck failed for RWSVR EISDB_REPORT_SERVER
    Precheck failed for DYNAMIC DYN_0418073018
    Precheck failed for DATAPTL COMPONENT1
    Precheck failed for DATAPTL DATA_0418075629
    Precheck failed for AREPORT DETAILS
    Precheck failed for AREPORT EMPLOYEEDETAILS
    Precheck failed for HIERARCH HIE_0604143208
    Any help is highly appreciated
    Thanks&Regards
    Manoj
    All the prerequisites carried out in the Target Server

    The message
    13-JUL-05 15:00:11][ERROR] id = NULL context = style_pre_check user = ORCLADMIN The Unique Identifier of the source style KNPC_PORTAL does not match the target style KNPC_PORTAL
    indicates that a style with the same name has been created in target directly or imported from another instance (other than the one from which the transport set is attempting to import).
    In order for pre-check to pass, you will either need to locate the object(s) in the target, rename (or delete) them and reattempt import, (or) rename them in source and reexport (recreate dumps) and import the new transport set.

  • Error while connecting to the LDAP server

    In LDAP Server, i have configured OU with the following characteres.
    OU=Administración.
    Now when i try to connect LDAP server from my application, am getting the following exception.
    [LDAP: error code 49 - 80090308: LdapErr: DSID-0C0903A9, comment: AcceptSecurityContext error, data 52e, v1db0]
    javax.naming.AuthenticationException: [LDAP: error code 49 - 80090308: LdapErr: DSID-0C0903A9, comment: AcceptSecurityContext error, data 52e, v1db0]
         at com.sun.jndi.ldap.LdapCtx.mapErrorCode(LdapCtx.java:3041)
         at com.sun.jndi.ldap.LdapCtx.processReturnCode(LdapCtx.java:2987)
         at com.sun.jndi.ldap.LdapCtx.processReturnCode(LdapCtx.java:2789)
         at com.sun.jndi.ldap.LdapCtx.connect(LdapCtx.java:2703)
         at com.sun.jndi.ldap.LdapCtx.<init>(LdapCtx.java:293)
         at com.sun.jndi.ldap.LdapCtxFactory.getUsingURL(LdapCtxFactory.java:175)
         at com.sun.jndi.ldap.LdapCtxFactory.getUsingURLs(LdapCtxFactory.java:193)
         at com.sun.jndi.ldap.LdapCtxFactory.getLdapCtxInstance(LdapCtxFactory.java:136)
         at com.sun.jndi.ldap.LdapCtxFactory.getInitialContext(LdapCtxFactory.java:66)
         at javax.naming.spi.NamingManager.getInitialContext(NamingManager.java:667)
         at javax.naming.InitialContext.getDefaultInitCtx(InitialContext.java:288)
         at javax.naming.InitialContext.init(InitialContext.java:223)
         at javax.naming.InitialContext.<init>(InitialContext.java:197)
         at javax.naming.directory.InitialDirContext.<init>(InitialDirContext.java:82)
    When i search for this, i got the this [link |http://esupport.trendmicro.com/solution/en-us/1037285.aspx/] saying some Accent characters are not converted correctly into 8-bit Unicode Transformation Format (UTF-8).
    Here i have used URLEncoder.encode(mySearchbase, "UTF-8"); to encode the special characters into UTC-8.
    I would like to know whether its a known issue with accent characters or anything else i missed here to handle those characters.
    Thanks,
    -Konanki

    Well, if you're passing an array of bytes to that LDAP access code, then that isn't the right way to encode a String to an array of bytes in UTF-8 encoding. And anyway it's been a long time since I wrote LDAP access code, but I don't recall having to pass arrays of bytes to any of those JNDI classes, so that idea is probably wrong in any case.
    I would suggest, if that page you linked to is actually relevant, that you just install the hot-fix it refers to. On the other hand if it doesn't actually apply to your situation, then you should just ignore it.
    My guess is that UTF-8 or not, your OU value on the server is in fact not "Administraci&oacute;n" -- that's based on the number of mis-encoded characters I see there. So perhaps what you are passing to the JNDI classes does in fact not match the server's value and it isn't an encoding issue at all.

  • Error while processing the dimension

    Multiple Specification of the Name 'HIR' as a Component Name (Component 6)
    this is the error i am geting while processing the dimension

    Hi,
    Do you get this error while processing all the dimension or only in specific dimension?
    Do you have hierarchies in this dimension? Have you added the hierarchy in the property (you should not).

  • Error: Component failed to run due to a Object Package scheduling failure

    Hi,
    BusinessObjects XI R2 SP 5, FP 5.1
    I am trying to schedule a group of reports (crystal reports) via a package where the output destination is to an email. At the event of execution of the scheduled time for the package; the package fails with the error: Component failed to run due to a Object Package scheduling failure. (Note: When scheduled individually it is successful and it was copied to the package from its original location, so there is no mistake in parameters or ODBC connections)
    When we go to the history and within the instance, we see that some of the reports have the status as success and some are failed with the same error message. Even though some of the reports are made to fail at the event of 'NO DATA'; what I do not understand is that how come some of the other reports (which contains data and which works when trying to run manually or scheduled individually) are failing.
    I would understand something is wrong when the entire package fails which is not the case here as say of 50 reports, 5 are successful and the rest fails with the same error.

    Sorry posted on the wrong section...
    Edited by: Deepu Philip on Mar 18, 2010 5:38 PM

  • Failed to run task sequence. Error occurred while starting the task sequence (0x8007000E)

    Hi there
    Patch Tuesday yesterday (10th June2014). As always we deploy new patches first to a test collection where Windows 7 updates automatically apply.
    Upon trying to rebuild any of the machines in this test collection, we were presented with the following error message:
    Failed to run task sequence.  Error occurred while starting the task sequence (0x8007000E)
    After searching about this, I found this page from Niall Brady, which explained the problem:
    http://www.niallbrady.com/2013/05/17/after-selecting-a-task-sequence-in-configuration-manager-2012-sp1-you-receive-threadtoresolveandexecutetasksequence-failed-code0x8007000e-in-smsts-log/
    So I removed some of the machines from the test Windows update collection, and as per the advice in the above link, the error was gone and those machines could be built successfully.
    So the problem is there were too many many policies downloaded (apps, packages and most of all updates) for the task sequence ram to store, hence the error.
    Now...
    ...I have a question.
    The next logical step to my mind is to patch our OS image with all missing patches, so these do not have to be downloaded at build time. Niall mentions this as one of the resolutions to this issue.
    However there seems to be some confusion over whether this would actually make a difference.
    I read through this link:
    http://social.technet.microsoft.com/Forums/en-US/7e597b44-2586-4063-b6d0-cec48a7c11c7/sccm-2012-task-sequence-failure-0x8007000e?forum=configmanagerosd
    There's seems to be no consensus on this.
    Is SCCM 2012 clever enough to - when the task sequence is first started - to download ONLY the updates (policies) it detects as NOT present in the OS image...
    or
    Will it simply try to download policies for ALL items deployed to it, whether the updates are present in the OS image or not?
    I will be disappointed if SCCM 2012 SP1 CU2 isn't clever enough to only download policies at build time for the apps, packages and updates it detects as needed.
    I'd be grateful for some clarity on this.
    Regards,
    John, Glasgow.

    Hi Jason
    Thank you for replying, I appreciate it.
    1) We currently have 15 or 16 software update groups for Office updates, dating back a month or two. The latest software update group contains all the patches in the previous software update groups plus the patches released on 10th June. Do you recommend
    deleting all but the latest software update group?
    2) I'm almost reluctant to ask this, but based on what you have advised, is it the case that when the task sequence executes, it will download policies for each update in each software update group regardless of whether it has already downloaded a policy
    for an update in a previous software update group? So in effect it's downloading policies (for updates) it has already downloaded?
    3) I'm not clear on why there would be no policy for an image; in Niall Brady's informative page on the 8007000E error, he writes the following:
    "The reason it has run of space could be due to four possibilites: too many applications, too many Windows updates, too many Task Sequence steps, too many referenced packages'.
    Can you shed some light on why there isn't a policy for an image?
    Thanks again for replying,
    John.

  • "Failed to transfer due to internal error" in AC

    I am running CCM 4.1(2)
    I have several receptionists that use attendant console. When anyone of the receptionists log into AC call control comes up. When they try to transfer to users in the directory they all get the "Failed to transfer due to internal error" I can't find this error anywhere. I don't know how to correct this issue. Any ideas?
    Thanks

    I suppose that beside CCM 4.1(2) you are using AC 1.4 (1), if yes, then you need to upgrade to AC 1.4 (1) ES11 or upgrade at least to CCM 4.1(3)ES42 or CCM 4.1(3) sr3c
    HTH
    //Jorge

  • Pr 6 of CS6 failed to install due to language error.  System: Mac OS 10.9.4.  Any idea?

    Pr 6 of CS6 failed to install due to language error.  System: Mac OS 10.9.4.  Any idea?

    attach a screenshot of the error message.

  • BAM Deployment error - Microsoft.BizTalk.Bam.Management.BamManagerException: The BAM deployment failed. --- Microsoft.BizTalk.Bam.Management.BamManagerException: Encountered error while executing command on SQL Server "ServerName".

    HI,
    I am getting below error while deploying BAM activity ...Pls help me resolve this issue.
    Microsoft.BizTalk.Bam.Management.BamManagerException: The BAM deployment failed. ---> Microsoft.BizTalk.Bam.Management.BamManagerException: Encountered error while executing command on SQL Server
    "ServerName". ---> System.Data.SqlClient.SqlException: An object or column name is missing or empty. For SELECT INTO statements, verify each column has a name. For other statements, look for empty alias names. Aliases defined as "" or
    [] are not allowed. Change the alias to a valid name.An object or column name is missing or empty. For SELECT INTO statements, verify each column has a name. For other statements, look for empty alias names. Aliases defined as "" or [] are not allowed.
    Change the alias to a valid name.An object or column name is missing or empty. For SELECT INTO statements, verify each column has a name. For other statements, look for empty alias names. Aliases defined as "" or [] are not allowed. Change the alias
    to a valid name.An object or column name is missing or empty. For SELECT INTO statements, verify each column has a name. For other statements, look for empty alias names. Aliases defined as "" or [] are not allowed. Change the alias to a valid name.An
    object or column name is missing or empty. For SELECT INTO statements, verify each column has a name. For other statements, look for empty alias names. Aliases defined as "" or [] are not allowed. Change the alias to a valid name.An object or column
    name is missing or empty. For SELECT INTO statements, verify each column has a name. For other statements, look for empty alias names. Aliases defined as "" or [] are not allowed. Change the alias to a valid name.An object or column name is missing
    or empty. For SELECT INTO statements, verify each column has a name. For other statements, look for empty alias names. Aliases defined as "" or [] are not allowed. Change the alias to a valid name.An object or column name is missing or empty. For
    SELECT INTO statements, verify each column has a name. For other statements, look for empty alias names. Aliases defined as "" or [] are not allowed. Change the alias to a valid name.An object or column name is missing or empty. For SELECT INTO statements,
    verify each column has a name. For other statements, look for empty alias names. Aliases defined as "" or [] are not allowed. Change the alias to a valid name.An object or column name is missing or empty. For SELECT INTO statements, verify each column
    has a name. For other statements, look for empty alias names. Aliases defined as "" or [] are not allowed. Change the alias to a valid name.An object or column name is missing or empty. For SELECT INTO statements, verify each column has a name. For
    other statements, look for empty alias names. Aliases defined as "" or [] are not allowed. Change the alias to a valid name.An object or column name is missing or empty. For SELECT INTO statements, verify each column has a name. For other statements,
    look for empty alias names. Aliases defined as "" or [] are not allowed. Change the alias to a valid name.   at System.Data.SqlClient.SqlConnection.OnError(SqlException exception, Boolean breakConnection, Action`1 wrapCloseInAction) 
     at System.Data.SqlClient.SqlInternalConnection.OnError(SqlException exception, Boolean breakConnection, Action`1 wrapCloseInAction)   at System.Data.SqlClient.TdsParser.ThrowExceptionAndWarning(TdsParserStateObject stateObj, Boolean callerHasConnectionLock,
    Boolean asyncClose)   at System.Data.SqlClient.TdsParser.TryRun(RunBehavior runBehavior, SqlCommand cmdHandler, SqlDataReader dataStream, BulkCopySimpleResultSet bulkCopyHandler, TdsParserStateObject stateObj, Boolean& dataReady)   at
    System.Data.SqlClient.SqlCommand.RunExecuteNonQueryTds(String methodName, Boolean async, Int32 timeout, Boolean asyncWrite)   at System.Data.SqlClient.SqlCommand.InternalExecuteNonQuery(TaskCompletionSource`1 completion, String methodName, Boolean
    sendToPipe, Int32 timeout, Boolean asyncWrite)   at System.Data.SqlClient.SqlCommand.ExecuteNonQuery()   at Microsoft.BizTalk.Bam.Management.SqlHelper.ExecuteBatches(String cmdText)   at Microsoft.BizTalk.Bam.Management.SqlHelper.ExecuteNonQuery(String
    cmdText, CommandType cmdType, Boolean inTransaction, Transaction transaction)   --- End of inner exception stack trace ---   at Microsoft.BizTalk.Bam.Management.SqlHelper.ExecuteNonQuery(String cmdText, CommandType cmdType, Boolean inTransaction,
    Transaction transaction)   at Microsoft.BizTalk.Bam.Management.ViewModule.Create(XmlDocument defXmlDoc)   at Microsoft.BizTalk.Bam.Management.WorkerModule.DispatchOperation(OperationType operation, XmlDocument defXmlDoc)   at
    Microsoft.BizTalk.Bam.Management.BamManager.ProcessOneBamArtifactType(BamArtifactType bamArtifact, OperationType operation)   at Microsoft.BizTalk.Bam.Management.BamManager.ManageInfrastructure(OperationType operation)   at Microsoft.BizTalk.Bam.Management.BamManager.Deploy() 
     --- End of inner exception stack trace ---   at Microsoft.BizTalk.Bam.Management.BamManager.Deploy()   at Microsoft.BizTalk.Bam.Management.BamManagementUtility.BamManagementUtility.HandleDeployAll()   at Microsoft.BizTalk.Bam.Management.BamManagementUtility.BamManagementUtility.DispatchCommand() 
     at Microsoft.BizTalk.Bam.Management.BamManagementUtility.BamManagementUtility.Run()   at Microsoft.BizTalk.Bam.Management.BamManagementUtility.BamManagementUtility.Main(String[] args)

    Your View Name, OLAP Cube Name and certain other restrictions listed @http://msdn.microsoft.com/en-us/library/aa561577.aspx
    Please review your BAM Definitons.
    Regards.

  • Error -32810 occurred at The FieldPoint server initialization failed. Possible causes: 1. Missing or corrupt configuration file; 2. Failed to create callbacks. : FP Open.vi

    I have two cFP-2120 RT controller. They both have NI-Serial RT2.5.6, DataSocket for LV RT4.2, NI-VISA 3.6, FP Drivers 5.1.0, FP VI Manager 3.1.0 LV RT 7.1.1 installed. But one same vi can run on one controller but not another.
    the error message got when it runs on another controller is "Error -32810 occurred at  The FieldPoint server initialization failed. Possible causes: 1. Missing or corrupt configuration file; 2. Failed to create callbacks. : FP Open.vi"
    I wonder by what it is caused?
    Thanks

    Hi Matthew,
    As mentioned previously, this KnowledgeBase article may be of some help. Also, if your code is being run on an embedded controller and then a network controller (not embedded), you will need to run the program differently. On the embedded controller, you should deploy your VI in a Project Explorer or programmatically (as described here.) However, you do not need to deploy the program to a network controller, but simply run the VI.
    I would also suggest creating a new .IAK file. Do you still see the same error? Also, double-check that the software installed on the controller matches the software installed on the host PC. If you have any file paths associated with one FieldPoint controller, ensure that you are changing them to match the second controller.
    Please keep us posted on your troubleshooting steps. Have a great day!
    Amanda Howard
    Americas Services and Support Recruiting Manager
    National Instruments

  • Message failing in SXMB_moni----Error while reading from the secure store

    Hi,
    The scenario is as below
    A file is picked up from a folder and processed to enrich it.This enriched file is then written back in a different folder.
    The message is failing in sxmb_moni while trying to write the file in the folder.
    The PI system is a system copy of another system and few of the configuration objects are transported through a tpz file to this PI system.The file receiver channel used to write this file is also transported through this tpz file.
    Below is the error seen in moni.:
    <?xml version="1.0" encoding="UTF-8" standalone="yes" ?><!-- Call Adapter --> <SAP:Error xmlns:SAP="http://sap.com/xi/XI/Message/30" xmlns:SOAP="http://schemas.xmlsoap.org/soap/envelope/" SOAP:mustUnderstand="1"><SAP:Category>XIServer</SAP:Category><SAP:Code area="INTERNAL">AE_DETAILS_GET_ERROR</SAP:Code><SAP:P1/><SAP:P2/><SAP:P3/><SAP:P4/><SAP:AdditionalText>Error while reading from the secure store: ERROR_U: No service user password found for Adapter Engine</SAP:AdditionalText><SAP:Stack>Error while reading access data (URL, user, password) for the Adapter Engine
    </SAP:Stack><SAP:Retry>M</SAP:Retry></SAP:Error>
    Below is Trace log:
    <Trace level="1" type="B" name="PLSRV_CALL_ADAPTER"></Trace><!-- ************************************ -->
    <Trace level="1" type="B" name="CL_XMS_MAIN-CALL_PLSRV"></Trace><!-- ************************************ -->
    <Trace level="1" type="B" name="CL_XMS_MAIN-CALL_PLSRV_LOCAL"></Trace><!-- ************************************ -->
    <Trace level="1" type="B" name="CL_XMS_PLSRV_IE_ADAPTER-ENTER_PLSRV">
    <Trace level="1" type="B" name="CL_XMS_PLSRV_CALL_XMB-CALL_XMS_HTTP"></Trace><!-- ************************************ -->
    <Trace level="1" type="T">error reading secstore:Error while reading from the secure store: ERROR_UNKNOWN: System-dependent data for entry  changed:  / (SECSTORE,031) </Trace>
    <Trace level="1" type="System_Error">Error while reading access data (URL, user, password) for the Adapter Engine  </Trace>
    </Trace>
    </Trace>
    <Trace level="1" type="System_Error">Error exception return from pipeline processing! </Trace>
    <Trace level="1" type="B" name="CL_XMS_MAIN-WRITE_MESSAGE_TO_PERSIST"></Trace><!-- ************************************ -->
    Is this because  PI system is a system copy of another system ?
    Regards,
    Sneha

    Error while reading access data (URL, user, password) for the Adapter Engine
    Check out Michal's reply:
    Re: URL for Central Adapter Engine
    As you said there was a system copy it may be the case that some things were not configured properly

  • Error while generation of the Authorization object (

    Hi Gurus,
    I have created a Authorization object Z_CCTR3 for 0costcenter authorization.
    but getting following error while generation of the Authorization object (type is Flat authorization)
    "Error occurred when reading the data from DataStore object Z_CCTR3"
    Any inputs will helpful...
    Sonal.....

    Hello everybody,
                             my problem is solved.For the UDConnect, whatever DATA SOURCES you create gets registered in a FUNCTION MODULE which has a capacity of only 99 enties, so to increase it implement the SAP NOTE 876340 - UDC Error available on SERVICE MARKET PLACE.
    This problem occurs with BW version 3.5 level 17 or below.
    Regards,
    Priyanka
    Edited by: Priyanka Joshi on Jun 10, 2008 11:03 AM

  • 160149]Error while processing library references. Unresolved application

    hi am having this error when running my application am in jdeveloper 11.1.1.6.0
    <07 Mar 2013 9:17:19 AM> <Error> <Deployer> <BEA-149265> <Failure occurred in the execution of deployment request with ID '1362640639128' for task '1'. Error is: 'weblogic.management.DeploymentException: [J2EE:160149]Error while processing library references. Unresolved application library references, defined in weblogic-application.xml: [Extension-Name: oracle.webcenter.framework, Specification-Version: 11.1.1, exact-match: false], [Extension-Name: oracle.webcenter.skin, Specification-Version: 11.1.1, exact-match: false], [Extension-Name: oracle.sdp.client, exact-match: false], [Extension-Name: oracle.soa.workflow.wc, exact-match: false].'
    weblogic.management.DeploymentException: [J2EE:160149]Error while processing library references. Unresolved application library references, defined in weblogic-application.xml: [Extension-Name: oracle.webcenter.framework, Specification-Version: 11.1.1, exact-match: false], [Extension-Name: oracle.webcenter.skin, Specification-Version: 11.1.1, exact-match: false], [Extension-Name: oracle.sdp.client, exact-match: false], [Extension-Name: oracle.soa.workflow.wc, exact-match: false].
         at weblogic.application.internal.flow.CheckLibraryReferenceFlow.prepare(CheckLibraryReferenceFlow.java:26)
         at weblogic.application.internal.BaseDeployment$1.next(BaseDeployment.java:613)
         at weblogic.application.utils.StateMachineDriver.nextState(StateMachineDriver.java:52)
         at weblogic.application.internal.BaseDeployment.prepare(BaseDeployment.java:184)
         at weblogic.application.internal.EarDeployment.prepare(EarDeployment.java:58)
         Truncated. see log file for complete stacktrace
    >
    <07 Mar 2013 9:17:19 AM> <Warning> <Deployer> <BEA-149004> <Failures were detected while initiating deploy task for application 'VulindlelaScreens'.>
    <07 Mar 2013 9:17:19 AM> <Warning> <Deployer> <BEA-149078> <Stack trace for message 149004
    weblogic.management.DeploymentException: [J2EE:160149]Error while processing library references. Unresolved application library references, defined in weblogic-application.xml: [Extension-Name: oracle.webcenter.framework, Specification-Version: 11.1.1, exact-match: false], [Extension-Name: oracle.webcenter.skin, Specification-Version: 11.1.1, exact-match: false], [Extension-Name: oracle.sdp.client, exact-match: false], [Extension-Name: oracle.soa.workflow.wc, exact-match: false].
         at weblogic.application.internal.flow.CheckLibraryReferenceFlow.prepare(CheckLibraryReferenceFlow.java:26)
         at weblogic.application.internal.BaseDeployment$1.next(BaseDeployment.java:613)
         at weblogic.application.utils.StateMachineDriver.nextState(StateMachineDriver.java:52)
         at weblogic.application.internal.BaseDeployment.prepare(BaseDeployment.java:184)
         at weblogic.application.internal.EarDeployment.prepare(EarDeployment.java:58)
         Truncated. see log file for complete stacktrace
    >
    [09:17:19 AM] ####  Deployment incomplete.  ####
    [09:17:19 AM] Remote deployment failed (oracle.jdevimpl.deploy.common.Jsr88RemoteDeployer)
    #### Cannot run application VulindlelaScreens due to error deploying to IntegratedWebLogicServer.
    [Application VulindlelaScreens stopped and undeployed from Server Instance IntegratedWebLogicServer]when i click my help->check updated its empty it does not show any updates,but when i run other project it show updates which are available
    Edited by: adf009 on 2013/03/07 10:20 AM
    Edited by: adf009 on 2013/03/07 10:48 AM
    Edited by: adf009 on 2013/03/07 10:50 AM

    Solution:
    open the weblogic server console, in home page--> click the Deployments-->Select the adf.oracle.domain-->select target tab-->Click Lock & Edit-->
    select the servers (admin and managed Server) and save.--> click Activate All changes.
    Redeploy the application.
    Regards
    Kumar

Maybe you are looking for

  • URGENT NEED OF HELP!! Gift code not working!

    Hi everyone, I have a flight tomorrow and I wanted to make sure I was set in terms of music. Since I am from Hong Kong, I bought a 3 Month Spotify Premium card from 7-11 and tried to redeem it the day after. Not only was the actually spotify.com site

  • Problem with safari app keyboard ?? Please Help

    Hello, When i enter website address in safari app it does not show space bar in keyboard? please help.??

  • 16:9 - Anamorphic or Not ?

    I believe that most 16:9 cameras have an anamorphic lens which squeezes the picture laterally onto a normal 4:3 chip. When capturing in FCE presumably you would use one of the Anamorphic settings. However, I have been told that some widescreen camera

  • Facetime HD is not clear enough as described in the web(720p)!

    We have 2 new MBPs(13'' and 15''), both of us have new FacetimeHD camera and newest system. But when we start facetime, it is not clear enough as described in the web(720p), and much worse, maybe only 640x480? I think not about our network, because w

  • .ard file not creating

    Hi All, I'm using SAP B1 2005 with B1DESetup_2005SP01_1.3_VS2005 for visual studio 2005 version. When I try to create a new addon it is not generating .ard file. I have installed visual studio 2005 first then installed B1DE Setup.