OER Applet Error - A non-fatal error occurred when fetching an entity id

Suddenly I have a problem when I want to run 'graphic representation of related items' applet from Oracle Enterprise Repository 11.1.1.2. Thinkmap console shows up wit following message:
Error: A non-fatal error occurred when fetching an entity id :  : Remote Error: Login required to view information.
Error: A non-fatal error occurred when loading entities :  : Remote Error: Login required to view information.
Error: cannot set initial center entity : java.lang.NullPointerException
I suspect it's some issue with JRE, since everything worked fine few weeks ago. I've also tried to downgrade to JRE 1.5, but I still get the same error. I've tured on debugging and in java console I get this:
Trace level set to 5: all ... completed.
basic: Starting applet teardown
basic: Finished applet teardown
basic: Added progress listener: [email protected]
basic: Applet loaded.
basic: Applet resized and added to parent container
basic: PERF: AppletExecutionRunnable - applet.init() BEGIN ; jvmLaunch dt 762277 us, pluginInit dt 123357325 us, TotalTime: 124119602 us
+network: Cache entry not found [url: http://somesrv.domain.si:7101/oer/thinkmap/gui.jsp, version: null]+
network: Connecting http://somesrv.domain.si:7101/oer/thinkmap/gui.jsp with proxy=DIRECT
network: Connecting http://somesrv.domain.si:7101/oer/thinkmap/gui.jsp with cookie "flashline.authtoken=-5cfd1072-1298307490b--7ff5; flashline.userlogin=; flashline.username=user1"
network: Server http://somesrv.domain.si:7101/oer/thinkmap/gui.jsp requesting to set-cookie with "JSESSIONID=tbGzMsGDKnnn5pRnK9B9vT1TMf7PKLljxnpJHjVBcQLpnLLBnlhf!835222537; path=/; HttpOnly"
basic: Applet initialized
basic: Removed progress listener: [email protected]
basic: Applet made visible
basic: Starting applet
basic: completed perf rollup
network: Connecting http://somesrv.domain.si:7101/oer/thinkmap/my.tas with proxy=DIRECT
network: Connecting http://somesrv.domain.si:7101/oer/thinkmap/my.tas with cookie "flashline.authtoken=-5cfd1072-1298307490b--7ff5; flashline.userlogin=; flashline.username=user1"
basic: Applet started
basic: Told clients applet is started
network: Connecting http://somesrv.domain.si:7101/oer/thinkmap/my.tas with proxy=DIRECT
network: Connecting http://somesrv.domain.si:7101/oer/thinkmap/my.tas with cookie "flashline.authtoken=-5cfd1072-1298307490b--7ff5; flashline.userlogin=; flashline.username=user1"
network: Server http://somesrv.domain.si:7101/oer/thinkmap/my.tas requesting to set-cookie with "JSESSIONID=GVQ8MsGDGTzVGyQTn81n2wQ6hsLJB1p0GBwQD8VhnJJKhr3glNdt!835222537; path=/; HttpOnly"
network: Connecting http://somesrv.domain.si:7101/oer/thinkmap/my.tas with proxy=DIRECT
network: Connecting http://somesrv.domain.si:7101/oer/thinkmap/my.tas with cookie "flashline.authtoken=-5cfd1072-1298307490b--7ff5; flashline.userlogin=; flashline.username=user1"
network: Server http://somesrv.domain.si:7101/oer/thinkmap/my.tas requesting to set-cookie with "JSESSIONID=LdmyMsGDmRt4CQlw6KKxprRVF0KGMXxjpr38h2dRnYGnTNp2jx5J!835222537; path=/; HttpOnly"
Browse tree doesn't work either..message in Java console is:
+network: Cache entry not found [url: http://somesrv.domain.si:7101/oer/com.flashline.cmee.servlet.enterprisetab.AssetTree?depth=2&top=true&cattypeid=100&registrationstatus=100&target=results, version: null]+
network: Connecting http://somesrv.domain.si:7101/oer/com.flashline.cmee.servlet.enterprisetab.AssetTree?depth=2&top=true&cattypeid=100&registrationstatus=100&target=results with proxy=DIRECT
network: Connecting http://somesrv.domain.si:7101/oer/com.flashline.cmee.servlet.enterprisetab.AssetTree?depth=2&top=true&cattypeid=100&registrationstatus=100&target=results with cookie "flashline.authtoken=-5cfd1072-1298307490b--7ff5; flashline.userlogin=; flashline.username=user1"
network: Server http://somesrv.domain.si:7101/oer/com.flashline.cmee.servlet.enterprisetab.AssetTree?depth=2&top=true&cattypeid=100&registrationstatus=100&target=results requesting to set-cookie with "JSESSIONID=HxQCMsKTpGpv3Wrr2vhqHWK06pDR4tpk6QjC1BWJyYSsP7TwLvlJ!835222537; path=/; HttpOnly"
Anybody has an idea what is wrong and how to resolve this problem.
Thnx in advance.
Edited by: Teki on 7.7.2010 10:19

I figured out what is causing this problem: When connecting OER with LDAP according to documentation (http://download.oracle.com/docs/cd/E15523_01/doc.1111/e16580/extauth.htm#CEGHHGAG ) you have to disable cookie login functionality. Now i figured that 'graphic representation of related items' and 'browse tree' applets are not working if there is no cookie for user. So in order for those two applets to work I have to enable enterprise.security.cookielogin.allow and enterprise.authentication.ldap.enabled (or manually check the Enable automatic Login box).
Is there any other setting or workaround that would ensure that mentioned applets would work properly without enable automatic login option checked?! And what is the problem if I do have LDAP authentication and cookie login enabled (why is explicitly stated in documentation that I should disable cookie login with LDAP authentication?) Can someone from Oracle clarify this please?
Edited by: Teki on 7.7.2010 11:43

Similar Messages

  • $$$ Non-fatal error (1202): Foreign Key 'FCM_1_CO_OWNER(Owner_Id) reference

    Hi All,
    We are getting below fatal error while repairing the repository. and we are using MDM SP07 Patch Level 27.
    Error Message: $$$ Non-fatal error (1202): Foreign Key u2018FCM_1_CO_OWNER(Owner_Id) referencing A2i_CM_Users (UserId)u2019 is missing.
    Can  anyone help me how to resolve this issue ?
    Thanks & Regards,
    Mahesh

    Hello,
    I guess you have upgraded your system and hence you are getting this error.
    I guess some lookup table are missing the reference in this.
    But the error says NON-FATAL, please check if you are getting the same error while checking the repository.
    My suggestion would be to unmount and mount the reposiory again.
    regards,
    Abhishek

  • Received Non-Fatal Error 5904: LV 7 during use of Labview application. What does this mean?

    'Non-Fatal Error 5904'. LabView 7 application.  'Source: Comm Analyzer - CP Analog - Adjust Input Level.vi:CP RX Audio Muting.vi'  (MRTE 3.0 - Anritsu CDMA Test System)
    What does this mean?
    /BCU002
    Hardware Engineer•Design Reliability/Performance and Validation Group•Wavecom, Inc. - Research Triangle Park, N.C.•http://www.wavecom.com

    Xaq,
    Here is the comment that was passed about the error source: Comm Analyzer - CP Analog - Adjust Input Level.vi:CP RX Audio Muting.vi
    The application has been working fine for about 12 years, it continues to serve its purpose and the RF test equipment rack components are now obsoleted by newer models but it's still in weekly use and is kept calibrated annually but on occasion it unexpectedly throws an error like this while I'm using the test rack during a wireless RF parametrics test and it leaves me wondering if the root cause is the device under test or the test rack.  That's why I was hoping to find a detailed description about the error code.
    /Bruce
    /BCU002
    Hardware Engineer•Design Reliability/Performance and Validation Group•Wavecom, Inc. - Research Triangle Park, N.C.•http://www.wavecom.com

  • Failed to install Ligthroom CC  Exit Code: 9999 Please see specific errors below for troubleshooting. For example, ERROR:  Summary  0 fatal error(s), 0 error(s) Mac

    Failed to install Ligthroom CC  Exit Code: 9999 Please see specific errors below for troubleshooting. For example, ERROR:  Summary  0 fatal error(s), 0 error(s) Mac

    Exit Code: 6, Exit Code: 7 Installation Errors - http://helpx.adobe.com/creative-suite/kb/errors-exit-code-6-exit.html
    Troubleshoot with install logs | CS5, CS5.5, CS6 - http://helpx.adobe.com/creative-suite/kb/troubleshoot-install-logs-cs5-cs5.html for information on how to review your installation logs

  • I have tried downloading about 6 times and this is the message I keep getting.  Pls. tell me what to do!!Exit Code: 7 Please see specific errors below for troubleshooting. For example,  ERROR:--- Summary -----  - 0 fatal error(s), 2 error(s)     ERROR: Th

    I have tried downloading about 6 times and this is the message I keep getting.  Pls. tell me what I am doing wrong
    Exit Code: 7
    Please see specific errors below for troubleshooting. For example, ERROR:
    -------------------------------------- Summary --------------------------------------
    - 0 fatal error(s), 2 error(s)
    ERROR: This installer does not support installation on a 64-Bit Windows operating system. Please download the 64-Bit version of Photoshop Elements.
    ERROR: System check returned with error : 6I have tried downloading about 6 times and this is the message I keep getting

    Exit Code: 6, Exit Code: 7 Installation Errors - http://helpx.adobe.com/creative-suite/kb/errors-exit-code-6-exit.html
    Troubleshoot with install logs | CS5, CS5.5, CS6 - http://helpx.adobe.com/creative-suite/kb/troubleshoot-install-logs-cs5-cs5.html for information on how to review your installation logs

  • I cannot install i got this : Exit Code: 7 Please see specific errors below for troubleshooting. For example,  ERROR:   -------------------------------------- Summary --------------------------------------  - 0 fatal error(s), 0 error(s)

    i cannot install the newer version
    i got this  :
    Exit Code: 7
    Please see specific errors below for troubleshooting. For example, ERROR:
    -------------------------------------- Summary --------------------------------------
    - 0 fatal error(s), 0 error(s)

    Code 6 & Code 7 http://helpx.adobe.com/creative-suite/kb/errors-exit-code-6-exit.html
    AND JUST FOR MAC USERS - Some 10.9.3 links
    -Mac 10.9.3 workaround https://forums.adobe.com/thread/1489922
    -more Mac 10.9.3 https://forums.adobe.com/thread/1491469
    -Enable Mac Root User https://forums.adobe.com/thread/1156604
    -more Root User http://forums.adobe.com/thread/879931
    -and more root user http://forums.adobe.com/thread/940869?tstart=0

  • Estou com problemas para baixar o photoshop erro: PRE Exit Code: 6 Please see specific errors below for troubleshooting. For example,  ERROR:    -------------------------------------- Summary --------------------------------------   - 0 fatal error(s), 2

    estou com problemas para baixar o photoshop erro:<PRE>Exit Code: 6 Please see specific errors below for troubleshooting. For example,  ERROR:    -------------------------------------- Summary --------------------------------------   - 0 fatal error(s), 2 error(s)     ----------- Payload: Microsoft Visual C++ 2012 Redistributable Package (x64) 11.0.61030.0 {3E272A93-C06B-4206-AD02-0EBE02535E20} -----------  ERROR: Third party payload installer vcredist_x64.exe failed with exit code: -2147024546  ERROR: Failed to install Microsoft Visual C++ 2012 Redistributable Package (x64). Please try installing it by double clicking on the executable at "C:\Users\Silviap\AppData\Local\Temp\{E86F7F7E-85C2-4AC8-8B1A-255B142161A5}\Photoshop_15_ LS20_win64\Adobe CC 2014\payloads\Microsoft VC 2012 Redist (x64)\vcredist_x64.exe", or download and install the latest Microsoft Visual C++ 2012 Redistributable Package (x64) from Microsoft website - www.microsoft.com  -------------------------------------------------------------------------------------  </PRE>

    Code 6 & Code 7 http://helpx.adobe.com/creative-suite/kb/errors-exit-code-6-exit.html

  • Deploying Acrobat pro  9 or 11 error initializing interpreter fatal error

    hi,
    I've tried deploying Acrobat pro  9 or 11 silently at (3) client sites with the same result.  In all cases the installation finishes with this error message:
    Error initializing interpreter: Fatal error
    on clean  machine windows 7 is working, at the customers it's doesn't work.
    Please need help !!!
    best regards

    Acrobat is deployed by SCCM => error message
    Manual installation works => No error message
    it seems that the problem comes from SCCM

  • RW-50010: Error, RC-50004: Fatal: Error occurred in App and exit_code=139

    I am installing R12 on Oracle Enterprise Linux and gettiing above errors.
    ++++++++ Platform++++++
    (I) OS: OEL 4 64-bit update 7 ( installed from DVD if that matters)
    [[email protected] vmware]# uname -a
    Linux arun2.devar.com 2.6.9-78.0.0.0.1.ELsmp #1 SMP Fri Jul 25 16:04:35 EDT 2008 x86_64 x86_64 x86_64 GNU/Linux
    [[email protected] vmware]# more /etc/redhat-release
    Enterprise Linux Enterprise Linux AS release 4 (October Update 7)
    (II) Apps: R12 64-bit (latest available on web released on Jan 13, 2009)
    [[email protected] rapidwiz]# ./RapidWizVersion
    Oracle Applications Rapid Install Wizard
    Version 12.0.4.6
    (c) Copyright 2000-2006 Oracle Corporation. All rights reserved.
    (III)H/W: Dell(insiron 530) Intel quad core with 6GB RAM 1TB disk
    +++++++ rapidwiz+++++
    1) Downloaded x86-64bit ebusiness suit from oracle site
    2) unzipped all packages
    3) installed recommend Linux rpms
    [[email protected] vmware]# more /tmp/orarpm.2.sh
    rpm -Uvh binutils-2.15.92.0.2-25.x86_64.rpm
    rpm -Uvh compat-db-4.1.25-9.i386.rpm
    rpm -Uvh compat-db-4.1.25-9.x86_64.rpm
    rpm -Uvh control-center-2.8.0-12.rhel4.5.x86_64.rpm
    rpm -Uvh gcc-3.4.6-10.0.1.x86_64.rpm
    rpm -Uvh gcc-c++-3.4.6-10.0.1.x86_64.rpm
    rpm -Uvh glibc-2.3.4-2.41.i686.rpm
    rpm -Uvh glibc-2.3.4-2.41.x86_64.rpm
    rpm -Uvh glibc-devel-2.3.4-2.41.i386.rpm
    rpm -Uvh glibc-devel-2.3.4-2.41.x86_64.rpm
    rpm -Uvh glibc-common-2.3.4-2.41.x86_64.rpm
    rpm -Uvh gnome-libs-1.4.1.2.90-44.2.x86_64.rpm
    rpm -Uvh libstdc++-3.4.6-10.0.1.i386.rpm
    rpm -Uvh libstdc++-3.4.6-10.0.1.x86_64.rpm
    rpm -Uvh libstdc++-devel-3.4.6-10.0.1.i386.rpm
    rpm -Uvh libstdc++-devel-3.4.6-10.0.1.x86_64.rpm
    rpm -Uvh libgcc-3.4.6-10.0.1.i386.rpm
    rpm -Uvh libgcc-3.4.6-10.0.1.x86_64.rpm
    rpm -Uvh make-3.80-7.EL4.x86_64.rpm
    rpm -Uvh pdksh-5.2.14-30.6.x86_64.rpm
    rpm -Uvh setarch-1.6-1.x86_64.rpm
    rpm -Uvh sysstat-5.0.5-19.el4.x86_64.rpm
    rpm -Uvh xscreensaver-4.18-5.rhel4.14.0.1.x86_64.rpm
    rpm -Uvh openmotif21-2.1.30-11.0.1.RHEL4.6.i386.rpm
    rpm -Uvh libaio-0.3.105-2.x86_64.rpm
    rpm -Uvh libaio-0.3.105-2.i386.rpm
    rpm -Uvh libaio-devel-0.3.105-2.x86_64.rpm
    Note: some of them were already applied.
    4) Changed /etc/sysctl.conf
    kernel.shmmax=3221225472
    net.ipv4.ip_local_port_range = 2024 65000
    kernel.semmsl=256
    kernel.semmns=32000
    kernel.semopm=100
    kernel.semmni=142
    kernel.shmall=2097152
    kernel.shmmni=4096
    kernel.msgmax=8192
    kernel.msgmnb=65535
    kernel.msgmni=2878
    fs.file-max=65536
    net.core.rmem_default=262144
    net.core.rmem_max=262144
    net.core.wmem_default=262144
    net.core.wmem_max=262144
    Note: rebooted the server couple of times
    5) /etc/hosts entry
    [[email protected] vmware]# more /etc/hosts
    # Do not remove the following line, or various programs
    # that require network functionality will fail.
    127.0.0.1 localhost.localdomain localhost
    192.168.2.5 arun2.devar.com arun2
    6) openmotif:
    [[email protected] vmware]# rpm -qa| grep openm
    openmotif-2.2.3-10.2.el4
    openmotif-devel-2.2.3-10.2.el4
    openmpi-libs-1.2.5-5.el4
    openmotif-2.2.3-10.2.el4
    openmotif21-2.1.30-11.0.1.RHEL4.6
    7) added couple of params to /etc/resolv.conf
    options attempts:5
    options timeout:15
    8) Another hostname file
    [[email protected] rapidwiz]# more /etc/sysconfig/network
    NETWORKING=yes
    HOSTNAME=arun2.devar.com
    9) there is no file called /etc/sysconfig/networking/profiles/default/network
    [[email protected] rapidwiz]# ls -l /etc/sysconfig/networking/profiles/default/network
    ls: /etc/sysconfig/networking/profiles/default/network: No such file or directory
    10) soft and all in /etc/security/limits.conf
    # Added for Oracle
    hard nofile 65535
    soft nofile 4096
    hard nproc 16384
    soft nproc 2047
    11) It fails at 33% of steps 2
    12) I find most binaries are crashing. ldd command on binary doesn't show anything is missing.
    13) file on libraries looks like this
    [[email protected] ~]$ file /d01/oracle6/MARS10/db/tech_st/10.2.0/lib/libsqlplus.so /d01/oracle6/MARS10/db/tech_st/10.2.0/lib/libclntsh.so.10.1
    /d01/oracle6/MARS10/db/tech_st/10.2.0/lib/libsqlplus.so: ELF 64-bit LSB shared object, AMD x86-64, version 1 (SYSV), not stripped
    /d01/oracle6/MARS10/db/tech_st/10.2.0/lib/libclntsh.so.10.1: ELF 64-bit LSB shared object, AMD x86-64, version 1 (SYSV), not stripped
    It become challenging and frustrating for me. I am really exhausted. Any help would be greately appreciated.
    Regards
    -Arun
    PS: snip of log file:
    (a)
    | 0% completed
    / 0% completed
    - 0% completed
    \ 0% completed RC-50004: Fatal: Error occurred in ApplyDatabase:
    Control file creation failed
    Cannot execute configure of database using RapidClone
    RW-50010: Error: - script has returned an error: 1
    RW-50004: Error code received when running external process. Check log file for details.
    Running Database Install Driver for MARS6 instance
    ADX Database Utility
    (b) tail -30
    /d01/oracle6/MARS6/db/tech_st/10.2.0/appsutil/log/MARS6_arun2/ApplyDatabase_02021441.log
    Executable : /d01/oracle6/MARS6/db/tech_st/10.2.0/bin/sqlplus
    The log information will be written to
    /d01/oracle6/MARS6/db/tech_st/10.2.0/appsutil/log/MARS6_arun2/adcrdb_MARS6.txt
    Creating the control file for MARS6_arun2 database ...
    exit_code=139
    Checking for errors ...
    getConnectionUsingAppsJDBCConnector() -->
    APPS_JDBC_URL='null'
    Trying to get connection using SID based connect descriptor
    getConnection() -->
    sDbHost : arun2
    sDbDomain : devar.com
    sDbPort : 1537
    sDbSid : MARS6
    sDbUser : APPS
    Trying to connect using SID...
    getConnectionUsingSID() -->
    JDBC URL: jdbc:oracle:thin:@arun2.devar.com:1537:MARS6
    Exception occurred: java.sql.SQLException: Io exception: The Network Adapter could not establish the connection
    Trying to connect using SID as ServiceName
    getConnectionUsingServiceName() -->
    JDBC URL: jdbc:oracle:thin:@(DESCRIPTION=(ADDRESS=(PROTOCOL=tcp)(HOST=arun2.devar.com)(PORT=1537))(CONNECT_DATA=(SERVICE_NAME=MARS6)))
    Exception occurred: java.sql.SQLException: Io exception: The Network Adapter could not establish the connection
    Trying to connect using SID as ServiceName.DomainName
    getConnectionUsingServiceName() -->
    JDBC URL: jdbc:oracle:thin:@(DESCRIPTION=(ADDRESS=(PROTOCOL=tcp)(HOST=arun2.devar.com)(PORT=1537))(CONNECT_DATA=(SERVICE_NAME=MARS6.devar.com)))
    Exception occurred: java.sql.SQLException: Io exception: The Network Adapter could not establish the connection
    Connection could not be obtained; returning null
    -------------------ADX Database Utility Finished---------------
    RC-00118: Error occurred during creation of database
    Raised by oracle.apps.ad.clone.ApplyDatabase

    Thanks, appreciate your reply. As I mentioned earlier, binaries are crashing. (side note: I am on 10th attempt, so SID=MARS10)
    1) There is a connection issue, not sure why.
    2) I see, something cored. .... adcrdb.sh: line 107: 30881 Segmentation fault sqlplus /nolog......(full text below)
    3) ldd on sqlplus in case required
    [[email protected] bin]$ ldd sqlplus
         libsqlplus.so => /d01/oracle6/MARS10/db/tech_st/10.2.0/lib/libsqlplus.so (0x0000002a95557000)
         libclntsh.so.10.1 => /d01/oracle6/MARS10/db/tech_st/10.2.0/lib/libclntsh.so.10.1 (0x0000002a9574a000)
         libnnz10.so => /d01/oracle6/MARS10/db/tech_st/10.2.0/lib/libnnz10.so (0x0000002a96ae6000)
         libdl.so.2 => /lib64/libdl.so.2 (0x00000039f7200000)
         libm.so.6 => /lib64/tls/libm.so.6 (0x00000039f7000000)
         libpthread.so.0 => /lib64/tls/libpthread.so.0 (0x00000039f7a00000)
         libnsl.so.1 => /lib64/libnsl.so.1 (0x00000039feb00000)
         libc.so.6 => /lib64/tls/libc.so.6 (0x00000039f6d00000)
         /lib64/ld-linux-x86-64.so.2 (0x00000039f6b00000)
    4) last part of $ORACLE_HOME/appsutil/log/MARS10_arun2/ApplyDatabase_02061554.log
    ADX Database Utility
    getConnectionUsingAppsJDBCConnector() -->
    APPS_JDBC_URL='null'
    Trying to get connection using SID based connect descriptor
    getConnection() -->
    sDbHost : arun2
    sDbDomain : devar.com
    sDbPort : 1541
    sDbSid : MARS10
    sDbUser : APPS
    Trying to connect using SID...
    getConnectionUsingSID() -->
    JDBC URL: jdbc:oracle:thin:@arun2.devar.com:1541:MARS10
    Exception occurred: java.sql.SQLException: Io exception: The Network Adapter could not establish the connection
    Trying to connect using SID as ServiceName
    getConnectionUsingServiceName() -->
    JDBC URL: jdbc:oracle:thin:@(DESCRIPTION=(ADDRESS=(PROTOCOL=tcp)(HOST=arun2.devar.com)(PORT=1541))(CONNECT_DATA=(SERVICE_NAME=MARS10)))
    Exception occurred: java.sql.SQLException: Io exception: The Network Adapter could not establish the connection
    Trying to connect using SID as ServiceName.DomainName
    getConnectionUsingServiceName() -->
    JDBC URL: jdbc:oracle:thin:@(DESCRIPTION=(ADDRESS=(PROTOCOL=tcp)(HOST=arun2.devar.com)(PORT=1541))(CONNECT_DATA=(SERVICE_NAME=MARS10.devar.com)))
    Exception occurred: java.sql.SQLException: Io exception: The Network Adapter could not establish the connection
    Connection could not be obtained; returning null
    -------------------ADX Database Utility Finished---------------
    adcrdb.sh started at Fri Feb 6 15:54:57 EST 2009
    The environment settings are as follows ...
    ORACLE_HOME : /d01/oracle6/MARS10/db/tech_st/10.2.0
    ORACLE_SID : MARS10
    TWO_TASK :
    PATH : /d01/oracle6/MARS10/db/tech_st/10.2.0/perl/bin:/d01/oracle6/MARS10/db/tech_st/10.2.0/bin:/usr/bin:/usr/sbin:/d01/oracle6/MARS10/db/tech_st/10.2.0/appsutil/jre/bin:/bin:/usr/bin/X11:/usr/local/bin:/usr/bin:/usr/bin:/softwares/appsr12/startCD/Disk1/rapidwiz/unzip/Linux_x64:/usr/bin:/usr/kerberos/sbin:/usr/kerberos/bin:/usr/local/sbin:/usr/local/bin:/sbin:/bin:/usr/sbin:/usr/bin:/usr/X11R6/bin:/root/bin
    LD_LIBRARY_PATH : /d01/oracle6/MARS10/db/tech_st/10.2.0/lib:/usr/X11R6/lib:/usr/openwin/lib:/d01/oracle6/MARS10/db/tech_st/10.2.0/lib:/usr/dt/lib:/d01/oracle6/MARS10/db/tech_st/10.2.0/ctx/lib
    Executable : /d01/oracle6/MARS10/db/tech_st/10.2.0/bin/sqlplus
    The log information will be written to
         /d01/oracle6/MARS10/db/tech_st/10.2.0/appsutil/log/MARS10_arun2/adcrdb_MARS10.txt
    Creating the control file for MARS10_arun2 database ...
    exit_code=139
    Checking for errors ...
    .end std out.
    /d01/oracle6/MARS10/db/tech_st/10.2.0/appsutil/install/MARS10_arun2/adcrdb.sh: line 107: 30881 Segmentation fault sqlplus /nolog @/d01/oracle6/MARS10/db/tech_st/10.2.0/appsutil/install/MARS10_arun2/adcrdbclone.sql "so" "$S_RDBMS_VERS"
    egrep: /d01/oracle6/MARS10/db/tech_st/10.2.0/appsutil/log/MARS10_arun2/adcrdb_MARS10.txt: No such file or directory
    .end err out.
    -------------------ADX Database Utility Finished---------------
    RC-00118: Error occurred during creation of database
    Raised by oracle.apps.ad.clone.ApplyDatabase

  • Non Fatal error while starting oc4j

    We are using oc4j 1.0.2.2.1 and jdk version 1.2.2_007
    While starting oc4j, we get the following error
    A nonfatal internal JIT (3.10.107(x)) error 'Relocation error: NULL relocation target' has occurred in :
    'org/apache/crimson/parser/Parser2.maybeComment (Z)Z': Interpreting method.
    Please report this error in detail to http://java.sun.com/cgi-bin/bugreport.cgi
    Warning: Error reading transaction-log file (/D:/j2ee/home/persistence/transaction.state) for recovery: premature end of file
    Forced or abrubt (crash etc) server shutdown detected, starting recovery process...
    Recovery completed, 0 connections committed and 0 rolled back...
    Oracle9iAS (1.0.2.2.1) Containers for J2EE initialized
    How do we overcome this error.
    this dosent affect any other operations of the server. Moreover this error does not happen when we use
    jdk 1.3.X versions
    Regards
    Hari

    Hari -- This is a known JVM bug and it is harmless. You may either ignore it or move to the 1.3 JVM.
    Thanks -- Jeff

  • Error: f60webm(HTTP)FATAL ERROR:Not enough read buffer

    I am getting an error as follows with the Forms Server.
    f60webm(HTTP)FATAL ERROR:Not enough read buffer
    The error occurs after a forms session is closed, meaning that I can start the server, load up the forms client in my browser, run the application and do everything normally, but when I close the application at the client end, the server dies with the above message
    This particular server has been running quite happily for a couple of months using the socket method. I need to deploy this system using HTTPS and started testing the HTTP method first as I thought this would be easier. All I have changed so far is the connect method.
    Any ideas on how to fix this? As soon as I get my cerificates sorted out I will be testing the HTTPS method as well, I hope this does not have the same problem, but I'm expecting that it will.
    Regards
    Michael Anthon

    I am seeing the same error that you are experiencing when I run the forms server in http or https mode. I beleieve this same problem is seen under the Solaris version of 9iAS v. 1.0.2.0.0. On Solaris this error is fixed by applying one of the latest patchsets for Dev. 6i...I can't remember which one, but I think we are up to patchset 3 or 4 on a couple of my company's production forms servers and we are running in https mode. The forms server probably will not be able to operate correctly under http or https on Linux until Oracle releases a Linux version of the Dev 6i patchsets for Linux, or if an updated version of Dev 6i is available when 9iAS v. 1.0.2.1.0 for Linux is released. I'm afraid that sockets mode is the only available option at this time for running the Dev 6i forms server on Linux.
    If anyone has any information to the contrary, please let us know.
    Thanks,
    Mike

  • Error "BBP_BD 002: An Exception occured" when changing doc type

    Hi All,
    We are using the BADI BBP_TARGET_OBJTYPE to determine a PR or PO and change the doc type if PR is determined.
    PR/PO is determined correctly but when we tried to assign new doc type for PR getting error "BBP_BD 002: An Exception occured" .
    Below is the code.
    IF wa_item-be_doc_type='ECPO'
          IF wa_item-catalogid IS INITIAL OR wa_item-catalogid CO space
            wa_item-pack_objtype = 'BUS2105'. "PR
            wa_item-be_doc_type = 'ECPR'
          ELSE.
            wa_item-pack_objtype = 'BUS2012'. "PO
          ENDIF.
          MODIFY ct_item FROM wa_item TRANSPORTING pack_objtype.
    END IF
    Can any one tell is this correct or do we need to modify anything?
    Thanks in advance,
    Jagadish
    Edited by: Jagdish Reddy on Aug 17, 2008 3:47 PM

    Hi Dave,
    Thanks for the prompt response!
    We are able to create PR but we want to tie the PR to doc type 'ECPR'. That is why added wa_item-be_doc_type='ECPR'
    If we take out this code it works fine and system creates a PR with doc type 'ECPO'. We do not want this. We want doc type 'ECPR'
    Where is obj_to_gen in the BADI? I do not see that. Is this ina any structure?
    Thanks again.
    Jagadish

  • Start up error: XML-20108: (Fatal Error) Start of root element expected.

    Hi,
    Before I got this error, I manually de-install / install Oracle Spatial and followed metalink Note 179472.1 and 220481.1.
    The reason why I did these is when I run some spation function, always got error message like: ORA-06553:PLS-907: cannot load library unit MSDYS.SDO-3GL (referenced by MDSYS.SDO-FILTER)
    I checked that Spatial is invalid.
    I've struggled with this error for one day. My application is a ADF Faces combine with MapViewer application, and I deployed it to my standalone OC4J (workstation). It works fine.
    Unfortunatelly, I can not deploy app to OracleAS(RHEL 4.0 server). so I copied the .ear file to server, and deploy it via IAS console.
    There is no error for deployment, but when I run the application. The page no response at all(like blocked). I checked the log files under $ORACLE_HOME/opmn/logs and the error is : <Line1, Column1>:XML-20108: (Fatal Error) Start of root element expected.
    The following is my web.xml file:
    <?xml version = '1.0' encoding = 'windows-1252'?>
    <web-app xmlns:xsi="http://www.w3.org/2001/XMLSchema-instance" xsi:schemaLocation="http://java.sun.com/xml/ns/j2ee http://java.sun.com/xml/ns/j2ee/web-app_2_4.xsd" version="2.4" xmlns="http://java.sun.com/xml/ns/j2ee">
    <description>Empty web.xml file for Web Application</description>
    <filter>
    <filter-name>adfFaces</filter-name>
    <filter-class>oracle.adf.view.faces.webapp.AdfFacesFilter</filter-class>
    </filter>
    <filter-mapping>
    <filter-name>adfFaces</filter-name>
    <servlet-name>Faces Servlet</servlet-name>
    <dispatcher>FORWARD</dispatcher>
    <dispatcher>REQUEST</dispatcher>
    </filter-mapping>
    <servlet>
    <servlet-name>Faces Servlet</servlet-name>
    <servlet-class>javax.faces.webapp.FacesServlet</servlet-class>
    <load-on-startup>1</load-on-startup>
    </servlet>
    <servlet>
    <servlet-name>resources</servlet-name>
    <servlet-class>oracle.adf.view.faces.webapp.ResourceServlet</servlet-class>
    </servlet>
    <servlet-mapping>
    <servlet-name>Faces Servlet</servlet-name>
    <url-pattern>/faces/*</url-pattern>
    </servlet-mapping>
    <servlet-mapping>
    <servlet-name>resources</servlet-name>
    <url-pattern>/adf/*</url-pattern>
    </servlet-mapping>
    <session-config>
    <session-timeout>35</session-timeout>
    </session-config>
    <mime-mapping>
    <extension>html</extension>
    <mime-type>text/html</mime-type>
    </mime-mapping>
    <mime-mapping>
    <extension>txt</extension>
    <mime-type>text/plain</mime-type>
    </mime-mapping>
    <welcome-file-list>
    <welcome-file>/index.jsp</welcome-file>
    </welcome-file-list>
    <jsp-config/>
    </web-app>
    Any helps / ideas?
    I appreciate you.
    Thanks
    Joyce

    Check your xml data. You can use setData() with file path parameter or InputStream parameter. See this reference link http://docs.oracle.com/cd/E15586_01/fusionapps.1111/e20838/javaapis.htm#BIPDV005

  • Unable to Build VC++ application it showing error 1 LINK : fatal error LNK1104: cannot open file 'NiFieldPoint71D.lib' but I am Using Measurement Studio 2009 ,NI DAQ 7.01 and Field Point 6.05.

    I am having a application in Visual Studio 2003 on Windows XP  , Now I am Migrating the application in Visual Studio 2005 on Windows-7 .
    In my Development PC , I was install Measurement Studio 2009 ,  NI DAQ 7.01 and Field Point 6.05.
    my application is Showing following error:
    Linking...
    LINK : fatal error LNK1104: cannot open file 'NiFieldPoint71D.lib'
    Build log was saved at "file://c:\EdacsNt\Source\SaftyServices\NICfpDAQDl?l\Debug\BuildLog.htm"
    NICfpDAQDll - 1 error(s), 0 warning(s)
    When I copy from NiFieldPoint71D.lib library from Measurement Studio 7.1 and put in :\Program Files\National Instruments\MeasurementStudioVS2005\VCNET\Lib.
    my application is Showing following error:
    1>Linking...
    1>atlsd.lib(atltrace.obj) : error LNK2005: "unsigned int (__stdcall* ATL::g_pfnGetThreadACP)(void)" ([email protected]@@3P6GIXZA) already defined in NiFieldPoint71D.lib(StdAfx.obj)
    1>atlsd.lib(atlbase.obj) : error LNK2005: "class ATL::CAtlWinModule ATL::_AtlWinModule" ([email protected]@@[email protected]@A) already defined in NiFieldPoint71D.lib(StdAfx.obj)
    1>   Creating library ..\..\lib\debug\NICfpDAQDll.lib and object ..\..\lib\debug\NICfpDAQDll.exp
    1>..\..\bin\debug\NICfpDAQDll.dll : fatal error LNK1169: one or more multiply defined symbols found
    I want to ignore NiFieldPoint71D.lib from using project setting(Linker->Input->ignore Specific Library ) but still it is showing same error.
    In the project Setting I am done following setting:
    "C:\Program Files\National Instruments\MeasurementStudioVS2005\VCNET\Lib";"
    C:\Program Files\National Instruments\NI-DAQ\Lib"
    Linker->Input->ignore Specific Library: mfcs71d.lib;libc.lib;'NiFieldPoint71D.lib
    Please provide some solution.
    Thanks
    Nityanand

    You posted this in the LabVIEW forum.
    Are you programming in LabVIEW?
    There is a separate Measurement Studio for VC++ forum. http://forums.ni.com/t5/Measurement-Studio-for-VC/bd-p/231

  • Unable to Build VC++ applicatio​n it showing error 1 LINK : fatal error LNK1104: cannot open file 'NiFieldPo​int71D.lib​' but I am Using Measuremen​t Studio 2009

    I am Migrating a application in Visual Studio 2005.
    In my development PC I was install the Measurement Studio 2009
    my application is Showing following error:
    1>Linking...
    1>LINK : fatal error LNK1104: cannot open file 'NiFieldPoint71D.lib'
    1>Build log was saved at "file://c:\EdacsNt\Source\SaftyServices\NICfpDAQDll\Debug\BuildLog.htm"
    1>NICfpDAQDll - 1 error(s), 0 warning(s)
    In the project Setting I am done following setting
    "C:\Program Files\National Instruments\MeasurementStudioVS2005\VCNET\Lib";"
    C:\Program Files\National Instruments\NI-DAQ\Lib"
    but in  "C:\Program Files\National Instruments\MeasurementStudioVS2005\VCNET\Lib";"  directory Not having the 'NiFieldPoint71D.lib' because Measurement Studio 2009 not provide this dll.
    Please provide some solution.
    Thanks
    Nityanand

    You posted this in the LabVIEW forum.
    Are you programming in LabVIEW?
    There is a separate Measurement Studio for VC++ forum. http://forums.ni.com/t5/Measurement-Studio-for-VC/bd-p/231

Maybe you are looking for

  • Updating tiger and mac os will not boot after download finished

    Hi all. I updated my mac tiger os on my mac book pro last friday. There were approximately 10 updates to do so i excepted them and all downloaded and i installed them all. I was then asked to restart so i did. On restart my mac is now stuck with a bl

  • No pairing a philips bluetooth headphones to a new macbook air

    I have a new macbook air with OS lion and philips bluetooth headphones model SHB6 100/5. The headphones are recongnised and connect to the laptop but would not pair. Any idea about how to solve that problem?

  • How to set iCal to hh:mm:ss?

    To be able to automatically bid with GarageBuy which allows scripts to be run by iCal i'd love to set iCal to the time format hh:mm:ss to bid precisely like 15 secs before an auction is scheduled to finish. If that's not available in iCal itself - do

  • Macbook pro speakers intermittent drop-out

    OK, my Macbook Pro 13.3" is less than 3 months old, and the speakers (subwoofer) just drops out occasionally, making it virtually impossible to hear sound. Is this a "known fault" in the hardware -- how to proceed and get this fixed? It's a new Mac..

  • How can I read my USA Today ?

    I cannot read my USA today. the titles just remain with no news.