VSTS loadtest error while running Loadtest with Runsettings as No of test iterations , ERROR is : could not read result repository: unknown transaction id in results:

Subject: VSTS loadtest error while running Loadtest with Runsettings as  No of test iterations ,  ERROR is :  could not read result repository: unknown transaction
id in results:
Hello All,
I am facing the following error while running a loadtest (when i choose the scenario to be executed for No of test iterations). But the same loadtest with the Run duration for X minutes is running fine without any issues. 
Any suggestions on the issue i am facing
error is :
could not read result repository: unknown transaction id in results:
or
could not read result repository: unknown request id in results: 
Thanks
Satish

Hi Kotapati,
>>Subject: VSTS loadtest error while running Loadtest with Runsettings as  No of test iterations ,  ERROR is :  could not read result repository: unknown transaction
id in results:
According to your description, you mean that when you run your load test using the Test Iterations way and then get the error message, am I right?
If yes, please you try to close the VS, and then open this VS again. Then clean your load test project/solution and then re-build it, run your load test again check this issue again.
In addition, I suggest you could try to create a new load test and then run it using Test Iterations way check if you get the issue for the specified load test or all load tests.
If possible, I suggest you could share me simple load test for us so that we will further help you.
You could upload your load test to OneDrive and then copy link here.
Best Regards,
We are trying to better understand customer views on social support experience, so your participation in this interview project would be greatly appreciated if you have time. Thanks for helping make community forums a great place.
Click
HERE to participate the survey.

Similar Messages

  • SQL SERVER - Error while executing SSIS package on specific environment : Connection manager - The specified module could not be found

    I have deployed my SSIS packages on SQL 2008 server.
    I have a .bat file which will invoke these packages and also the bat file is placed in the server where the SSIS packages are deployed.
    Scenario 1:
    I double clicked on the bat file to invoke the SSIS packages and ; this executed successfully
    Scenario 2:
    I have used the IBM Tivoli work scheduler(TWS)  to invoke the bat file which in tern will invoke the ssis packges; 
    but when i do this i am getting the below error
     Code: 0x8007007E
       Source: SSIS_Master_Event_Data_Transfer Connection manager "Config DB"
       Description: The specified module could not be found.
    Config BD is a connection manager which will get the connection string from the config file of the SSIS package.
    Please help me to resolve this issue.
    Regards,
    Prakash

    Check you TWS jobmanrc.cmd configuration file.   You may need to add a PATH environment variable in that file that includes your SQL Server file locations.   When TWS jobs are executed, they may not be executing with the same
    PATH variable as when you execute the SSIS outside of TWS.

  • Dunning Error while Run Dunning with F150

    Hi All
    I have created Dunning procedure (name is PA12) with company code is PAUL
    while Running with F150 I m getting below Error?
    Forms for MAHNR 'PA12' , 'RBUKM': 'PAUl' KOART  'D' does not exit (T047E)
    could anyone please explain what this error mean?
    I need to print dunning report after log but getting above error message.
    Looking forward advice and tips,
    Thnx
    Bobby

    bobbyplus1 wrote:
    Hi All
    >
    > I have created Dunning procedure (name is PA12) with company code is PAUL
    >
    >  while Running with F150 I m getting below Error?
    >
    > Forms for MAHNR 'PA12' , 'RBUKM': 'PAUl' KOART  'D' does not exit (T047E)
    >
    > could anyone please explain what this error mean?
    >
    > I need to print dunning report after log but getting above error message.
    >
    > Looking forward advice and tips,
    >
    > Thnx
    >
    > Bobby
    Hi Bobby,
    1. You may wish to check your settings under account payables/Dunning notice.
    2. Make sure that none of the existing payment is yet to be posted.
    3. Sometimes if you click on the red traffic light it may display some specific areas that suggest where the problem lies.
    Regards
    Muhammad

  • Error while running Dev60 with jdk 11711o

    Dear OTN Members / Oracle Development Team.
    Have any one tried it. Help required form Oracle Devlopemnt
    Team.
    hi i am using oracle8 OAS 4.0.7, Developer 6.0 production
    with NT 4.0 and service Pack 3
    when i try to run the form through jinitinator or JDK provided
    with the package i get the following error.
    running with jinitator
    Oracle JInitiator version 1.1.7.11
    Using JRE version 1.1.7.11o
    User home directory = E:\WINNT\Profiles\Administrator
    Proxy Configuration: no proxy
    java.io.FileNotFoundException: \forms60\f60all.jar
    at java.io.FileInputStream.<init>(FileInputStream.java:56)
    at sun.net.www.protocol.file.FileURLConnection.connect(Compiled
    Code)
    at
    sun.net.www.protocol.file.FileURLConnection.getInputStream(FileUR
    LConnection.java:162)
    at
    sun.net.www.protocol.http.HttpURLConnection.openConnectionCheckRe
    directs(Compiled Code)
    at
    sun.applet.AppletCache.getInputStream(AppletCache.java:588)
    at
    sun.applet.AppletResourceLoader.loadJar(AppletResourceLoader.java
    171)
    at sun.applet.JinitAppletPanel.loadJarFiles(Compiled
    Code)
    at sun.plugin.AppletViewer.loadJarFiles(Compiled Code)
    at
    sun.applet.JinitAppletPanel.runLoader(JinitAppletPanel.java:500)
    at sun.applet.JinitAppletPanel.run(Compiled Code)
    at java.lang.Thread.run(Thread.java:466)
    and with JDK
    Microsoft (R) VM for Java, 5.0 Release 5.0.0.3165
    ==============================================
    ? help
    c clear
    f run finalizers
    g garbage collect
    m memory usage
    q quit
    t thread list
    ==============================================
    com.ms.security.SecurityExceptionEx[oracle/forms/engine/Main.init
    ]: cannot access file E:\WINNT\Java\.hotjava
    at com/ms/security/permissions/FileIOPermission.check
    at com/ms/security/PolicyEngine.deepCheck
    at com/ms/security/PolicyEngine.checkPermission
    at com/ms/security/StandardSecurityManager.chk
    at com/ms/security/StandardSecurityManager.checkRead
    at java/io/File.exists
    at java/io/File.mkdirs
    at sun/applet/AppletViewer.<clinit>
    at java/lang/ClassLoader.findSystemClass
    at com/ms/vm/loader/URLClassLoader.loadClass
    at java/lang/ClassLoader.loadClassInternal
    at oracle/forms/engine/Main.init
    at com/ms/applet/AppletPanel.securedCall0
    at com/ms/applet/AppletPanel.securedCall
    at com/ms/applet/AppletPanel.processSentEvent
    at com/ms/applet/AppletPanel.processSentEvent
    at com/ms/applet/AppletPanel.run
    at java/lang/Thread.run
    Error getting package information: sun/applet
    com.ms.packagemanager.PackageManagerException: Package not
    ound
    at com/ms/packagemanager/PackageManager.getPackage
    at
    com/ms/security/SecurityClassLoader.getSecurityInfoFromPackage
    at
    com/ms/security/SecurityClassLoader.findPackageManagerClass
    at
    com/ms/security/SecurityClassLoader.findPackageManagerClass
    at com/ms/vm/loader/URLClassLoader.loadClass
    at java/lang/ClassLoader.loadClassInternal
    at oracle/forms/engine/Main.init
    at com/ms/applet/AppletPanel.securedCall0
    at com/ms/applet/AppletPanel.securedCall
    at com/ms/applet/AppletPanel.processSentEvent
    at com/ms/applet/AppletPanel.processSentEvent
    at com/ms/applet/AppletPanel.run
    at java/lang/Thread.run
    java.lang.ClassNotFoundException: sun.applet.AppletViewer
    at com/ms/vm/loader/URLClassLoader.loadClass
    at java/lang/ClassLoader.loadClassInternal
    at oracle/forms/engine/Main.init
    at com/ms/applet/AppletPanel.securedCall0
    at com/ms/applet/AppletPanel.securedCall
    at com/ms/applet/AppletPanel.processSentEvent
    at com/ms/applet/AppletPanel.processSentEvent
    at com/ms/applet/AppletPanel.run
    at java/lang/Thread.run
    what could be the problem have any one encountered this kind of
    problem.
    pls help required.
    mobeen
    null

    Dear OTN Members / Oracle Development Team.
    Have any one tried it. Help required form Oracle Devlopemnt
    Team.
    hi i am using oracle8 OAS 4.0.7, Developer 6.0 production
    with NT 4.0 and service Pack 3
    when i try to run the form through jinitinator or JDK provided
    with the package i get the following error.
    running with jinitator
    Oracle JInitiator version 1.1.7.11
    Using JRE version 1.1.7.11o
    User home directory = E:\WINNT\Profiles\Administrator
    Proxy Configuration: no proxy
    java.io.FileNotFoundException: \forms60\f60all.jar
    at java.io.FileInputStream.<init>(FileInputStream.java:56)
    at sun.net.www.protocol.file.FileURLConnection.connect(Compiled
    Code)
    at
    sun.net.www.protocol.file.FileURLConnection.getInputStream(FileUR
    LConnection.java:162)
    at
    sun.net.www.protocol.http.HttpURLConnection.openConnectionCheckRe
    directs(Compiled Code)
    at
    sun.applet.AppletCache.getInputStream(AppletCache.java:588)
    at
    sun.applet.AppletResourceLoader.loadJar(AppletResourceLoader.java
    171)
    at sun.applet.JinitAppletPanel.loadJarFiles(Compiled
    Code)
    at sun.plugin.AppletViewer.loadJarFiles(Compiled Code)
    at
    sun.applet.JinitAppletPanel.runLoader(JinitAppletPanel.java:500)
    at sun.applet.JinitAppletPanel.run(Compiled Code)
    at java.lang.Thread.run(Thread.java:466)
    and with JDK
    Microsoft (R) VM for Java, 5.0 Release 5.0.0.3165
    ==============================================
    ? help
    c clear
    f run finalizers
    g garbage collect
    m memory usage
    q quit
    t thread list
    ==============================================
    com.ms.security.SecurityExceptionEx[oracle/forms/engine/Main.init
    ]: cannot access file E:\WINNT\Java\.hotjava
    at com/ms/security/permissions/FileIOPermission.check
    at com/ms/security/PolicyEngine.deepCheck
    at com/ms/security/PolicyEngine.checkPermission
    at com/ms/security/StandardSecurityManager.chk
    at com/ms/security/StandardSecurityManager.checkRead
    at java/io/File.exists
    at java/io/File.mkdirs
    at sun/applet/AppletViewer.<clinit>
    at java/lang/ClassLoader.findSystemClass
    at com/ms/vm/loader/URLClassLoader.loadClass
    at java/lang/ClassLoader.loadClassInternal
    at oracle/forms/engine/Main.init
    at com/ms/applet/AppletPanel.securedCall0
    at com/ms/applet/AppletPanel.securedCall
    at com/ms/applet/AppletPanel.processSentEvent
    at com/ms/applet/AppletPanel.processSentEvent
    at com/ms/applet/AppletPanel.run
    at java/lang/Thread.run
    Error getting package information: sun/applet
    com.ms.packagemanager.PackageManagerException: Package not
    ound
    at com/ms/packagemanager/PackageManager.getPackage
    at
    com/ms/security/SecurityClassLoader.getSecurityInfoFromPackage
    at
    com/ms/security/SecurityClassLoader.findPackageManagerClass
    at
    com/ms/security/SecurityClassLoader.findPackageManagerClass
    at com/ms/vm/loader/URLClassLoader.loadClass
    at java/lang/ClassLoader.loadClassInternal
    at oracle/forms/engine/Main.init
    at com/ms/applet/AppletPanel.securedCall0
    at com/ms/applet/AppletPanel.securedCall
    at com/ms/applet/AppletPanel.processSentEvent
    at com/ms/applet/AppletPanel.processSentEvent
    at com/ms/applet/AppletPanel.run
    at java/lang/Thread.run
    java.lang.ClassNotFoundException: sun.applet.AppletViewer
    at com/ms/vm/loader/URLClassLoader.loadClass
    at java/lang/ClassLoader.loadClassInternal
    at oracle/forms/engine/Main.init
    at com/ms/applet/AppletPanel.securedCall0
    at com/ms/applet/AppletPanel.securedCall
    at com/ms/applet/AppletPanel.processSentEvent
    at com/ms/applet/AppletPanel.processSentEvent
    at com/ms/applet/AppletPanel.run
    at java/lang/Thread.run
    what could be the problem have any one encountered this kind of
    problem.
    pls help required.
    mobeen
    null

  • Error while running interface with different execution context.

    Hi all,
    I have created an Interface in one context and when change the context to another one it gives error while creating internal error tables.
    It says table does not exist APPS.E$_XXCNV_CUST_BCUR_STG but there is no error while creating the table.
    The actual issue is that context is coming as UNDEFINED in Loading Connection tab and Default connection has the earlier context.
    This issue is not coming in all the interfaces only in few interfaces. The other interface runs successfully after changing the context.
    Please let us know if you have faced such an issue and what could be the cause of context coming as UNDEFINED.

    Hi,
    Can you cross check the logical schema of the interface which is pointed on the corresponding context? If its pointed to wrong DB(Physical Schema) it will errored out UNDEFINED error.
    Thanks,
    Guru

  • Error while running JSP with custom tag

    I am trying to run a jsp with a tag and I am getting the following error when I run the jsp:
    "Unable to open taglibrary /WEB-INF/jsp/mytaglib.tld : Parse Error in the tag library descriptor: External parameter entity "%(DOCTYPE);" has characters after markup."
    I have no idea what this is, can anyone help me here?
    tx
    -AB

    Its difficult to tell without looking at your TLD file i.e. mytaglib.tld
    However, a guess is that you may be refering to an invalid or otherwise corrupted DTD from your TLD.
    Check that out.
    The official DTD for TLDs in JSP 1.1 is http://java.sun.com/j2ee/dtds/web-jsptaglibrary_1_1.dtd
    and the official DTD for TLDs in JSP 1.2 is http://java.sun.com/dtd/web-jsptaglibrary_1_2.dtd

  • Error while running application with Tomcat 5.0

    Hi,
    I am trying to run my application on Tomcat 5.0. I have java environment version 1.4
    I am getting the following error during the server start up :
    Mar 30, 2007 3:51:03 PM org.apache.coyote.http11.Http11Protocol init
    INFO: Initializing Coyote HTTP/1.1 on http-8080
    Mar 30, 2007 3:51:03 PM org.apache.catalina.startup.Catalina load
    INFO: Initialization processed in 1047 ms
    Mar 30, 2007 3:51:03 PM org.apache.catalina.core.StandardService start
    INFO: Starting service Catalina
    Mar 30, 2007 3:51:03 PM org.apache.catalina.core.StandardEngine start
    INFO: Starting Servlet Engine: Apache Tomcat/5.0.28
    Mar 30, 2007 3:51:03 PM org.apache.catalina.core.StandardHost start
    INFO: XML validation disabled
    Mar 30, 2007 3:51:03 PM org.apache.catalina.core.StandardHost
    getDeployer
    INFO: Create Host deployer for direct deployment ( non-jmx )
    Mar 30, 2007 3:51:03 PM org.apache.catalina.core.StandardHostDeployer
    install
    INFO: Processing Context configuration file URL file:C:\Program
    Files\Apache Sof
    tware Foundation\Tomcat 5.0\conf\Catalina\localhost\admin.xml
    Mar 30, 2007 3:51:04 PM org.apache.struts.util.PropertyMessageResources
    <init>
    INFO: Initializing, config='org.apache.struts.util.LocalStrings',
    returnNull=tru
    e
    Mar 30, 2007 3:51:04 PM org.apache.struts.util.PropertyMessageResources
    <init>
    INFO: Initializing, config='org.apache.struts.action.ActionResources',
    returnNul
    l=true
    Mar 30, 2007 3:51:05 PM org.apache.struts.util.PropertyMessageResources
    <init>
    INFO: Initializing,
    config='org.apache.webapp.admin.ApplicationResources', retur
    nNull=true
    Mar 30, 2007 3:51:06 PM org.apache.catalina.core.StandardHostDeployer
    install
    INFO: Processing Context configuration file URL file:C:\Program
    Files\Apache Sof
    tware Foundation\Tomcat 5.0\conf\Catalina\localhost\balancer.xml
    Mar 30, 2007 3:51:07 PM org.apache.catalina.core.StandardHostDeployer
    install
    INFO: Processing Context configuration file URL file:C:\Program
    Files\Apache Sof
    tware Foundation\Tomcat 5.0\conf\Catalina\localhost\manager.xml
    Mar 30, 2007 3:51:07 PM org.apache.catalina.core.StandardHostDeployer
    install
    INFO: Installing web application at context path /jsp-examples from URL
    file:C:\
    Program Files\Apache Software Foundation\Tomcat 5.0\webapps\jsp-examples
    Mar 30, 2007 3:51:07 PM org.apache.catalina.core.StandardHostDeployer
    install
    INFO: Installing web application at context path from URL
    file:C:\Program Files
    \Apache Software Foundation\Tomcat 5.0\webapps\ROOT
    Mar 30, 2007 3:51:07 PM org.apache.catalina.core.StandardHostDeployer
    install
    INFO: Installing web application at context path /servlets-examples from
    URL fil
    e:C:\Program Files\Apache Software Foundation\Tomcat
    5.0\webapps\servlets-exampl
    es
    Mar 30, 2007 3:51:07 PM org.apache.catalina.core.StandardHostDeployer
    install
    INFO: Installing web application at context path /tomcat-docs from URL
    file:C:\P
    rogram Files\Apache Software Foundation\Tomcat 5.0\webapps\tomcat-docs
    Mar 30, 2007 3:51:07 PM org.apache.catalina.core.StandardHostDeployer
    install
    INFO: Installing web application at context path /webdav from URL
    file:C:\Progra
    m Files\Apache Software Foundation\Tomcat 5.0\webapps\webdav
    Mar 30, 2007 3:51:07 PM org.apache.coyote.http11.Http11Protocol start
    INFO: Starting Coyote HTTP/1.1 on http-8080
    Mar 30, 2007 3:51:07 PM org.apache.jk.common.ChannelSocket init
    INFO: JK2: ajp13 listening on /0.0.0.0:8009
    Mar 30, 2007 3:51:07 PM org.apache.jk.server.JkMain start
    INFO: Jk running ID=0 time=0/31 config=C:\Program Files\Apache Software
    Foundat
    ion\Tomcat 5.0\conf\jk2.properties
    Mar 30, 2007 3:51:08 PM org.apache.catalina.startup.Catalina start
    INFO: Server startup in 4266 ms
    Mar 30, 2007 3:53:07 PM org.apache.catalina.core.StandardHostDeployer
    install
    INFO: Installing web application at context path /Hyperceller from URL
    file:C:\P
    rogram Files\Apache Software Foundation\Tomcat 5.0\webapps\Hyperceller
    Mar 30, 2007 3:53:08 PM org.apache.struts.util.PropertyMessageResources
    <init>
    INFO: Initializing, config='org.apache.struts.util.LocalStrings',
    returnNull=tru
    e
    Mar 30, 2007 3:53:08 PM org.apache.struts.util.PropertyMessageResources
    <init>
    INFO: Initializing, config='org.apache.struts.action.ActionResources',
    returnNul
    l=true
    Mar 30, 2007 3:53:09 PM org.apache.commons.digester.Digester
    startElement
    SEVERE: Begin event threw exception
    java.lang.reflect.InvocationTargetException
    at sun.reflect.NativeMethodAccessorImpl.invoke0(Native Method)
    at
    sun.reflect.NativeMethodAccessorImpl.invoke(NativeMethodAccessorImpl.
    java:39)
    at
    sun.reflect.DelegatingMethodAccessorImpl.invoke(DelegatingMethodAcces
    sorImpl.java:25)
    at java.lang.reflect.Method.invoke(Method.java:324)
    at
    org.apache.commons.beanutils.PropertyUtils.setSimpleProperty(Property
    Utils.java:1656)
    at
    org.apache.commons.beanutils.PropertyUtils.setNestedProperty(Property
    Utils.java:1551)
    at
    org.apache.commons.beanutils.PropertyUtils.setProperty(PropertyUtils.
    java:1580)
    at
    org.apache.commons.beanutils.BeanUtils.setProperty(BeanUtils.java:919
    at
    org.apache.commons.beanutils.BeanUtils.populate(BeanUtils.java:726)
    at
    org.apache.commons.digester.SetPropertiesRule.begin(SetPropertiesRule
    .java:251)
    at org.apache.commons.digester.Rule.begin(Rule.java:152)
    at
    org.apache.commons.digester.Digester.startElement(Digester.java:1361)
    at
    org.apache.xerces.parsers.AbstractSAXParser.startElement(Unknown Sour
    ce)
    at
    org.apache.xerces.parsers.AbstractXMLDocumentParser.emptyElement(Unkn
    own Source)
    at
    org.apache.xerces.impl.dtd.XMLDTDValidator.emptyElement(Unknown Sourc
    e)
    at
    org.apache.xerces.impl.XMLNSDocumentScannerImpl.scanStartElement(Unkn
    own Source)
    at
    org.apache.xerces.impl.XMLDocumentFragmentScannerImpl$FragmentContent
    Dispatcher.dispatch(Unknown Source)
    at
    org.apache.xerces.impl.XMLDocumentFragmentScannerImpl.scanDocument(Un
    known Source)
    at org.apache.xerces.parsers.XML11Configuration.parse(Unknown
    Source)
    at org.apache.xerces.parsers.XML11Configuration.parse(Unknown
    Source)
    at org.apache.xerces.parsers.XMLParser.parse(Unknown Source)
    at org.apache.xerces.parsers.AbstractSAXParser.parse(Unknown
    Source)
    at
    org.apache.commons.digester.Digester.parse(Digester.java:1647)
    at
    org.apache.struts.action.ActionServlet.parseModuleConfigFile(ActionSe
    rvlet.java:1006)
    at
    org.apache.struts.action.ActionServlet.initModuleConfig(ActionServlet
    .java:955)
    at
    org.apache.struts.action.ActionServlet.init(ActionServlet.java:470)
    at javax.servlet.GenericServlet.init(GenericServlet.java:211)
    at
    org.apache.catalina.core.StandardWrapper.loadServlet(StandardWrapper.
    java:1029)
    at
    org.apache.catalina.core.StandardWrapper.load(StandardWrapper.java:86
    2)
    at
    org.apache.catalina.core.StandardContext.loadOnStartup(StandardContex
    t.java:4013)
    at
    org.apache.catalina.core.StandardContext.start(StandardContext.java:4
    357)
    at
    org.apache.catalina.core.ContainerBase.addChildInternal(ContainerBase
    .java:823)
    at
    org.apache.catalina.core.ContainerBase.addChild(ContainerBase.java:80
    7)
    at
    org.apache.catalina.core.StandardHost.addChild(StandardHost.java:595)
    at
    org.apache.catalina.core.StandardHostDeployer.install(StandardHostDep
    loyer.java:277)
    at
    org.apache.catalina.core.StandardHost.install(StandardHost.java:832)
    at
    org.apache.catalina.startup.HostConfig.deployDirectories(HostConfig.j
    ava:701)
    at
    org.apache.catalina.startup.HostConfig.deployApps(HostConfig.java:432
    at
    org.apache.catalina.startup.HostConfig.check(HostConfig.java:1083)
    at
    org.apache.catalina.startup.HostConfig.lifecycleEvent(HostConfig.java
    :327)
    at
    org.apache.catalina.util.LifecycleSupport.fireLifecycleEvent(Lifecycl
    eSupport.java:119)
    at
    org.apache.catalina.core.StandardHost.backgroundProcess(StandardHost.
    java:800)
    at
    org.apache.catalina.core.ContainerBase$ContainerBackgroundProcessor.p
    rocessChildren(ContainerBase.java:1619)
    at
    org.apache.catalina.core.ContainerBase$ContainerBackgroundProcessor.p
    rocessChildren(ContainerBase.java:1628)
    at
    org.apache.catalina.core.ContainerBase$ContainerBackgroundProcessor.r
    un(ContainerBase.java:1608)
    at java.lang.Thread.run(Thread.java:534)
    Caused by: java.lang.UnsupportedClassVersionError:
    com/hyperceller/form/LoginFor
    m (Unsupported major.minor version 49.0)
    at java.lang.ClassLoader.defineClass0(Native Method)
    at java.lang.ClassLoader.defineClass(ClassLoader.java:539)
    at
    java.security.SecureClassLoader.defineClass(SecureClassLoader.java:12
    3)
    at
    org.apache.catalina.loader.WebappClassLoader.findClassInternal(Webapp
    ClassLoader.java:1634)
    at
    org.apache.catalina.loader.WebappClassLoader.findClass(WebappClassLoa
    der.java:860)
    at
    org.apache.catalina.loader.WebappClassLoader.loadClass(WebappClassLoa
    der.java:1307)
    at
    org.apache.catalina.loader.WebappClassLoader.loadClass(WebappClassLoa
    der.java:1189)
    at
    org.apache.struts.config.FormBeanConfig.formBeanClass(FormBeanConfig.
    java:320)
    at
    org.apache.struts.config.FormBeanConfig.setType(FormBeanConfig.java:1
    91)
    ... 46 more
    Mar 30, 2007 3:53:09 PM org.apache.struts.action.ActionServlet
    handleConfigExcep
    tion
    SEVERE: Parsing error processing resource path
    java.lang.reflect.InvocationTargetException
    at
    org.apache.commons.digester.Digester.createSAXException(Digester.java
    :2919)
    at
    org.apache.commons.digester.Digester.createSAXException(Digester.java
    :2945)
    at
    org.apache.commons.digester.Digester.startElement(Digester.java:1364)
    at
    org.apache.xerces.parsers.AbstractSAXParser.startElement(Unknown Sour
    ce)
    at
    org.apache.xerces.parsers.AbstractXMLDocumentParser.emptyElement(Unkn
    own Source)
    at
    org.apache.xerces.impl.dtd.XMLDTDValidator.emptyElement(Unknown Sourc
    e)
    at
    org.apache.xerces.impl.XMLNSDocumentScannerImpl.scanStartElement(Unkn
    own Source)
    at
    org.apache.xerces.impl.XMLDocumentFragmentScannerImpl$FragmentContent
    Dispatcher.dispatch(Unknown Source)
    at
    org.apache.xerces.impl.XMLDocumentFragmentScannerImpl.scanDocument(Un
    known Source)
    at org.apache.xerces.parsers.XML11Configuration.parse(Unknown
    Source)
    at org.apache.xerces.parsers.XML11Configuration.parse(Unknown
    Source)
    at org.apache.xerces.parsers.XMLParser.parse(Unknown Source)
    at org.apache.xerces.parsers.AbstractSAXParser.parse(Unknown
    Source)
    at
    org.apache.commons.digester.Digester.parse(Digester.java:1647)
    at
    org.apache.struts.action.ActionServlet.parseModuleConfigFile(ActionSe
    rvlet.java:1006)
    at
    org.apache.struts.action.ActionServlet.initModuleConfig(ActionServlet
    .java:955)
    at
    org.apache.struts.action.ActionServlet.init(ActionServlet.java:470)
    at javax.servlet.GenericServlet.init(GenericServlet.java:211)
    at
    org.apache.catalina.core.StandardWrapper.loadServlet(StandardWrapper.
    java:1029)
    at
    org.apache.catalina.core.StandardWrapper.load(StandardWrapper.java:86
    2)
    at
    org.apache.catalina.core.StandardContext.loadOnStartup(StandardContex
    t.java:4013)
    at
    org.apache.catalina.core.StandardContext.start(StandardContext.java:4
    357)
    at
    org.apache.catalina.core.ContainerBase.addChildInternal(ContainerBase
    .java:823)
    at
    org.apache.catalina.core.ContainerBase.addChild(ContainerBase.java:80
    7)
    at
    org.apache.catalina.core.StandardHost.addChild(StandardHost.java:595)
    at
    org.apache.catalina.core.StandardHostDeployer.install(StandardHostDep
    loyer.java:277)
    at
    org.apache.catalina.core.StandardHost.install(StandardHost.java:832)
    at
    org.apache.catalina.startup.HostConfig.deployDirectories(HostConfig.j
    ava:701)
    at
    org.apache.catalina.startup.HostConfig.deployApps(HostConfig.java:432
    at
    org.apache.catalina.startup.HostConfig.check(HostConfig.java:1083)
    at
    org.apache.catalina.startup.HostConfig.lifecycleEvent(HostConfig.java
    :327)
    at
    org.apache.catalina.util.LifecycleSupport.fireLifecycleEvent(Lifecycl
    eSupport.java:119)
    at
    org.apache.catalina.core.StandardHost.backgroundProcess(StandardHost.
    java:800)
    at
    org.apache.catalina.core.ContainerBase$ContainerBackgroundProcessor.p
    rocessChildren(ContainerBase.java:1619)
    at
    org.apache.catalina.core.ContainerBase$ContainerBackgroundProcessor.p
    rocessChildren(ContainerBase.java:1628)
    at
    org.apache.catalina.core.ContainerBase$ContainerBackgroundProcessor.r
    un(ContainerBase.java:1608)
    at java.lang.Thread.run(Thread.java:534)
    Mar 30, 2007 3:53:44 PM org.apache.struts.util.PropertyMessageResources
    <init>
    INFO: Initializing, config='org.apache.struts.taglib.html.LocalStrings',
    returnN
    ull=true
    Mar 30, 2007 3:53:44 PM org.apache.struts.util.PropertyMessageResources
    <init>
    INFO: Initializing, config='org.apache.struts.util.LocalStrings',
    returnNull=tru
    e
    Mar 30, 2007 3:53:44 PM org.apache.struts.util.PropertyMessageResources
    <init>
    INFO: Initializing, config='org.apache.struts.taglib.html.LocalStrings',
    returnN
    ull=true
    could anyone tell me what the problem may be???
    Note: When I configure my application on the Tomcat 5.5 and java 1.5 then it runs fine. But the problem arises when I compile my code on the java 1.4 and run on the Tomcat 5.0
    Thanks in advance!!

    I am sorry that I forgot to tell you that I am running a struts application. Struts 1.1

  • ERROR while running workbook with macros

    Hi all
    I am running a workbook which has macros in it and thus some buttons for different functions.
    Whenever i click on a particular button which should give a new selection window, it is giving me an error as follows:-
    " Microsoft Office Excel has encountered a problem and needs to close.  We are sorry for the inconvenience."
    Please help me out to resolve this issue.
    Any help would be grateful.
    Thanks,
    Vikrant Mahajan

    Hi Vikrant,
    You can check any of the below options. Hope it helps :
    -  Check if you have not opened any other excel in the background .
    -  Check Excel security settings and Macros settings via Office Button -> Excel Options -> Trust Center ->
        Trust Center Settings-> Macro Settings
    -  Also try installing updated version of the MSExcel 2007 BI ADD-ON Patch and enable tha Macros.
    -  Update GUI patch.
    Regards,
    Akanksha

  • Error while running DBMS_NETWORK_ACL_ADMIN

    Hi,
    I am completely new to APEX and trying out myself.
    While Apex 4.2.1 installation, and configuring Embedded PL/SQL Gateway.
    Topic: To grant connect privileges to any host for the APEX_040100 database user
    getting error while running DBMS_NETWORK_ACL_ADMIN (as per example given in installation doc)
    ERROR at line 1:
    ORA-44416: Invalid ACL: Unresolved principal 'APEX_040100'
    ORA-06512: at "SYS.DBMS_NETWORK_ACL_ADMIN", line 252
    ORA-06512: at line 29
    ORA-01403: no data found
    Completely stuck and not able to proceed further....
    OS: WinXP professional,
    DB: Oracle Database 11g Express Edition Release 11.2.0.2.0
    Thanks,
    -Anand

    Having multiple APEX_0% users suggests your database has originally started with APEX 4.0 and has been upgraded as subsequent versions are released (4.1.x, 4.2.x).
    These accounts should be removed, as per the installation guide.
    http://docs.oracle.com/cd/E37097_01/doc/install.42/e35123/otn_install.htm#CBHBABCC
    Your current APEX owner would be APEX_040200, and you should be reading documentation pertinent to your APEX version.
    Scott
    blog: [url grassroots-oracle.com]grassroots-oracle.com
    twitter: [url twitter.com/swesley_perth]@swesley_perth
    -- please mark any useful posts as helpful or correct, in the end it helps us all

  • Error while running a customize report in oracle ebs

    Hi ..
    can anybody suggest how to solve the follwing error while running a customize report in oracle ebs?
    XXIFMS: Version : UNKNOWN
    Copyright (c) 1979, 1999, Oracle Corporation. All rights reserved.
    Current system time is 03-JUN-2011 11:09:24
    +-----------------------------
    | Starting concurrent program execution...
    +-----------------------------
    Arguments
    P_DATE_FROM='2010/04/01 00:00:00'
    P_DATE_TO='2011/06/03 00:00:00'
    Forcing NLS_NUMERIC_CHARACTERS to: '.,' for XDO processing
    APPLLCSP Environment Variable set to :
    Current NLS_LANG and NLS_NUMERIC_CHARACTERS Environment Variables are :
    American_America.AL32UTF8
    stat_low = 9
    stat_high = 0
    emsg:was terminated by signal 9
    ld.so.1: rwrun: fatal: librw.so: open failed: No such file or directory
    Start of log messages from FND_FILE
    End of log messages from FND_FILE
    Program was terminated by signal 9
    Concurrent Manager encountered an error while running Oracle*Report for your concurrent request 1068011.
    Review your concurrent request log and/or report output file for more detailed information.
    Executing request completion options...
    ------------- 1) PUBLISH -------------
    Beginning post-processing of request 1068011 on node D0005 at 03-JUN-2011 11:09:24.
    Post-processing of request 1068011 failed at 03-JUN-2011 11:09:24 with the error message:
    One or more post-processing actions failed. Consult the OPP service log for details.
    Finished executing request completion options.
    Concurrent request completed
    Current system time is 03-JUN-2011 11:09:24

    Please post the details of the application release, database version and OS.
    Is the issue with this specific concurrent program?
    Can you find any errors in the CM/OPP log files?
    Please see if these docs help.
    On R12.1.1/Solaris Platform While Generating Oracle Reports Files Failed With Error " ld.so.1: rwconverter: fatal: librw.so: open failed: No such file or directory [ID 1067786.1]
    Apps UPG Fail With Error Ld.So.1: Rwserver: Fatal: Librw.So [ID 961222.1]
    Thanks,
    Hussein

  • 500 Internal server error while running sqlsrv_query in PHP

    Hello everyone I am having a problem with sqlsrv_query I will be grateful to you please provide some help.
    I am running a query through php:
    $ls_parcel_query = "select  * from  ParcelDetail order by ExtractDate";
    $result = sqlsrv_query($conn, $ls_parcel_query, array(), array("Scrollable"=>"keyset","QueryTimeout"=>300));
    $no_of_rows = sqlsrv_num_rows($result);
    echo "<br/>".$no_of_rows;
    It gives (After 30 seconds):
    500 - Internal server error.
    There is a problem with the resource you are looking for, and it cannot be displayed.
    I have php.ini settings like below:
    max_execution_time = 90
    memory_limit = 128M
    While running this query in SQL SERVER 2008 R2, it successfully gives result in some times in 1 minute and sometimes in 2 minutes.

    Hello,
    A 500 Error will be caused due to many reason.To troubleshooting this issue, you can try to check out the error log and get more information on what is causing the error.
    Reference :
    "500 Internal Server Error" while running PHP
    HTTP Error 500 Internal server for php pages and solution
    Regards,
    Fanny Liu
    Fanny Liu
    TechNet Community Support

  • Error while running the Report

    Hi ,
    I am trying to run the Report in Bex Analyzer. and once I enter the value for the variable, it gives me message that "Element is not correctly define (please check query)" and when i click on the error it gives me detail message as below :
    <b><b>Diagnosis
    Additional elements that do not have the same dimension, such as quantities and amounts or amounts and ratios, are added to element Sales Qty Gallons .
    Procedure
    Check your definition.
    If you still want to use this addition, you can suppress the dimensionality of one or both subexpressions by using the 'NODIM' operator. The system then interprets this or these subexpressions as nondimensional numbers.
    In the executed query, you can use the Key Figure Definition function to analyze element Sales Qty Gallons .</b></b>
    Now the thing is I am already using "NODIM" operator to add those elements. and I m not sure why this error is coming up now because I have created this query a while ago and it wasnt giving me any error at that time but now I have make some changes into it and it;s giving me this error while running the Report. But the thing is I didnt change anything in the element for which it;s showing me error.
    Thanks,
    Naitik

    Naitik,
    There are two or more key figures in your report. They are defined by different dimensions and somewhere you have a formula with both these key figure.
    Edit your query and select the Check Query icon. It will tell you which calculation you have the problem with. Edit this calculation to see which key figures are present.
    If the formula is logically correct, best thing to do is to put a NODIM( ) on your key figures that make up the formula, and then change you formula to look at the NODIM( ) version.
    That will fix things for you,
    Regards
    Gill

  • Error while running a test case in Jcaps 6 JDBC project

    I encountered an error while running the testcase for a JDBC BC project in Jcaps 6.
    BPCOR-6135:A fault was not handled in the process scope; Fault Name is {http://docs.oasis-open.org/wsbpel/2.0/process/executable}selectionFailure; Fault Data is null. Sending errors for the pending requests in the process scope before terminating the process instance
    Caused by: I18N: BPCOR-3023: Selection Failure occurred in BPEL({http://enterprise.netbeans.org/bpel/DBSample/Db}Db
    Kindly suggest a solution

    It seems to be a very common error. Try checking your map assignments when the source (from) is empty (null). These mappings with null values may produce the error you are facing...
    Good luck!

  • Error  while running custom BI report in R12.1.1

    Hi All,
    We are encountering below error while running custom BI report in R12.1.1...
    Forcing NLS_NUMERIC_CHARACTERS to: '.,' for XDO processing
    APPLLCSP Environment Variable set to :
    Current NLS_LANG and NLS_NUMERIC_CHARACTERS Environment Variables are :
    American_America.UTF8
    Enter Password:
    MSG-00001: started report
    REP-1401: '': Fatal PL/SQL error occurred.
    REP-0069: Internal error
    REP-57054: In-process job terminated:Terminated with error:
    REP-1401: '': Fatal PL/SQL error occurred.
    Report Builder: Release 10.1.2.3.0 - Production on Fri Jun 24 16:47:30 2011
    Please let us know how to fix this error.
    Thanks
    Praveen

    Hi Praveen,
    Seems the issue is with the rdf. Check whether all the parameters are passed correctly.
    REP-1401: '': Fatal PL/SQL error occurred.

  • Error while running the financial report in the workspace.

    Hi,
    Im getting the below error while running the financial report in the workspace in HTML mode.
    *"Required application module reporting.HRRunDlg is not configured. Please contact your administrator".*
    And im not able to login to the Hyperion Financial Reporting as well.. i get the below error
    *"You are not authorized to use this functionality. Contact your administrator"*
    Can someone let me know how to resolve this error.

    You don't mention the version, what app server or web server you are using, etc.. That information might be helpful, but in general, you can try the following:
    1. Make sure you have gone through the FR Web App deployment steps and verify the settings entered in the Config Tool.
    2. For version 11.1.1.x and 9.3.1.x, try opening the report in FR Studio and running it via the FR Studio Print Preview (*bold*not*bold* Web Preview.) If the report runs/processes, then the back-end FR Services are functioning and the issue is confined to the web interface. Verify the FR Web App is up and listening on the designated port (8200, by default), check the FR Web App logs and the App Server (WebLogic, WebSphere, Tomcat, OAS) logs for errors/issues.
    If the report fails to process in FR Studio Print Preview, then there is a problem with the FR Reporting Server Service. Check to make sure the service is up/functioning and check the FR Report Server logs for errors.
    3. Test access to other FR functionality in workspace (ex: Files->Preferences->Financial Reporting or Explore->Tools->Database Connection Manager?) If these don't work, then try to connect to the following URLs:
    http://workspaceServer:19000/hr/status.jsp
    http://frWebAppServer:8200/hr/status.jsp
    Note: The URLs above assume standard/default ports. You may need to adjust them for your environment.
    If the first URL fails, but the second URL works, there is a problem with the HTTP redirect settings on the Web Server (Apache, IIS, etc.) Run through the Workspace deployment and make sure the Web Server Config settings point to the right ports/servers.

Maybe you are looking for