When running the workflow background process for drop shipment order, sale order line's status gets automtically closed instead of awaiting shipping

Hello friends,
I am created a drop shipment order with all the setups done . now i have booked the sale order as source type external. but when i run the workflow background process , after completing the report when i check the sale order line status it changes to "closed" instead of "awaiting shipping".
Plz guide me if i have missed something in the setups.
thanks,
Sachin

Hi Sachin,
pls check the below notes from MOS
Drop Ship Sales Order Cycle In Order Management (Doc ID 749139.1)
Vision Demo - How To Create A Drop Ship Sales Order/Purchase Order (Doc ID 1060343.1)
Thanks
-Arif.

Similar Messages

  • When will Apple allow background processes for the iPhone?

    Can't find a suitable subforum so I'll post it here, please refer me to the correct Apple forum otherwise.
    When will Apple allow background processes for the iPhone?
    When will Apple allow Alerts from 3rd party apps?
    Even my first Palm Pilot allowed developers to use Alert beeps.
    Why is Apple crippling the iPhone?
    If they continue this, Android will be the winner.
    Or will the next SDK allow this?

    Background processing, simply won't. They already said they won't and explained why.
    However, they are currently adding "Push" ability to developers (soon). Originally they did say they were shooting for Sept (but obviously that has passed). Nobody can say "why" it is late or when it will come. Just know it is coming.
    Push in case you don't know will let a service (one service) run in the background that apple makes for the phone. that service will ping apple's servers. Apps that want to "run" in the background have to register with that service thus lets say AIM is on your phone, you send a message and close...somebody responds. AIM's servers will send notification to the push service...then the phone will alert you of a notification in the AIM app, you open (thus starts the app again) and it gets the message.

  • Calling Workflow background process' explicitly in pl/sql code

    Hi All,
    We have a requirement where we have to call the 'Workflow background process' explicitly in pl/sql code.
    What we want is that we are having some request that runs via a concurrent program, but before that request completes we want to put that on wait and run the 'Workflow background process' explicitly in the code itself (user need not go and manually run it).
    Can anyone please advice me how do I do this in a PL/SQL code that is called via a concurrent program.
    Regards,
    Shruti

    Pl post details of OS, database and EBS versions.
    One option is to use the FND_SUBMIT API
    Most Commonly Used FND APIs in APPS Customizations [ID 221549.1]
    Sample Code to Call Customer Interface RACUST Program using FND_SUBMIT Api in 11i and R12 [ID 429278.1]
    https://forums.oracle.com/forums/search.jspa?threadID=&q=FND_SUBMIT&objID=c3&dateRange=all&userID=&numResults=15
    HTH
    Srini

  • Errors were found when compiling the workflow. The workflow files were saved but cannot be run.

    Greetings All,
    I am having issues with a SharePoint Designer workflow.  This is a SharePoint 2013 environment, I'm using SharePoint Designer 2013 and working on a SharePoint 2010 workflow.  I'm developing this as a SharePoint 2010 workflow because I need to do
    impersonation.
    The environment and workflow have been running, in the past week, without issue.  I went to add a couple steps and now I cannot publish the workflow.  While in SharePoint Designer, I receive the error:
    "Errors were found when compiling the workflow.  The workflow files were saved but cannot be run."  When I click the Advanced button on the error dialog, the message is "Unexpected error on server associating the workflow." 
    That is all the error information I have available; nothing is in the log files.
    I have investigated this error and tried the following:
    Cleared the SharePoint Designer cache.
    The WebApp.UserDefinedWorkflowMaximumComplexity was at 7000 so I increased it to 10000.  Restarted the servers (which may not have been necessary) and tried again receiving the same error.  I then increased it to 30000 with the same error result.
    Since this is a large workflow, I tried created a workflow with a single action, write to workflow log, with the same error results.
    I reboot the servers and try again and now I can publish the small test workflow but not the original.  However, neither will run.  When I attempt to manually run the small test workflow on an item, I get an error: "Sorry something went wrong.
    An unexpected error occurs.  I checked the log files for the correlation id and nothing, nothing was logged for the error. ~arg~
    Also, now no workflows can be published in this web app.  Not just the one I was working on but none of them!
    Does anyone have a clue what has happened to the SharePoint 2010 workflow service?  Or some suggestions for me to try?
    Thank you in advance for your help!
    Bob Mixon

    try these links:
    http://sp2013.pro/2013/04/solution-errors-were-found-when-compiling-the-workflow-the-workflow-files-were-saved-but-cannot-be-run-cannot-set-unknown-member/
    http://code2care.org/pages/sharepoint-errors-were-found-when-compiling-the-workflow-the-workflow-files-were-saved-but-cannot-be-run/
    http://sharepoint.stackexchange.com/questions/119909/sharepoint-designer-error-errors-were-found-when-compiling-the-workflow
    http://stackoverflow.com/questions/26413125/errors-were-found-when-compiling-the-workflow-in-sharepoint-2013
    Hi Sagar,
    I appreciate it but if you see my original post, this is a SharePoint 2010 workflow that cannot be published; which has now caused all SharePoint 2010 workflows in the same web app to error.
    Your first link is specific to SharePoint 2013 workflows.
    Your second link refers to the UserDefinedWorkflowMaximumComplexity.  If you read my original post, I've already tried this and I've tried to publish a small (single activity) workflow.
    Your third link also refers to large workflows with many approval activities.  My workflow doesn't contain any approval activities.
    And you fourth link refers to 2013 workflows not 2010.
    My issue is with publishing and running a SharePoint 2010 workflow in SharePoint 2013.
    Thank you...

  • Error message when running the FSPCCURR - PS/Fin MultiCurrency Process

    error message when running the FSPCCURR - PS/Fin MultiCurrency Process
    =====================================================
    2011-03-21-17.21.39.660000 INFO(5870,1) PI(785156) Program(FSPCGLMC) GL MultiCurrency processing has begun.
    2011-03-21-17.21.40.820000 INFO(5870,4) PI(785156) Program(FSPCSTEP) Beginning processing, Step CURPER in Group NONREVAL for Business Unit NAMER.
    2011-03-21-17.30.14.520000 INFO(5870,4) PI(785156) Program(FSPCSTEP) Beginning processing, Step USD_USD in Group NONREVAL for Business Unit NAMER.
    2011-03-21-17.30.53.000000 SEVERE ERROR IN PGM:(5870,58) PI(785156) Program(FSPCPROC) Edit journal fails for Business Unit NAMER and Step USD_USD.

    Hi 841037,
    We are facing this same issue in our environment. We are on FSCM 9.1 bundle #24.Please let me know how you resolved this issue at your end. Any help or pointers regarding this issue is highly appreciated. Thanks.

  • How to get Basic salary amount in the Housing formula to calculate the housing value as I used the DBI (NICDP_EMPLOYEE_BASIC_SALARY_AMOUNT_ASG_ENTRY_VALUE) but when run the Quick pay for the housing element alone result come 0, How to get Basic salary amo

    How to get Basic salary amount in the Housing formula to calculate the housing value as I used the DBI (NICDP_EMPLOYEE_BASIC_SALARY_AMOUNT_ASG_ENTRY_VALUE) but when run the Quick pay for the housing element alone result come 0, How to get Basic salary amount in the Housing formula to calculate the housing value as I used the DBI (NICDP_EMPLOYEE_BASIC_SALARY_AMOUNT_ASG_ENTRY_VALUE) but when run the Quick pay for the housing element alone result come 0

    Hi,
    Is your formula attached to basic salary element or some other element? You need to make sure that basic salary element has some value and is processed before this formula is called. Are you able to see value for basic salary element after payroll run?
    Regards,
    Pawan

  • Exception when run the link for exchangeProfile.

    Hi all:
           It is found that exchangeProfile service is not installed or not deployed on NW at least, when I check through visual admin.  exchangeProfile, IntegrationServices, ExchangeDirectory, ExchangeRepository are not deployed services, 
          When run  http://exxpi:500000/exchangeProfile, the page shows and I can maintain Connectoin parameter, and can import exchangeProfile file, but after that, when try show exchangeProfile by refresh the screen, nothing shows. (I don't know if it is a problem)
          but when run the link.
    http://exxpi:500000/webdynpro/dispatcher/sap.com/com.sap.xi.exprofui/XIProfileApp.
    exceptions come up.
    com.sap.tc.webdynpro.services.sal.core.DispatcherException: The requested deployable object 'sap.com/com.sap.xi.exprofui' and application 'XIProfileApp' are not deployed on the server. Please check the used URL for typos.
         at com.sap.tc.webdynpro.clientserver.session.RequestManager.getApplicationDeployableObjectPart(RequestManager.java:383)
         at com.sap.tc.webdynpro.clientserver.session.RequestManager.initTask(RequestManager.java:317)
         at com.sap.tc.webdynpro.clientserver.session.RequestManager.doProcessing(RequestManager.java:143)
         at com.sap.tc.webdynpro.serverimpl.defaultimpl.DispatcherServlet.doContent(DispatcherServlet.java:62)
         at com.sap.tc.webdynpro.serverimpl.defaultimpl.DispatcherServlet.doGet(DispatcherServlet.java:46)
         at javax.servlet.http.HttpServlet.service(HttpServlet.java:740)
         at javax.servlet.http.HttpServlet.service(HttpServlet.java:853)
         at com.sap.engine.services.servlets_jsp.server.HttpHandlerImpl.runServlet(HttpHandlerImpl.java:390)
         at com.sap.engine.services.servlets_jsp.server.HttpHandlerImpl.handleRequest(HttpHandlerImpl.java:264)
         at com.sap.engine.services.httpserver.server.RequestAnalizer.startServlet(RequestAnalizer.java:347)
         at com.sap.engine.services.httpserver.server.RequestAnalizer.startServlet(RequestAnalizer.java:325)
         at com.sap.engine.services.httpserver.server.RequestAnalizer.invokeWebContainer(RequestAnalizer.java:887)
         at com.sap.engine.services.httpserver.server.RequestAnalizer.handle(RequestAnalizer.java:241)
         at com.sap.engine.services.httpserver.server.Client.handle(Client.java:92)
         at com.sap.engine.services.httpserver.server.Processor.request(Processor.java:148)
         at com.sap.engine.core.service630.context.cluster.session.ApplicationSessionMessageListener.process(ApplicationSessionMessageListener.java:33)
         at com.sap.engine.core.cluster.impl6.session.MessageRunner.run(MessageRunner.java:41)
         at com.sap.engine.core.thread.impl3.ActionObject.run(ActionObject.java:37)
         at java.security.AccessController.doPrivileged(Native Method)
         at com.sap.engine.core.thread.impl3.SingleThread.execute(SingleThread.java:100)
         at com.sap.engine.core.thread.impl3.SingleThread.run(SingleThread.java:170)
    Caused by: com.sap.tc.webdynpro.services.exceptions.WDRuntimeException: Failed to create deployable object 'sap.com/com.sap.xi.exprofui' since it is not a Web Dynpro object.
         at com.sap.tc.webdynpro.serverimpl.core.deployment.AbstractDeployableObject.<init>(AbstractDeployableObject.java:106)
         at com.sap.tc.webdynpro.serverimpl.wdc.deployment.DeployableObject.<init>(DeployableObject.java:56)
         at com.sap.tc.webdynpro.serverimpl.wdc.deployment.DeployableObjectFactory.getDeployableObject(DeployableObjectFactory.java:95)
         at com.sap.tc.webdynpro.services.sal.deployment.core.DeployableObjectInternal.getDeployableObjectInternal(DeployableObjectInternal.java:34)
         at com.sap.tc.webdynpro.clientserver.session.RequestManager.getApplicationDeployableObjectPart(RequestManager.java:380)
    What 's more , LCRSAPRFC, SAPSLDAPI, connection cann't be found under SM59 .
    Could you please tell me where the problem is .   thank you very much !!!

    please help close this ticket.

  • Getting the below error when running the Baseline.grf for the first time

    I am getting the below error when running the Baseline.grf for the first time.
    Appreciate your support in resolving it.
    Error below:
    INFO [main] - *** CloverETL framework/transformation graph, (c) 2002-2012 Javlin a.s, released under GNU Lesser General Public License ***
    INFO [main] - Running with CloverETL library version 3.2.1 build#63 compiled 04/01/2012 12:53:21
    INFO [main] - Running on 4 CPU(s), OS Windows 7, architecture amd64, Java version 1.6.0_20, max available memory for JVM 901120 KB
    INFO [main] - Loading default properties from: defaultProperties
    INFO [main] - Graph definition file: graph/Baseline.grf
    INFO [main] - Graph revision: 1.114 Modified by: mkressirer Modified: Thu Apr 12 13:27:18 EDT 2012
    INFO [main] - Checking graph configuration...
    INFO [main] - Graph configuration is valid.
    INFO [main] - Graph initialization (Baseline)
    INFO [main] - [Clover] Initializing phase: 0
    INFO [main] - [Clover] phase: 0 initialized successfully.
    INFO [main] - register MBean with name:org.jetel.graph.runtime:type=CLOVERJMX_1306871483270_0
    INFO [WatchDog] - Starting up all nodes in phase [0]
    INFO [WatchDog] - Successfully started all nodes in phase!
    INFO [RUN_GRAPH1_0] - Running graph ./graph/InitDataStore.grf in the same instance.
    INFO [RUN_GRAPH1_0] - Checking graph configuration...
    INFO [RUN_GRAPH1_0] - Graph configuration is valid.
    INFO [RUN_GRAPH1_0] - Graph initialization (InitDataStore)
    INFO [RUN_GRAPH1_0] - [Clover] Initializing phase: 0
    WARN [RUN_GRAPH1_0] - WS messenger cleanup failed.
    java.lang.NullPointerException
         at org.apache.axis2.client.Stub.cleanup(Stub.java:134)
         at com.opensys.cloveretl.component.WebServiceClient.free(Unknown Source)
         at org.jetel.graph.Phase.free(Phase.java:487)
         at org.jetel.graph.TransformationGraph.freeResources(TransformationGraph.java:681)
         at org.jetel.graph.TransformationGraph.free(TransformationGraph.java:955)
         at org.jetel.graph.runtime.PrimitiveAuthorityProxy.executeGraph(PrimitiveAuthorityProxy.java:149)
         at org.jetel.component.RunGraph.runGraphThisInstance(RunGraph.java:511)
         at org.jetel.component.RunGraph.runSingleGraph(RunGraph.java:409)
         at org.jetel.component.RunGraph.execute(RunGraph.java:302)
         at org.jetel.graph.Node.run(Node.java:414)
         at java.lang.Thread.run(Thread.java:619)
    WARN [RUN_GRAPH1_0] - Some graphs wasn't executed (because graph "./graph/InitDataStore.grf" finished with error).
    WARN [RUN_GRAPH1_0] - Some graph(s) finished with error.
    ERROR [WatchDog] - Graph execution finished with error
    ERROR [WatchDog] - Node RUN_GRAPH1 finished with status: ERROR caused by: Graph './graph/InitDataStore.grf' failed!
    ERROR [WatchDog] - Node RUN_GRAPH1 error details:
    org.jetel.exception.JetelException: Graph './graph/InitDataStore.grf' failed!
         at org.jetel.component.RunGraph.execute(RunGraph.java:324)
         at org.jetel.graph.Node.run(Node.java:414)
         at java.lang.Thread.run(Thread.java:619)
    INFO [WatchDog] - [Clover] Post-execute phase finalization: 0
    INFO [WatchDog] - [Clover] phase: 0 post-execute finalization successfully.
    INFO [WatchDog] - Execution of phase [0] finished with error - elapsed time(sec): 2
    ERROR [WatchDog] - !!! Phase finished with error - stopping graph run !!!
    INFO [WatchDog] - -----------------------** Summary of Phases execution **---------------------
    INFO [WatchDog] - Phase# Finished Status RunTime(sec) MemoryAllocation(KB)
    INFO [WatchDog] - 0 ERROR 2 20132
    INFO [WatchDog] - ------------------------------** End of Summary **---------------------------
    WARN [exNode_0_1306871483270_RUN_GRAPH1] - Attempt to unregister non-registered thread in the ContextProvider.
    ./graph/InitDataStore.grf: Execution of graph failed! Error during graph initialization: Phase 0 can't be initilized.
    INFO [WatchDog] - WatchDog thread finished - total execution time: 2 (sec)
    INFO [main] - Freeing graph resources.
    ERROR [main] - Execution of graph failed !

    It can't find an Endeca specific class when running via the clover command line utility. Thus, the classpath being set in that shell script is not incorporating the .jar files where the endeca-specific classes are packaged. I would start by adding an line to see what your classpath is set to. There are actually already some lines of shell script in clover that you can uncomment to see what .jars are getting loaded:
    #echo $CLOVER_LIB/*
    for i in $CLOVER_LIB/*.jar $CLOVER_LIB/*.zip; do
         LOCAL_CLASSPATH="$LOCAL_CLASSPATH:$i"
    done;
    #for i in `ls $CLOVER_LIB/*.jar`; do
    #echo $i
    #done;
    You could also echo LOCAL_CLASSPATH to see what is getting set there. At the end of the day, you will need the endeca-specific jars to load which can be found here: /Endeca/Discovery/2.3.0/Integrator/plugins/com.endeca.latitude_1.0.0/*
    HTH,
    Dan
    http://branchbird.com

  • Error in the Informatica when running the DAC load( Prebuilt Analytics)

    Hi All,
    Please help me with the below issue with the informatica i am getting when running the DAC load:
    Below are the details:
    SELECT F0006.MCMCU,F0006.MCSTYL,F0006.MCCO,F0006.MCAN8,F0006.MCDL01,F0006.MCRP06,F0006.MCUPMJ,F0006.MCUPMT,F0006.MCUSER,F0101.ABAN8,F0101.ABLNGP, F0101.ABEFTB,F0101.ABUPMJ,F0101.ABUPMT,F0116.ALAN8,F0116.ALEFTB,F0116.ALADD1,F0116.ALADD2,F0116.ALADD3,F0116.ALADD4,
    F0116.ALADDZ,F0116.ALCTY1,F0116.ALCOUN,F0116.ALADDS,F0116.ALCTR,F0116.ALUPMJ,F0116.ALUPMT,
    CAST(F0006.MCRP08 AS CHAR(10)) AS FLEX_ATTRIB_1_CHAR ,
    CAST(F0006.MCRP10 AS CHAR(10)) AS FLEX_ATTRIB_2_CHAR,
    CAST(F0006.MCRP19 AS CHAR(10)) AS FLEX_ATTRIB_3_CHAR,
    CAST(F0006.MCRP08 AS CHAR(10)) AS FLEX_ATTRIB_4_CHAR,
    CAST(F0006.MCRP13 AS CHAR(10)) AS FLEX_ATTRIB_5_CHAR,
    CAST(F0006.MCRP14 AS CHAR(10)) AS FLEX_ATTRIB_6_CHAR,
    CAST(NULL AS CHAR(10)) AS FLEX_ATTRIB_7_CHAR,
    CAST(F0006.MCRP01 AS CHAR(10)) AS FLEX_ATTRIB_8_CHAR,
    CAST(F0006.MCRP15 AS CHAR(10)) AS FLEX_ATTRIB_9_CHAR,
    CAST(F06.MCRP16 AS CHAR(10)) AS FLEX_ATTRIB_10_CHAR,---------------------------Table name should be F0006
    CAST(F0006.MCRP12 AS CHAR(10)) AS FLEX_ATTRIB_11_CHAR,
    CAST(F0006.MCRP27 AS CHAR(10)) AS FLEX_ATTRIB_12_CHAR,
    CAST(F0006.MCRP21 AS CHAR(10)) AS FLEX_ATTRIB_13_CHAR,
    CAST(F0006.MCRP03 AS CHAR(10)) AS FLEX_ATTRIB_14_CHAR,
    CAST(F0006.MCRP13 AS CHAR(10)) AS FLEX_ATTRIB_15_CHAR,
    CAST(F0006.MCRP23 AS CHAR(10)) AS FLEX_ATTRIB_16_CHAR,
    CAST(F0006.MCRP21 AS CHAR(10)) AS FLEX_ATTRIB_17_CHAR,
    CAST(F0006.MCRP24 AS CHAR(10)) AS FLEX_ATTRIB_18_CHAR,
    CAST(F0006.MCRP19 AS CHAR(10)) AS FLEX_ATTRIB_19_CHAR,
    CAST(NULL AS CHAR(10)) AS FLEX_ATTRIB_20_CHAR,
    CAST(F0006.MCRP12 AS CHAR(10)) AS STATE_REGION,
    CAST(F0006.MCRP04 AS CHAR(10)) AS COUNTRY_REGION,
    '0' AS X_CUSTOM
    FROM F0006
    LEFT OUTER JOIN F0101 ON
    F0101.ABAN8 = F0006.MCAN8
    LEFT OUTER JOIN F0116 ON
    F0116.ALAN8 = F0006.MCAN8 AND
    F0116.ALEFTB=F0101.ABEFTB
    As mentioned in the SQL the table name should be F0006 instead F06, I have checked the Source Qualifier transformation and below is the SQL issued
    SELECT F0006.MCMCU,F0006.MCSTYL,F0006.MCCO,F0006.MCAN8,F0006.MCDL01,F0006.MCRP06,F0006.MCUPMJ,F0006.MCUPMT,F0006.MCUSER,F0101.ABAN8,F0101.ABLNGP, F0101.ABEFTB,F0101.ABUPMJ,F0101.ABUPMT,F0116.ALAN8,F0116.ALEFTB,F0116.ALADD1,F0116.ALADD2,F0116.ALADD3,F0116.ALADD4,
    F0116.ALADDZ,F0116.ALCTY1,F0116.ALCOUN,F0116.ALADDS,F0116.ALCTR,F0116.ALUPMJ,F0116.ALUPMT,
    CAST($$FLEX_ATTRIB_1_CHAR AS CHAR(10)) AS FLEX_ATTRIB_1_CHAR ,
    CAST($$FLEX_ATTRIB_2_CHAR AS CHAR(10)) AS FLEX_ATTRIB_2_CHAR,
    CAST($$FLEX_ATTRIB_3_CHAR AS CHAR(10)) AS FLEX_ATTRIB_3_CHAR,
    CAST($$FLEX_ATTRIB_4_CHAR AS CHAR(10)) AS FLEX_ATTRIB_4_CHAR,
    CAST($$FLEX_ATTRIB_5_CHAR AS CHAR(10)) AS FLEX_ATTRIB_5_CHAR,
    CAST($$FLEX_ATTRIB_6_CHAR AS CHAR(10)) AS FLEX_ATTRIB_6_CHAR,
    CAST($$FLEX_ATTRIB_7_CHAR AS CHAR(10)) AS FLEX_ATTRIB_7_CHAR,
    CAST($$FLEX_ATTRIB_8_CHAR AS CHAR(10)) AS FLEX_ATTRIB_8_CHAR,
    CAST($$FLEX_ATTRIB_9_CHAR AS CHAR(10)) AS FLEX_ATTRIB_9_CHAR,
    CAST($$FLEX_ATTRIB_10_CHAR AS CHAR(10)) AS FLEX_ATTRIB_10_CHAR,
    CAST($$FLEX_ATTRIB_11_CHAR AS CHAR(10)) AS FLEX_ATTRIB_11_CHAR,
    CAST($$FLEX_ATTRIB_12_CHAR AS CHAR(10)) AS FLEX_ATTRIB_12_CHAR,
    CAST($$FLEX_ATTRIB_13_CHAR AS CHAR(10)) AS FLEX_ATTRIB_13_CHAR,
    CAST($$FLEX_ATTRIB_14_CHAR AS CHAR(10)) AS FLEX_ATTRIB_14_CHAR,
    CAST($$FLEX_ATTRIB_15_CHAR AS CHAR(10)) AS FLEX_ATTRIB_15_CHAR,
    CAST($$FLEX_ATTRIB_16_CHAR AS CHAR(10)) AS FLEX_ATTRIB_16_CHAR,
    CAST($$FLEX_ATTRIB_17_CHAR AS CHAR(10)) AS FLEX_ATTRIB_17_CHAR,
    CAST($$FLEX_ATTRIB_18_CHAR AS CHAR(10)) AS FLEX_ATTRIB_18_CHAR,
    CAST($$FLEX_ATTRIB_19_CHAR AS CHAR(10)) AS FLEX_ATTRIB_19_CHAR,
    CAST($$FLEX_ATTRIB_20_CHAR AS CHAR(10)) AS FLEX_ATTRIB_20_CHAR,
    CAST($$STATE_REGION AS CHAR(10)) AS STATE_REGION,
    CAST($$COUNTRY_REGION AS CHAR(10)) AS COUNTRY_REGION,
    '0' AS X_CUSTOM
    FROM F0006
    LEFT OUTER JOIN F0101 ON
    F0101.ABAN8 = F0006.MCAN8
    LEFT OUTER JOIN F0116 ON
    F0116.ALAN8 = F0006.MCAN8 AND
    F0116.ALEFTB=F0101.ABEFTB
    The error code and error message in the workflow monitor says:
    Message Code: VAR_27028
    Message: Use override value [F06.MCRP16] for mapping parameter:[mplt_BC_SDE_JDE_InternalOrganization_BusinessUnits.$$FLEX_ATTRIB_10_CHAR].
    Some how it is overridng all the values so please let me know what i can do.
    Thanks in Advance

    Oracle Support

  • Errors were found when compiling the workflow

    My company has consolodated many SharePoint sites into one with many subsites to save money. I ported my existing libraries from theold site to the new site (Same version of SP). The workflows did not go with the libraries, as expected. I re-created each
    workflow, and every time have gotten the same error message: "Errors were found when compiling the workflow. The workflow files were saved but cannot run."
    When I click Advanced I see some variation of the following:
    (-1, -1) Compilation failed. Could not find file 'C:\Users\TEMP.*domain*\AppData\Local\Temp\ **and then a different .dll file every time'
    I have not seen any other examples of this online. For some, creating a new task and history list for the workflow allowed it to compile, but not always.

    Hi,
    According to your post, my understanding is that Errors are found when compiling the workflow.
    I recommend that you can check whether the file exists under the path 'C:\Users\TEMP.*domain*\AppData\Local\Temp\”.
    If it exists, you can create a silmple workflow to check whether it works.
    If it does work, you can add executionTimeout property in web.config file to increase the timeout interval(Make a copy of the web.config file before editing anything).
    For more information, please refer to:
    Manjuke's Blog: Fixed: SharePoint Designer Error - Unexpected error on server associating the workflow
    SharePoint Designer 2010 Errors were found when compiling the workflow. The workflow files were saved but cannot be run. Unexpected error on server associating the workflow.
    Best Regards,
    Linda Li
    Linda Li
    TechNet Community Support

  • Getting Error when running iExpense Workflow

    Hi all,
    When I am running The Workflow Its giving me one error during start of the Process.
    Error is :
    ORA-20001: Oracle error -20001: ORA-20001: -: While executing SQL in profile FND_INIT_SQL:begin mo_global.init; end; has been detected in FND_GLOBAL.INITIALIZE.
    Can any one give any update why this error will give .
    Why this is giving during the start of a process?

    This indicates that the SQL statement in the FND_INIT_SQL profile option has possible syntax errors. Pl see if the solution in MOS Doc 274791.1 (While Executing Sql In Profile Fnd_Init_Sql:Begin Mo_Global.Init; Fa_Security.Se ) can help
    HTH
    Srini

  • I've tried to install flash player several different times ans each time i get a connection error message.It downloads fine and when i run the file to start install,it installs up to 5% and then i get the connection error message.Can someone please help m

    I've tried to download the flash player several different times and each time i get a connection error message.It downloads fine and when i run the file to start install, it installs up to 5% and then i get the connection error message. I've tried disabling my antivirus software, closing my browser for install and nothing.Can someone please help me? I'm using Firefox.

    Hi!
    I had the exact same issue, being on a mac. If you are on a mac and the connection error message occurs, then use this link http://fpdownload.macromedia.com/pub/flashplayer/latest/help/install_flash_player_osx.dmg
    It allows you to download it offline, which is what I used.
    Hope I was help!
    -Haroon

  • Core dump when running the Proc Application

    I have client that has decided to upgrade from Oracle 10g to Oracle11g version. Presently the client code is compiled with Oracle version 11.1.0.7. We have tuxedo version as 9.0 patch02. When running the ProC application, I am getting the core dump. The stack trace for dump is as follows :-
    core 'core' of 7784: bp_Customer -C dom=KenanFX -g 5 -i 225 -u dsesun10 -U /users/denver/pc
    ffffffff6e8d9bbc kill (2, ffffffff7ffe002c, 1, ffffffff7de3b9a0, ffffffff7ffe0028, ffffffff7e10b5a0) + 8
    ffffffff7d27b1f4 skgesigCrash (ffffffff7ffe09a8, ffffffff7e10a070, 1a0c00, ffffffff7dfdbc40, d60a7c, 1) + 34
    ffffffff7d27b81c skgesig_sigactionHandler (ffffffff7d6fb9a0, ffffffff7ffe1800, ffffffff7ffe0990, ffffffff7e10b578, ffffffff7ffe0998, ffffffff7ffe09a8) + dc
    ffffffff6e8d62e0 __sighndlr (b, ffffffff7ffe1800, ffffffff7ffe1520, ffffffff7d27b740, 0, a) + c
    ffffffff6e8c9e44 call_user_handler (ffffffff75f00200, ffffffff75f00200, ffffffff7ffe1520, 8, 0, 0) + 3e0
    ffffffff6e8ca03c sigacthandler (0, ffffffff7ffe1800, ffffffff7ffe1520, ffffffff75f00200, 0, ffffffff6ea3c000) + 54
    --- called from signal handler with signal 0 (SIGEXIT) ---
    ffffffff7c24bb24 sqlrlc (ffffffff7e0f9fc0, 0, 60, c0, 4, 8) + 4
    ffffffff7c253594 sqlbrl (ffffffff7e0f9fc0, 1004bc630, 1004bc658, 1004bc5d0, ffffffff7ffe1b30, 2) + 114
    ffffffff7c2745ec sqlhvdsc (1004bc5c0, ffffffff7e0f9fc0, 8, ffffffff7fff27a0, 0, 1d676b0) + ac
    ffffffff7c274e68 sqlshv (c, 0, e, 0, f, 1c) + 128
    ffffffff7c25bd8c sqlsel (ffffffff7fff27a0, 1002d0850, 1002d0d80, 1, ffffffff7e0f9fc0, ffffffff7dd09d70) + 38c
    ffffffff7c24ed18 sqlcmex (1, ffffffff7ffe1e80, 0, c, 1002d0850, 0) + 278
    ffffffff7c24f724 sqlcxt (0, ffffffff74fd3800, ffffffff7fff27a0, ffffffff74e5d3e4, 16400, 0) + 44
    ffffffff74c65aec selectCMF_XIDDB (788, 16450, 2, ffffffff74fbb978, ffffffff7fff4344, ffffffff7971de60) + f14
    ffffffff79f5743c bp_AccountFind (0, 0, 1002b6118, 1002b6118, 1002b6118, 1002b6118) + 137c
    000000010001748c commonServiceWrapper (30, 0, 558, 1, 100140428, ffffffff6fa08560) + cac
    000000010001d1a4 I_AccountFind (100188220, 12336c, 2e60, 100186b80, ffffffff7fffa440, ffffffff6fa08560) + ec
    ffffffff7f25ea34 _tmsvcdsp (100186b80, 0, 1001f7b60, 800, 100186b80, 1400) + 11ac
    ffffffff7f28241c _tmrunserver (2bb4, 0, 100186b80, 10017c480, 10017d5a0, 0) + 11ac
    ffffffff7f25d47c _tmstartserver (1, 2c00, 100144c90, 800, 10017ebe0, 1001444e0) + 1ac
    0000000100014e4c main (1b, ffffffff7fffab18, ffffffff7fffabf8, ffffffff6e84b8e0, ffffffff75b05200, ffffffff75f00200) + 14
    0000000100014d9c _start (0, 0, 0, 0, 0, 0) + 17c
    Can you please help what is causing problem in the applications. Thanks in advanced.

    This forum is about C programming in general, and about using Oracle Studio C in particular.
    Your question seems to be about a database application that now crashes when run on an updated version of Oracle database.
    You mention "Proc" and ProC". If you are referring to the Pro*C compiler, that would also be a database question, since the Pro*C compiler is not related to Oracle Studio or Oracle Studio C.
    You are more likely to find a helpful answer in a database programming forum. Start here:
    https://forums.oracle.com/forums/category.jspa?categoryID=18

  • Where to put break point when debugging the inbound IDOC processing

    Hi, Dear Experts,
    If IDOC has error and want to debug, which program or function module  to put break point when debugging the inbound IDOC processing
    Thank you so much!
    Helen

    It depends on if you have the custom FM or standard FM...Is it MM invoice or FI invoice? ... You can find out your FM by going to partner profile (WE20) for your sender partner and partner function.. Drill down to your partner and the message type and find the inbound process code.. Double clicking on the process code will help you find the FM...
    If you don't have access to WE20, You can also put BP into any of the IDOC_INPUT_INVOIC* FM and see if it is getting triggered (assuming your IDOC is standard FM)...

  • RE: my input fields does not display when running the page

    my input fields does not display when running the page
    why is that so?

    Hi,
    Can you send the HTML code for us?
    Afonso

Maybe you are looking for

  • N82 Applications folder missing

    Hi All. I am having a problem with my N82 Applications folder. The applications folder in my phone was deleted and everything that was inside it was thrown into the main menu. I created a new applications folder and put everything back inside, but ev

  • Silverlight 5 binding on a property with logic in its setter does not work as expected when debug is attached

    My problem is pretty easy to reproduce. I created a project from scratch with a view model. As you can see in the setter of "Age" property I have a simple logic.     public class MainViewModel : INotifyPropertyChanged             public event Propert

  • Why is Illustrator CS4 so ******* sluggish in OSX?

    I always used Illustrator on Windows XP but have been forced to work on Illustrator on OSX (Imac dual core 3 Ghz with 4GB of ram OSX 10.5.8) at work for the last year. I like OSX but Illustrator performance is quite bad compared to what I'm used to o

  • How to install GLUI for openGL?

    Hi, I want to create a GUI for some simple drawings and transformations using openGL. Therefor I need some widgets like buttons, checkboxes etc. Because I don't want to draw those on my own I wanted to use the GLUI library. I downloaded the source an

  • Sum of all order amts

    I want to be able to find the sum of all order amts from an itab that I read. The total needs to be 12 digits left filled with zero and decimal dropped data: totalorderamt(12) type n value 0. in the loop should it be totalorderamt = totalorderamt + t