Batch Compilation Problem(Migration)

Hiiiiiiiiiii Gurus..
I am on Migration Project...... and for batch compilation of Reports do any one give me the Script.. Because whatever I have is not working.
I have no errors but also I can't get the error file,log file,output file.
(Migration is from 5 to 10g)
Can any one help me.........
Regards Madhav

Here is what I use on windows (file is called genforms.bat):
echo "Generating PLSQL libraries"
echo "Generating abc10.pll"
ifcmp90.exe module=abc10.pll userid=hr/hr@db module_type=library logon=y batch=n build=y compile_all=y
echo "Generating abc20.pll"
ifcmp90.exe module=abc20.pll userid=hr/hr@db module_type=library logon=y batch=n build=y compile_all=y
echo "Generating abc30.pll"
ifcmp90.exe module=abc30.pll userid=hr/hr@db module_type=library logon=y batch=n build=y compile_all=y
echo "Generating menus"
echo "Generating abc10.mmb"
ifcmp90.exe module=abc10.mmb userid=hr/hr@db module_type=menu logon=y batch=n build=y compile_all=y
echo "Generating abc20.mmb"
ifcmp90.exe module=abc20.mmb userid=hr/hr@db module_type=menu logon=y batch=n build=y compile_all=y
echo "Generating abc30.mmb"
ifcmp90.exe module=abc30.mmb userid=hr/hr@db module_type=menu logon=y batch=n build=y compile_all=y
echo "Generating forms"
echo "Generating abc101.fmb"
ifcmp90.exe module=abc101.fmb userid=hr/hr@db module_type=form logon=y batch=n build=y compile_all=y
echo "Generating abc102.fmb"
ifcmp90.exe module=abc102.fmb userid=hr/hr@db module_type=form logon=y batch=n build=y compile_all=y
echo "Generating abc103.fmb"
ifcmp90.exe module=abc103.fmb userid=hr/hr@db module_type=form logon=y batch=n build=y compile_all=yUsage is:
C:\dev><b>genforms.bat > genforms.log</b>For unix you will have to use (file is called genforms.sh):
echo "Generating PLSQL libraries"
echo "Generating abc10.pll"
ifcmp90 module=abc10.pll userid=hr/hr@db module_type=library logon=y batch=n build=y compile_all=y
echo "Generating abc20.pll"
ifcmp90 module=abc20.pll userid=hr/hr@db module_type=library logon=y batch=n build=y compile_all=y
echo "Generating abc30.pll"
ifcmp90 module=abc30.pll userid=hr/hr@db module_type=library logon=y batch=n build=y compile_all=y
echo "Generating menus"
echo "Generating abc10.mmb"
ifcmp90 module=abc10.mmb userid=hr/hr@db module_type=menu logon=y batch=n build=y compile_all=y
echo "Generating abc20.mmb"
ifcmp90 module=abc20.mmb userid=hr/hr@db module_type=menu logon=y batch=n build=y compile_all=y
echo "Generating abc30.mmb"
ifcmp90 module=abc30.mmb userid=hr/hr@db module_type=menu logon=y batch=n build=y compile_all=y
echo "Generating forms"
echo "Generating abc101.fmb"
ifcmp90 module=abc101.fmb userid=hr/hr@db module_type=form logon=y batch=n build=y compile_all=y
echo "Generating abc102.fmb"
ifcmp90 module=abc102.fmb userid=hr/hr@db module_type=form logon=y batch=n build=y compile_all=y
echo "Generating abc103.fmb"
ifcmp90 module=abc103.fmb userid=hr/hr@db module_type=form logon=y batch=n build=y compile_all=yUsage is:
server:/u1/app/oracle% <b>genforms.sh >> genforms.log</b>Not sure what version you are migrating from, I don't think version 5 of reports exists.

Similar Messages

  • Re: [iPlanet-JATO] sp3 jsp compiler problem

    Weiguo,
    First, Matt is correct, the regular expression tool is perfect for general text
    substitution situations, and as a completely independent tool its use is not
    restricted to migration situations (or file types for that matter).
    Second, I sympathize with the unfortunate trouble you are experiencing due to
    Jasper's (perhaps more strict) compilation, but in what way did the iMT
    automated translation contribute to these inconsistencies that you cited?
    1. Changed the case of the tag attribute to be the same as what's
    defined in tld.
    example: changed OnClick to onClick
    The iMT does not generate any OnClick or onClick clauses per se. In a
    translation situation, the only way "OnClick" would have been introduced was if
    it had been part of the pre-existing project's "extraHTML" (which was written
    by the original customer and just passed through unchanged by the iMT) or if it
    was added manually by the post-migration developer.
    2. Removed attributes which are not defined in tld.
    example: escape attribute only defined in three tags
    but in some pages, it's used although it's not defined as an
    attribute
    of certain tags. The jasper compiler doesn't like it.Can you give soem examples? Is there a definite pattern? Again, this might be
    similar to the OnClick situation described above?
    3. In an end tag, there can't be any space.
    example: </content > doesn't work. </content> works.
    Again, the content tag would never have been generated by the iMT. There was no
    equivalent in the NetDynamics world, so any content tags in your code must have
    been introduced by your developers manually. Its a shame that jasper is so
    particular, but the iMT could not help you out here even if we wanted to. The
    constants that are used by the iMT are defined in
    com.iplanet.moko.jsp.convert.JspConversionConstants. From what I can see, the
    only situation of a closing tag with any space in it is
    public static final String CLOSE_EMPTY_ELEMENT = " />";
    But that should not cause the type of problem you are referring to.
    Mike
    ----- Original Message -----
    From: Matthew Stevens
    Sent: Thursday, September 06, 2001 10:16 AM
    Subject: RE: [iPlanet-JATO] sp3 jsp compiler problem
    Weiguo,
    Others will chime in for sure...I would highly recommend the Regex Tool from
    the iMT 1.1.1 for tackling this type of problem. Mike, Todd and myself have
    posted to the group (even recently) on directions and advantages of creating
    your own RULES (rules file) in XML for arbitary batch processing of source.
    matt
    -----Original Message-----
    From: weiguo.wang@b...
    [mailto:<a href="/group/SunONE-JATO/post?protectID=125056020108194190033029175101192165174144234026000079108238073194105057099246073154180137239239223019162">weiguo.wang@b...</a>]
    Sent: Thursday, September 06, 2001 12:25 PM
    Subject: [iPlanet-JATO] sp3 jsp compiler problem
    Matt/Mike/Todd,
    We are trying to migrate to sp3 right now, but have had a lot of
    issues with the new jasper compiler.
    The following workaround has been employed to solve the issues:
    1. Changed the case of the tag attribute to be the same as what's
    defined in tld.
    example: changed OnClick to onClick
    2. Removed attributes which are not defined in tld.
    example: escape attribute only defined in three tags
    but in some pages, it's used although it's not defined as an
    attribute
    of certain tags. The jasper compiler doesn't like it.
    3. In an end tag, there can't be any space.
    example: </content > doesn't work. </content> works.
    As I see it, we have two options to go about solving this problem:
    1. Write a script which will iterate through all the jsp files and
    call jspc on them. Fix the errors manually when jspc fails. Jspc will
    flag the line number where an error occurs.
    2. Write a utility which scans the jsp files and fix the errors when
    they are encountered. We should define what's an error and how to
    correct it. It's best if we combine this with solution 1 since we
    might miss an error condition.
    Actually, there might be another option, which is seeking help from
    you guys since you have better understanding of JATO and iAS. Can you
    do anything to help us?
    We would be happy to hear your thoughts.
    At last, I would like to suggest modifying the moko tool so that
    these rules are enforced and the generated JSPs work with the new
    compiler. This is for the benefit of any new migration projects.
    Thanks a lot.
    Weiguo
    [email protected]
    Choose from 1000s of job listings!
    [email protected]
    [Non-text portions of this message have been removed]

    Thanks a lot Matt and Mike for your prompt replies.
    I agree completely that iMT doesn't introduce the inconsistencies.
    About the three cases I mentioned, the third one happens only in
    manually created JSPs. So it has nothing to do with iMT. The first
    two are mainly due to the existing HTML code, as you rightly pointed
    out.
    The reason I made the suggestion is since we know that case 1 and 2
    won't pass the japser compiler in sp3, we have to do something about
    it. The best place to do this, in my mind, is iMT. Of course, there
    might be some twists that make it impossible or difficult to do this
    kind of case manipulation or attribute discard.
    Weiguo
    --- In iPlanet-JATO@y..., "Mike Frisino" <Michael.Frisino@S...> wrote:
    Weiguo,
    First, Matt is correct, the regular expression tool is perfect for general text substitution situations, and as a completely independent
    tool its use is not restricted to migration situations (or file types
    for that matter).
    >
    Second, I sympathize with the unfortunate trouble you are experiencing due to Jasper's (perhaps more strict) compilation, but
    in what way did the iMT automated translation contribute to these
    inconsistencies that you cited?
    >
    1. Changed the case of the tag attribute to be the same as what's
    defined in tld.
    example: changed OnClick to onClick
    The iMT does not generate any OnClick or onClick clauses per se. In a translation situation, the only way "OnClick" would have been
    introduced was if it had been part of the pre-existing
    project's "extraHTML" (which was written by the original customer and
    just passed through unchanged by the iMT) or if it was added manually
    by the post-migration developer.
    >
    2. Removed attributes which are not defined in tld.
    example: escape attribute only defined in three tags
    but in some pages, it's used although it's not defined as an
    attribute
    of certain tags. The jasper compiler doesn't like it.Can you give soem examples? Is there a definite pattern? Again, this might be similar to the OnClick situation described above?
    >
    >
    3. In an end tag, there can't be any space.
    example: </content > doesn't work. </content> works.
    Again, the content tag would never have been generated by the iMT. There was no equivalent in the NetDynamics world, so any content tags
    in your code must have been introduced by your developers manually.
    Its a shame that jasper is so particular, but the iMT could not help
    you out here even if we wanted to. The constants that are used by the
    iMT are defined in
    com.iplanet.moko.jsp.convert.JspConversionConstants. From what I can
    see, the only situation of a closing tag with any space in it is
    public static final String CLOSE_EMPTY_ELEMENT = " />";
    But that should not cause the type of problem you are referring to.
    Mike
    ----- Original Message -----
    From: Matthew Stevens
    Sent: Thursday, September 06, 2001 10:16 AM
    Subject: RE: [iPlanet-JATO] sp3 jsp compiler problem
    Weiguo,
    Others will chime in for sure...I would highly recommend the Regex Tool from
    the iMT 1.1.1 for tackling this type of problem. Mike, Todd and myself have
    posted to the group (even recently) on directions and advantages of creating
    your own RULES (rules file) in XML for arbitary batch processing of source.
    >
    matt
    -----Original Message-----
    From: weiguo.wang@b...
    [mailto:<a href="/group/SunONE-JATO/post?protectID=125056020108194190033029175101192165174048139046">weiguo.wang@b...</a>]
    Sent: Thursday, September 06, 2001 12:25 PM
    Subject: [iPlanet-JATO] sp3 jsp compiler problem
    Matt/Mike/Todd,
    We are trying to migrate to sp3 right now, but have had a lot of
    issues with the new jasper compiler.
    The following workaround has been employed to solve the issues:
    1. Changed the case of the tag attribute to be the same as
    what's
    defined in tld.
    example: changed OnClick to onClick
    2. Removed attributes which are not defined in tld.
    example: escape attribute only defined in three tags
    but in some pages, it's used although it's not defined as an
    attribute
    of certain tags. The jasper compiler doesn't like it.
    3. In an end tag, there can't be any space.
    example: </content > doesn't work. </content> works.
    As I see it, we have two options to go about solving this problem:
    >>
    1. Write a script which will iterate through all the jsp files and
    call jspc on them. Fix the errors manually when jspc fails. Jspc will
    flag the line number where an error occurs.
    2. Write a utility which scans the jsp files and fix the errors when
    they are encountered. We should define what's an error and how to
    correct it. It's best if we combine this with solution 1 since we
    might miss an error condition.
    Actually, there might be another option, which is seeking help from
    you guys since you have better understanding of JATO and iAS. Can you
    do anything to help us?
    We would be happy to hear your thoughts.
    At last, I would like to suggest modifying the moko tool so that
    these rules are enforced and the generated JSPs work with the new
    compiler. This is for the benefit of any new migration projects.
    Thanks a lot.
    Weiguo
    [email protected]
    Choose from 1000s of job listings!
    [email protected]
    Service.
    >
    >
    >
    [Non-text portions of this message have been removed]

  • Help: Problem migrating to 9052 or 1012

    Hello You Experts,
    I have a BC4J/JSP application originally developed in Jdev 902. It has been in production for a while already, and has been migrated all way through 9034 and 9041 (build 1436). This is a relatively simple application, only BC4J is involved, no Stunts, no UIX or anything else. It works pretty well so far. However, I am having problem migrating it into 10g now. I got the same error (see below) with either Jdev 9052 (build 1618) or 1012 (build 1811). It opens (migrated by the Wizard), and compiles without any error. It actually runs and I have got to the login page. And then it’s throws an NoSuchMethodError exception upon login. My application supports dynamic credentials. The debug output indicates that it could not get the internal connection, though the user connection was successful. Any ideals for this error are greatly appreciated. Thank you very much in advance.
    Following is the stack trace:
    Message: void oracle.jbo.html.DataSourceImpl.(java.lang.String)
    java.lang.NoSuchMethodError: void oracle.jbo.html.DataSourceImpl.(java.lang.String)
         at oracle.jbo.html.jsp.datatags.Utils.createDataSource(Utils.java:185)
         at oracle.jbo.html.jsp.datatags.DataSourceTag.doStartTag(DataSourceTag.java:86)
         at Login.jspService(Login.jsp:61)
         at com.orionserver.http.OrionHttpJspPage.service(OrionHttpJspPage.java:56)
         at oracle.jsp.runtimev2.JspPageTable.service(JspPageTable.java:347)
         at oracle.jsp.runtimev2.JspServlet.internalService(JspServlet.java:509)
         at oracle.jsp.runtimev2.JspServlet.service(JspServlet.java:413)
         at javax.servlet.http.HttpServlet.service(HttpServlet.java:853)
         at com.evermind.server.http.ResourceFilterChain.doFilter(ResourceFilterChain.java:65)
         at oracle.security.jazn.oc4j.JAZNFilter.doFilter(Unknown Source)
         at com.evermind.server.http.ServletRequestDispatcher.invoke(ServletRequestDispatcher.java:649)
         at com.evermind.server.http.ServletRequestDispatcher.forwardInternal(ServletRequestDispatcher.java:322)
         at com.evermind.server.http.HttpRequestHandler.processRequest(HttpRequestHandler.java:790)
         at com.evermind.server.http.HttpRequestHandler.run(HttpRequestHandler.java:270)
         at com.evermind.server.http.HttpRequestHandler.run(HttpRequestHandler.java:112)
         at com.evermind.util.ReleasableResourcePooledExecutor$MyWorker.run(ReleasableResourcePooledExecutor.java:192) at java.lang.Thread.run(Thread.java:534)
    And following is the debug output (excepted to conserve apace):
    [Starting OC4J using the following ports: HTTP=8988, RMI=23891, JMS=9227.]
    C:\Jdev1012\jdev\system10.1.2.0.0.1811\oc4j-config>
    C:\Jdev1012\jdk\bin\javaw.exe -ojvm -XXdebug,quiet,port3096 -classpath C:\Jdev1012\j2ee\home\oc4j.jar;C:\Jdev1012\jdev\lib\jdev-oc4j.jar -Djbo.debugoutput=console -Xverify:none -Ddisable.checkForUpdate=true -Doracle.j2ee.dont.use.memory.archive=true -Doracle.j2ee.http.socket.timeout=500 -Doracle.dms.sensors=NONE -Doc4j.jms.usePersistenceLockFiles=false com.evermind.server.OC4JServer -config C:\Jdev1012\jdev\system10.1.2.0.0.1811\oc4j-config\server.xml
    [waiting for the server to complete its initialization...]
    Debugger connected to local process.
    05/01/31 16:52:18 Auto-deploying file:/C:/Jdev1012/jdev/mywork/LtcopWebApp/jspClients/public_html/ (New server version detected)...
    Ready message received from Oc4jNotifier.
    Embedded OC4J startup time: 5218 ms.
    Target URL -- http://204.156.227.22:8988/ltcop/index.html
    05/01/31 16:52:19 Oracle Application Server Containers for J2EE 10g (10.1.2.0.0) initialized
    05/01/31 16:52:31 Diagnostics: (BC4J Bootstrap) Routing diagnostics to standard output (use -Djbo.debugoutput=silent to remove)
    05/01/31 16:52:31 [00] Diagnostic Properties: Timing:false Functions:false Linecount:true Threshold:6
    05/01/31 16:52:31 [01] BC4J Property jbo.maxpoolcookieage='-1' -->(Configuration) from System Default
    05/01/31 16:52:31 [02] Loading 5.0 IDE classes
    05/01/31 16:52:31 [03] Creating a new pool resource
    05/01/31 16:52:31 [04] BC4JDeployPlatform: LOCAL
    05/01/31 16:52:31 [05] Propertymanager: searching for file and system based properties
    05/01/31 16:52:31 [06] {{ begin Loading BC4J properties
    …….. Cut away to conserve space …….
    05/01/31 16:52:32 [135] }} finished loading BC4J properties
    05/01/31 16:52:32 [136] -----------------------------------------------------------
    05/01/31 16:52:32 Diagnostics: (Properties (re)loaded) Routing diagnostics to standard output (use -Djbo.debugoutput=silent to remove)
    05/01/31 16:52:32 [137] Diagnostic Properties: Timing:false Functions:false Linecount:true Threshold:6
    05/01/31 16:52:32 [138] JavaVMVersion: 10.1.2.1162 dop5
    05/01/31 16:52:32 [139] JavaVMVendor: Oracle Corp.
    05/01/31 16:52:32 [140] JavaVMName: OJVM Client VM
    05/01/31 16:52:32 [141] OperatingSystemName: Windows 2000
    05/01/31 16:52:32 [142] OperatingSystemVersion: 5.0
    05/01/31 16:52:32 [143] OperatingSystemUsername: Duz
    05/01/31 16:52:32 [144] jbo.323.compatible Flag: false, str: false
    05/01/31 16:52:32 [145] jbo.903.compatible Flag: false, str: false
    05/01/31 16:52:32 [146] Loading from bc4j.jpx file
    05/01/31 16:52:32 [147] Loading from individual XML files
    …….. Cut off lots of “Loading from …… Xxx.xml file” entries to conserve space …….
    05/01/31 16:52:36 [248] Using DatabaseTransactionFactory implementation oracle.jbo.server.DatabaseTransactionFactory
    05/01/31 16:52:36 [249] mPCollUsePMgr is false
    05/01/31 16:52:36 [250] ViewObjectImpl.mDefaultMaxRowsPerNode is 70
    05/01/31 16:52:36 [251] ViewObjectImpl.mDefaultMaxActiveNodes is 30
    05/01/31 16:52:36 [252] DBTransactionImpl Max Cursors is 50
    05/01/31 16:52:36 [253] Created root application module: 'componentsPkg.LtcopAppModule'
    05/01/31 16:52:36 [254] Locale is: 'en_US'
    05/01/31 16:52:36 [255] DefaultConnectionStrategy is establishing an application module connection
    05/01/31 16:52:36 [256] Oracle SQLBuilder: Registered driver: oracle.jdbc.driver.OracleDriver
    05/01/31 16:52:36 [257] Creating a new pool resource
    05/01/31 16:52:36 [258] Trying connection/2: url='jdbc:oracle:thin:@204.156.200.100:1521:DB20' info='{user=ltc_test_co1, password=ltcco1, oracle.net.encryption_types_client=( DES40C ), oracle.net.encryption_client=REQUIRED, oracle.net.crypto_checksum_client=REQUIRED, oracle.net.crypto_checksum_types_client=( MD5 )}' ...
    05/01/31 16:52:36 [259] Successfully logged in
    05/01/31 16:52:36 [260] JDBCDriverVersion: 10.1.0.3.0
    05/01/31 16:52:36 [261] DatabaseProductName: Oracle
    05/01/31 16:52:36 [262] DatabaseProductVersion: Oracle9i Enterprise Edition Release 9.2.0.6.0 - Production With the Partitioning, Oracle Label Security, OLAP and Oracle Data Mining options JServer Release 9.2.0.6.0 - Production
    05/01/31 16:52:36 [263] **PCollManager.resolveName** tabName=PS_TXN
    05/01/31 16:52:36 [264] Getting a connection for internal use...
    05/01/31 16:52:36 [265] Creating internal connection...
    05/01/31 16:52:36 [266] Oracle SQLBuilder: Registered driver: oracle.jdbc.driver.OracleDriver
    05/01/31 16:52:36 [267] Creating a new pool resource
    05/01/31 16:52:36 [268] Trying connection/1: url='jdbc:oracle:thin:ltcop/[email protected]:1521:db20'...

    Hi Vishal,
    Hello,
    Unfortunately WLS 6.1 is not supported on Solaris 10. Also as of Nov 14, 2005 WLS 6.1 entered the mature phase and will be no longer supported by BEA.
    http://e-docs.bea.com/wls/certifications/certs_610/overview.html
    Do let me know if you need any assistance in upgrading
    Cheers
    Raj

  • Shell script for batch compilation of forms 10g on AIX 5.3L AS

    Hi All,
    Can anybody provide me the Shell script for batch compilation of forms 10g and reports 10g on AIX 5.3L AS?
    Regards,
    SAM

    Hi Alex,
    I tried with the below script as well as the one you had posted.
    ORACLE_HOME=/opt/oracle/OraHome_3
    export ORACLE_HOME
    TNS_ADMIN=$ORACLE_HOME/network/admin
    export TNS_ADMIN
    LIBPATH=$ORACLE_HOME/lib32:$ORACLE_HOME/jdk/jre/bin:$ORACLE_HOME/jdk/jre/bin/cla
    ssic:$LIBPATH
    export LIBPATH
    cd ../forms
    for i in `ls *.pll`
    do
    echo Compiling Library $i ....
    $ORACLE_HOME/bin/frmcmp module=$i userid=mydbuser/mydbuser@mydb
    batch=yes module_type=library
    compile_all=yes window_state=minimize
    done
    export ORACLE_HOME=/opt/oracle/OraHome_3
    export ORACLE_TERM=vt220
    export LD_LIBRARY_PATH=/opt/oracle/OraHome_3/lib:/opt/oracle/OraHome_3/jdk/jre/l
    ib:/opt/oracle/OraHome_3/jdk/jre/lib/i386:
    cd ../forms
    for i in `ls *.pll`
    do
    echo "Compiling Library $i ...."
    /opt/oracle/OraHome_3/bin/frmcmp module_type=form userid=mydbuser/mydbuser@mydb
    module=$i batch=yes compile_all=no
    window_state=minimize upgrade=no
    done
    echo "PLL Compilation done"
    But there was a same kind of error thst turning up all the time.
    Compiling Library Agf.pll ....
    Forms 10.1 (Form Compiler) Version 10.1.2.0.2 (Production)
    Forms 10.1 (Form Compiler): Release - Production
    Copyright (c) 1982, 2005, Oracle. All rights reserved.
    Oracle Database 10g Enterprise Edition Release 10.2.0.1.0 - Production
    With the Partitioning, OLAP and Data Mining options
    PL/SQL Version 10.1.0.4.2 (Production)
    Oracle Procedure Builder V10.1.2.0.2 - Production
    Oracle Virtual Graphics System Version 10.1.2.0.0 (Production)
    Oracle Multimedia Version 10.1.2.0.2 (Production)
    Oracle Tools Integration Version 10.1.2.0.2 (Production)
    Oracle Tools Common Area Version 10.1.2.0.2
    Oracle CORE 10.1.0.4.0 Production
    FRM-10043: Cannot open file.
    Form not created
    I hence updated the permissions on the pll as below
    -rwxrwxrwx 1 oracle oinstall 335872 May 19 16:31 Agf.pll
    But the problem is still persisting.
    My environment details are as below.
    I am working on Win XP machine. Connected to my AS via telnet and xmanager. I have set my DISPLAY to my local IP.
    Is there any thing more that I need to do? If so then let me know.
    Regards,
    SAM

  • Compiling problem in oracle 11g environment

    Hello mates,
    We have recently migrated from oracle10g to oracle11g. we have lot of pro*c and forms programs.
    my requirement is to compile all those pro*c and form programs in 11g.
    for compiling pro*c programs we have compilation scripts. these compilation scripts are prepared
    based on oracle10g. pro*c programs are compiling fine by using this compilation scripts.
    after migrated to 11g, ihave used same 10g compilation scripts to compile pro*c programs.
    1.while compiling the programs first time, i got these errors
    /oracle/app/product/11.2.0.3_cli/lib32/libsql10.a: No such file or directory
    /oracle/app/product/11.2.0.3_cli/rdbms/lib32/kpudfo.o: No such file or directory
    /oracle/app/product/11.2.0.3_cli/lib32/libpls10.a: No such file or directory
    /oracle/app/product/11.2.0.3_cli/lib32/libpls10.a: No such file or directory
    /oracle/app/product/11.2.0.3_cli/lib32/libpls10.a: No such file or directory
    so i have replace all libsql10.a,libpls10.a,libpls10.a,libpls10.a to libsql11.a,libpls11.a,libpls11.a,libpls11.a
    2.then these errors got resolved but second time compilation it shown below error.
    /oracle/app/product/11.2.0.3_cli/rdbms/lib/kpudfo.o: No such file or directory
    so i have removed kpudfo.o file from compilation script.
    3. i have compiled third time then it shown diffrent error as shown below
    ld: fatal: library -lnapt: not found
    ld: fatal: file /oracle/app/product/11.2.0.3_cli/lib/libclntsh.so: wrong ELF class: ELFCLASS64
    ld: fatal: file /oracle/app/product/11.2.0.3_cli/rdbms/lib/cdf.o: wrong ELF class: ELFCLASS64
    ld: fatal: File processing errors. No output written to ./ebsparam
    i have changed script
    "/usr/local/bin/gcc -m32 -g -DSOLARIS -DSOLARIS2 -I$HOME/include"
    to
    "/usr/local/bin/gcc -m64 -g -DSOLARIS -DSOLARIS2 -I$HOME/include"
    4. then i have compiled again then it shown error as below
    ld: fatal: file /usr18/SIR02551/mydomain/BD/obj/ebsparam.o: wrong ELF class: ELFCLASS32
    ld: fatal: File processing errors. No output written to ./ebsparam
    collect2: ld returned 1 exit status
    because of 32 bit problem i have changed script to 32 to 64. but now it is showing this error
    what is the problem i am not able to understand.
    please help on this
    Thanks
    Edited by: ramadurga.v on Jan 25, 2013 3:10 PM
    Edited by: ramadurga.v on Jan 25, 2013 3:26 PM

    Pl do not post duplicates -
    Compilaton problem in 11g environment
    Compilation problem in 11g environment
    Compilation problem in 11g environment

  • Problems migrating a playlist into iTunes...

    Hi folks,
    I am having very frustrating problems migrating some music into my iTunes library and making it into a playlist which will display the tracks in the way that I want. I might not know some technical terms here, but I will try to be as clear and concise as possible!
    I have some music (the 'Glee' TV show soundtrack)that I downloaded elsewhere (i.e not from iTunes), and I just want to move it into an iTunes playlist, to display the tracks in the 'standard' way- that is, all in one 'block', numbered and sequenced in the correct running order.
    So all I did is exactly what I have done before: created a new playlist from the iTunes 'file' menu, given the playlist a name, then dragged and dropped each track from the folder that I downloaded the music into originally. So in this case- I dragged and dropped each track from it's location in a folder called 'J Girl music', which is where I download music for my girlfriend to.
    Now, I don't know whether the fact that the soundtrack is by a bunch of different artists (rather than just one) is part of the problem here, but what I get when I drag and drop into the iTunes 'Glee' playlist (using 'as list' as my 'view' option) is the tracks in the playlist displayed in 'clusters'.
    So the first two tracks appear in one separate, delineated box then the next two in a separate, delineated box and so on (kind of like having a number of individual albums within the playlist)- and each 'block' has its own separate album art displayed to the left. I hope people can visualise what I mean here- things seem easy to explain until you try to put them into words!
    So really all I want is for the 'Glee' playlist to be the same as my other ones-the tracks in one 'block' with no boxes separating them and sequenced in the correct order.
    I have tried a number of things to fix this: I have right-clicked on tracks (both from the playlist and the library) gone into 'info' and numbered them e.g 1 of 18, 2 of 18, etc. I have changed the info about artist to the heading 'various artists', I have tried checking the box that says 'part of a compilation', but no matter what I seem to do tracks 3,4,5 etc will not 'jump' and sit themselves directly underneath tracks 1 and 2- the 'boxes' dividing them remain!
    I hope I have explained this problem clearly (I really tried to) and I would be very appreciative of any help a forum member or members can provide. Thanks in advance.

    Hi folks,
    I am having very frustrating problems migrating some music into my iTunes library and making it into a playlist which will display the tracks in the way that I want. I might not know some technical terms here, but I will try to be as clear and concise as possible!
    I have some music (the 'Glee' TV show soundtrack)that I downloaded elsewhere (i.e not from iTunes), and I just want to move it into an iTunes playlist, to display the tracks in the 'standard' way- that is, all in one 'block', numbered and sequenced in the correct running order.
    So all I did is exactly what I have done before: created a new playlist from the iTunes 'file' menu, given the playlist a name, then dragged and dropped each track from the folder that I downloaded the music into originally. So in this case- I dragged and dropped each track from it's location in a folder called 'J Girl music', which is where I download music for my girlfriend to.
    Now, I don't know whether the fact that the soundtrack is by a bunch of different artists (rather than just one) is part of the problem here, but what I get when I drag and drop into the iTunes 'Glee' playlist (using 'as list' as my 'view' option) is the tracks in the playlist displayed in 'clusters'.
    So the first two tracks appear in one separate, delineated box then the next two in a separate, delineated box and so on (kind of like having a number of individual albums within the playlist)- and each 'block' has its own separate album art displayed to the left. I hope people can visualise what I mean here- things seem easy to explain until you try to put them into words!
    So really all I want is for the 'Glee' playlist to be the same as my other ones-the tracks in one 'block' with no boxes separating them and sequenced in the correct order.
    I have tried a number of things to fix this: I have right-clicked on tracks (both from the playlist and the library) gone into 'info' and numbered them e.g 1 of 18, 2 of 18, etc. I have changed the info about artist to the heading 'various artists', I have tried checking the box that says 'part of a compilation', but no matter what I seem to do tracks 3,4,5 etc will not 'jump' and sit themselves directly underneath tracks 1 and 2- the 'boxes' dividing them remain!
    I hope I have explained this problem clearly (I really tried to) and I would be very appreciative of any help a forum member or members can provide. Thanks in advance.

  • Problem migrating Toplink Workbench project from 9.0.4.5 to 10.1.3.1.0

    Hi all,
    I am having problems migrating my Toplink Workbench project from 9.0.4.5 to 10.1.3.1.0! I used the Toplink Workbench to open and convert the existing project. The conversion succeeded, but when I tried to export the mappings I got this:
    java.lang.NullPointerException
         at oracle.toplink.workbench.mappingsmodel.descriptor.relational.MWRelationalPrimaryKeyPolicy.adjustRuntimeDescriptor(MWRelationalPrimaryKeyPolicy.java:174)
         at oracle.toplink.workbench.mappingsmodel.descriptor.relational.MWRelationalTransactionalPolicy.adjustRuntimeDescriptor(MWRelationalTransactionalPolicy.java:85)
         at oracle.toplink.workbench.mappingsmodel.descriptor.MWDescriptor.buildRuntimeDescriptor(MWDescriptor.java:423)
         at oracle.toplink.workbench.mappingsmodel.descriptor.MWMappingDescriptor.buildRuntimeDescriptor(MWMappingDescriptor.java:860)
         at oracle.toplink.workbench.mappingsmodel.descriptor.relational.MWRelationalClassDescriptor.buildRuntimeDescriptor(MWRelationalClassDescriptor.java:791)
         at oracle.toplink.workbench.mappingsmodel.descriptor.relational.MWTableDescriptor.buildRuntimeDescriptor(MWTableDescriptor.java:955)
         at oracle.toplink.workbench.mappingsmodel.project.MWProject.buildRuntimeProject(MWProject.java:932)
         at oracle.toplink.workbench.mappingsmodel.project.MWProject.exportDeploymentXML(MWProject.java:804)
         at oracle.toplink.workbench.mappingsplugin.ProjectDeploymentXmlGenerationCoordinator.exportProjectDeploymentXml(ProjectDeploymentXmlGenerationCoordinator.java:46)
         at oracle.toplink.workbench.mappingsplugin.ExportDeploymentXmlAction.execute(ExportDeploymentXmlAction.java:27)
         at oracle.toplink.workbench.framework.action.AbstractFrameworkAction.actionPerformed(AbstractFrameworkAction.java:134)
         at javax.swing.AbstractButton.fireActionPerformed(AbstractButton.java:1786)
         at javax.swing.AbstractButton$ForwardActionEvents.actionPerformed(AbstractButton.java:1839)
         at javax.swing.DefaultButtonModel.fireActionPerformed(DefaultButtonModel.java:420)
         at javax.swing.DefaultButtonModel.setPressed(DefaultButtonModel.java:258)
         at javax.swing.plaf.basic.BasicButtonListener.mouseReleased(BasicButtonListener.java:245)
         at java.awt.AWTEventMulticaster.mouseReleased(AWTEventMulticaster.java:231)
         at java.awt.Component.processMouseEvent(Component.java:5100)
         at java.awt.Component.processEvent(Component.java:4897)
         at java.awt.Container.processEvent(Container.java:1569)
         at java.awt.Component.dispatchEventImpl(Component.java:3615)
         at java.awt.Container.dispatchEventImpl(Container.java:1627)
         at java.awt.Component.dispatchEvent(Component.java:3477)
         at java.awt.LightweightDispatcher.retargetMouseEvent(Container.java:3483)
         at java.awt.LightweightDispatcher.processMouseEvent(Container.java:3198)
         at java.awt.LightweightDispatcher.dispatchEvent(Container.java:3128)
         at java.awt.Container.dispatchEventImpl(Container.java:1613)
         at java.awt.Window.dispatchEventImpl(Window.java:1606)
         at java.awt.Component.dispatchEvent(Component.java:3477)
         at java.awt.EventQueue.dispatchEvent(EventQueue.java:480)
         at java.awt.EventDispatchThread.pumpOneEventForHierarchy(EventDispatchThread.java:201)
         at java.awt.EventDispatchThread.pumpEventsForHierarchy(EventDispatchThread.java:151)
         at java.awt.EventDispatchThread.pumpEvents(EventDispatchThread.java:145)
         at java.awt.EventDispatchThread.pumpEvents(EventDispatchThread.java:137)
         at java.awt.EventDispatchThread.run(EventDispatchThread.java:100)
    Anyone seen this error before? This is very critical for us. Please help. Thanks.
    Regards,
    gkk1969

    I am seeing the same problem when i try to do Export to Java Source
    java.lang.NullPointerException
         at oracle.toplink.workbench.mappingsmodel.descriptor.relational.MWRelationalPrimaryKeyPolicy.adjustRuntimeDescriptor(MWRelationalPrimaryKeyPolicy.java:174)
         at oracle.toplink.workbench.mappingsmodel.descriptor.relational.MWRelationalTransactionalPolicy.adjustRuntimeDescriptor(MWRelationalTransactionalPolicy.java:85)
         at oracle.toplink.workbench.mappingsmodel.descriptor.MWDescriptor.buildRuntimeDescriptor(MWDescriptor.java:423)
         at oracle.toplink.workbench.mappingsmodel.descriptor.MWMappingDescriptor.buildRuntimeDescriptor(MWMappingDescriptor.java:860)
         at oracle.toplink.workbench.mappingsmodel.descriptor.relational.MWRelationalClassDescriptor.buildRuntimeDescriptor(MWRelationalClassDescriptor.java:791)
         at oracle.toplink.workbench.mappingsmodel.descriptor.relational.MWTableDescriptor.buildRuntimeDescriptor(MWTableDescriptor.java:955)
         at oracle.toplink.workbench.mappingsmodel.project.MWProject.buildRuntimeProject(MWProject.java:932)
         at oracle.toplink.workbench.mappingsmodel.project.MWProject.exportProjectSource(MWProject.java:824)
         at oracle.toplink.workbench.mappingsplugin.ProjectSourceGenerationCoordinator.exportProjectSource(ProjectSourceGenerationCoordinator.java:68)
         at oracle.toplink.workbench.mappingsplugin.ExportJavaSourceAction.execute(ExportJavaSourceAction.java:31)
         at oracle.toplink.workbench.framework.action.AbstractFrameworkAction.actionPerformed(AbstractFrameworkAction.java:134)
         at javax.swing.AbstractButton.fireActionPerformed(AbstractButton.java:1786)
         at javax.swing.AbstractButton$ForwardActionEvents.actionPerformed(AbstractButton.java:1839)
         at javax.swing.DefaultButtonModel.fireActionPerformed(DefaultButtonModel.java:420)
         at javax.swing.DefaultButtonModel.setPressed(DefaultButtonModel.java:258)
         at javax.swing.AbstractButton.doClick(AbstractButton.java:289)
         at javax.swing.plaf.basic.BasicMenuItemUI.doClick(BasicMenuItemUI.java:1113)
         at javax.swing.plaf.basic.BasicMenuItemUI$MouseInputHandler.mouseReleased(BasicMenuItemUI.java:943)
         at java.awt.AWTEventMulticaster.mouseReleased(AWTEventMulticaster.java:231)
         at java.awt.Component.processMouseEvent(Component.java:5100)
         at java.awt.Component.processEvent(Component.java:4897)
         at java.awt.Container.processEvent(Container.java:1569)
         at java.awt.Component.dispatchEventImpl(Component.java:3615)
         at java.awt.Container.dispatchEventImpl(Container.java:1627)
         at java.awt.Component.dispatchEvent(Component.java:3477)
         at java.awt.LightweightDispatcher.retargetMouseEvent(Container.java:3483)
         at java.awt.LightweightDispatcher.processMouseEvent(Container.java:3198)
         at java.awt.LightweightDispatcher.dispatchEvent(Container.java:3128)
         at java.awt.Container.dispatchEventImpl(Container.java:1613)
         at java.awt.Window.dispatchEventImpl(Window.java:1606)
         at java.awt.Component.dispatchEvent(Component.java:3477)
         at java.awt.EventQueue.dispatchEvent(EventQueue.java:456)
         at java.awt.EventDispatchThread.pumpOneEventForHierarchy(EventDispatchThread.java:201)
         at java.awt.EventDispatchThread.pumpEventsForHierarchy(EventDispatchThread.java:151)
         at java.awt.EventDispatchThread.pumpEvents(EventDispatchThread.java:145)
         at java.awt.EventDispatchThread.pumpEvents(EventDispatchThread.java:137)
         at java.awt.EventDispatchThread.run(EventDispatchThread.java:100)

  • Servlet Compilation Problem !

    Hi,
    I am just starting to learn servlets and I got problem in compiling them. I got compilation error in
    import javax.servlet.*;statement. Seems that the compiler cannot find the servlet package. I got J2EE 1.4 beta installed on my machine but there is no servlet.jar package. I am using J2SDK 1.4.1_02, J2EE 1.4 beta and Tomcat 4.1.24.
    Can anyone help me with my servlet compilation problem?
    Thanks in advance!
    Josh

    servlet.jar is here :
    <tomcatdir>\common\lib
    add it to your compiler classpath

  • Compilation problem in a JSP page

    Hi all,
    I'm trying to write a jsp page and some java stuff in it.
    It goes something like this -
    <!DOCTYPE HTML PUBLIC "-//W3C//DTD HTML 4.01 Transitional//EN"
    "http://www.w3.org/TR/html4/loose.dtd">
    <%@ page contentType="text/html;charset=windows-1255"%>
    <html>
      <head>
        <meta http-equiv="Content-Type" content="text/html; charset=windows-1255"/>
        <title>Michael</title>
      </head>
      <body>
    <%
              String strError="";
    %>
    </body>Now the problem is that I get compilation problem about the use in java -
    "String cannot be resolved to a type"
    I know for sure that in other computers it's work, the question is what I'm missing?
    I have Java VM installed and I've downloaded and installed the latest JDK, what else?
    thanks,
    Michael.

    Michael4488 wrote:
    BalusC wrote:
    Then you should be using JSTL/EL.I don't familiar with this technology, any way - Its work on one computer so in my understanding it should work on the other as well.It is not related to the actual problem. It was just a comment on your code. Using scriptlets is considered as bad practice.
    I understand that of course, but I don't use any configuration file or set any special parameters in my computer.
    What exactly does the compiler need in order to recognize the Java code in the JSP page? If i manually add the JAVA_HOME environment variable it will work?
    where should I refer it to? "..\Java\jre1.6.0_07\lib" will do?It must point to the root installation directory of the JDK (thus not the JRE!).

  • Compilation problem on solaris9  x86

    I am working on JAVA/J2EE . Am new to solaris9 . My requirement is to compile a source distribution of MOD-JK 1.2.21 (apache 2.0 server connector)and to produce binary distribution (*.so file) in solaris9 X86 box. But i got only source distribution of solaris10 X86 platform . Even with this source i tried to compile in solaris9 box its giving some error message and i can't able to make a executable file. Below i pasted the error message .
    # ./configure -with-apxs=/usr/apache2/bin/apxs
    checking build system type... i386-pc-solaris2.10
    checking host system type... i386-pc-solaris2.10
    checking target system type... i386-pc-solaris2.10
    checking for a BSD-compatible install... scripts/build/unix/install-sh -c
    checking whether build environment is sane... yes
    checking for gawk... no
    checking for mawk... no
    checking for nawk... nawk
    checking whether make sets $(MAKE)... no
    checking for gcc... no
    checking for cc... cc
    checking for C compiler default output file name... configure: error: C compiler cannot create executables
    See `config.log' for more details.
    Can any body help me in this regards. Even i don't know, am proceeding in right direction to compile this file. If any body having the binary distribution for the same MOD-JK1.2.21 on solaris9 or solaris10 X86 platform for apache2.0 . please help me to compile this file .I given below the config.log file entries also.
    Thanks in advance..........
    karthikeyan.u
    [email protected]
    AIM or AOL :: karthikeyanu
    CONFIG.log entries......
    This file contains any messages produced by compilers while
    running configure, to aid debugging if configure makes a mistake.
    It was created by configure, which was
    generated by GNU Autoconf 2.59. Invocation command line was
    $ ./configure -with-apxs=/usr/apache2/bin/apxs
    ## Platform. ##
    hostname = Solaris
    uname -m = i86pc
    uname -r = 5.10
    uname -s = SunOS
    uname -v = Generic_118844-26
    /usr/bin/uname -p = i386
    /bin/uname -X = System = SunOS
    Node = Solaris
    Release = 5.10
    KernelID = Generic_118844-26
    Machine = i86pc
    BusType = <unknown>
    Serial = <unknown>
    Users = <unknown>
    OEM# = 0
    Origin# = 1
    NumCPU = 1
    /bin/arch = i86pc
    /usr/bin/arch -k = i86pc
    /usr/convex/getsysinfo = unknown
    hostinfo = unknown
    /bin/machine = unknown
    /usr/bin/oslevel = unknown
    /bin/universe = unknown
    PATH: /usr/sbin
    PATH: /usr/bin
    PATH: /usr/openwin/bin
    PATH: /usr/ucb
    ## Core tests. ##
    configure:1546: checking build system type
    configure:1564: result: i386-pc-solaris2.10
    configure:1572: checking host system type
    configure:1586: result: i386-pc-solaris2.10
    configure:1594: checking target system type
    configure:1608: result: i386-pc-solaris2.10
    configure:1640: checking for a BSD-compatible install
    configure:1695: result: scripts/build/unix/install-sh -c
    configure:1706: checking whether build environment is sane
    configure:1749: result: yes
    configure:1814: checking for gawk
    configure:1843: result: no
    configure:1814: checking for mawk
    configure:1843: result: no
    configure:1814: checking for nawk
    configure:1830: found /usr/bin/nawk
    configure:1840: result: nawk
    configure:1850: checking whether make sets $(MAKE)
    configure:1874: result: no
    configure:2085: checking for gcc
    configure:2114: result: no
    configure:2165: checking for cc
    configure:2181: found /usr/ucb/cc
    configure:2191: result: cc
    configure:2355: checking for C compiler version
    configure:2358: cc --version </dev/null >&5
    /usr/ucb/cc: language optional software package not installed
    configure:2361: $? = 1
    configure:2363: cc -v </dev/null >&5
    /usr/ucb/cc: language optional software package not installed
    configure:2366: $? = 1
    configure:2368: cc -V </dev/null >&5
    /usr/ucb/cc: language optional software package not installed
    configure:2371: $? = 1
    configure:2394: checking for C compiler default output file name
    configure:2397: cc conftest.c >&5
    /usr/ucb/cc: language optional software package not installed
    configure:2400: $? = 1
    configure: failed program was:
    | /* confdefs.h. */
    |
    | #define PACKAGE_NAME ""
    | #define PACKAGE_TARNAME ""
    | #define PACKAGE_VERSION ""
    | #define PACKAGE_STRING ""
    | #define PACKAGE_BUGREPORT ""
    | #define PACKAGE "mod_jk"
    | #define VERSION "1.2.21"
    | /* end confdefs.h. */
    |
    | int
    | main ()
    | {
    |
    | ;
    | return 0;
    | }
    configure:2439: error: C compiler cannot create executables
    See `config.log' for more details.
    ## Cache variables. ##
    ac_cv_build=i386-pc-solaris2.10
    ac_cv_build_alias=i386-pc-solaris2.10
    ac_cv_env_CC_set=
    ac_cv_env_CC_value=
    ac_cv_env_CFLAGS_set=
    ac_cv_env_CFLAGS_value=
    ac_cv_env_CPPFLAGS_set=
    ac_cv_env_CPPFLAGS_value=
    ac_cv_env_CPP_set=
    ac_cv_env_CPP_value=
    ac_cv_env_CXXCPP_set=
    ac_cv_env_CXXCPP_value=
    ac_cv_env_CXXFLAGS_set=
    ac_cv_env_CXXFLAGS_value=
    ac_cv_env_CXX_set=
    ac_cv_env_CXX_value=
    ac_cv_env_F77_set=
    ac_cv_env_F77_value=
    ac_cv_env_FFLAGS_set=
    ac_cv_env_FFLAGS_value=
    ac_cv_env_LDFLAGS_set=
    ac_cv_env_LDFLAGS_value=
    ac_cv_env_build_alias_set=
    ac_cv_env_build_alias_value=
    ac_cv_env_host_alias_set=
    ac_cv_env_host_alias_value=
    ac_cv_env_target_alias_set=
    ac_cv_env_target_alias_value=
    ac_cv_host=i386-pc-solaris2.10
    ac_cv_host_alias=i386-pc-solaris2.10
    ac_cv_prog_AWK=nawk
    ac_cv_prog_ac_ct_CC=cc
    ac_cv_prog_make_make_set=no
    ac_cv_target=i386-pc-solaris2.10
    ac_cv_target_alias=i386-pc-solaris2.10
    ## Output variables. ##
    ACLOCAL='${SHELL} /export/home/dump_208/workspace_SB_563/modjk/ModJK1/modjk/jkk/tomcat-connectors-1.2.21-src/native/scripts/build/unix/missing --run aclocal-1.9'
    AMDEPBACKSLASH=''
    AMDEP_FALSE=''
    AMDEP_TRUE=''
    AMTAR='${SHELL} /export/home/dump_208/workspace_SB_563/modjk/ModJK1/modjk/jkk/tomcat-connectors-1.2.21-src/native/scripts/build/unix/missing --run tar'
    APACHE20_OEXT=''
    APACHE_CONFIG_VARS=''
    APACHE_DIR=''
    APXS=''
    APXSCFLAGS=''
    APXSCPPFLAGS=''
    APXSLDFLAGS=''
    AR=''
    AUTOCONF='${SHELL} /export/home/dump_208/workspace_SB_563/modjk/ModJK1/modjk/jkk/tomcat-connectors-1.2.21-src/native/scripts/build/unix/missing --run autoconf'
    AUTOHEADER='${SHELL} /export/home/dump_208/workspace_SB_563/modjk/ModJK1/modjk/jkk/tomcat-connectors-1.2.21-src/native/scripts/build/unix/missing --run autoheader'
    AUTOMAKE='${SHELL} /export/home/dump_208/workspace_SB_563/modjk/ModJK1/modjk/jkk/tomcat-connectors-1.2.21-src/native/scripts/build/unix/missing --run automake-1.9'
    AWK='nawk'
    CC='cc'
    CCDEPMODE=''
    CFLAGS=''
    CP=''
    CPP=''
    CPPFLAGS=''
    CXX=''
    CXXCPP=''
    CXXDEPMODE=''
    CXXFLAGS=''
    CYGPATH_W='echo'
    DEFS=''
    DEPDIR=''
    ECHO='echo'
    ECHO_C=''
    ECHO_N='-n'
    ECHO_T=''
    EGREP=''
    EXEEXT=''
    F77=''
    FFLAGS=''
    GREP=''
    INSTALL_DATA='${INSTALL} -m 644'
    INSTALL_PROGRAM='${INSTALL}'
    INSTALL_SCRIPT='${INSTALL}'
    INSTALL_STRIP_PROGRAM='${SHELL} $(install_sh) -c -s'
    INSTALL_TYPE=''
    JAVA_HOME=''
    JK_JNI_WORKER=''
    LDFLAGS=''
    LIBOBJS=''
    LIBS=''
    LIBTOOL=''
    LIB_JK_TYPE=''
    LN_S=''
    LTLIBOBJS=''
    MAKEINFO='${SHELL} /export/home/dump_208/workspace_SB_563/modjk/ModJK1/modjk/jkk/tomcat-connectors-1.2.21-src/native/scripts/build/unix/missing --run makeinfo'
    MAKE_DYNAMIC_APACHE_FALSE=''
    MAKE_DYNAMIC_APACHE_TRUE=''
    MKDIR=''
    OBJEXT=''
    OS=''
    PACKAGE='mod_jk'
    PACKAGE_BUGREPORT=''
    PACKAGE_NAME=''
    PACKAGE_STRING=''
    PACKAGE_TARNAME=''
    PACKAGE_VERSION=''
    PATH_SEPARATOR=':'
    PERL=''
    RANLIB=''
    RM=''
    SED=''
    SET_MAKE='MAKE=make'
    SHELL='/bin/bash'
    STRIP=''
    TEST=''
    VERSION='1.2.21'
    WEBSERVER=''
    ac_ct_AR=''
    ac_ct_CC='cc'
    ac_ct_CXX=''
    ac_ct_F77=''
    ac_ct_RANLIB=''
    ac_ct_STRIP=''
    am__fastdepCC_FALSE=''
    am__fastdepCC_TRUE=''
    am__fastdepCXX_FALSE=''
    am__fastdepCXX_TRUE=''
    am__include=''
    am__leading_dot='.'
    am__quote=''
    am__tar='${AMTAR} chof - "$$tardir"'
    am__untar='${AMTAR} xf -'
    apache_include=''
    bindir='${exec_prefix}/bin'
    build='i386-pc-solaris2.10'
    build_alias=''
    build_cpu='i386'
    build_os='solaris2.10'
    build_vendor='pc'
    datadir='${prefix}/share'
    exec_prefix='NONE'
    host='i386-pc-solaris2.10'
    host_alias=''
    host_cpu='i386'
    host_os='solaris2.10'
    host_vendor='pc'
    includedir='${prefix}/include'
    infodir='${prefix}/info'
    install_sh='/export/home/dump_208/workspace_SB_563/modjk/ModJK1/modjk/jkk/tomcat-connectors-1.2.21-src/native/scripts/build/unix/install-sh'
    int32_t_fmt=''
    int32_value=''
    int64_t_fmt=''
    int64_value=''
    libdir='${exec_prefix}/lib'
    libexecdir='${exec_prefix}/libexec'
    localstatedir='${prefix}/var'
    mandir='${prefix}/man'
    mkdir_p='$(install_sh) -d'
    oldincludedir='/usr/include'
    prefix='NONE'
    program_transform_name='s,x,x,'
    sbindir='${exec_prefix}/sbin'
    sharedstatedir='${prefix}/com'
    sysconfdir='${prefix}/etc'
    target='i386-pc-solaris2.10'
    target_alias=''
    target_cpu='i386'
    target_os='solaris2.10'
    target_vendor='pc'
    uint32_t_fmt=''
    uint32_t_hex_fmt=''
    uint64_t_fmt=''
    uint64_t_hex_fmt=''
    ## confdefs.h. ##
    #define PACKAGE "mod_jk"
    #define PACKAGE_BUGREPORT ""
    #define PACKAGE_NAME ""
    #define PACKAGE_STRING ""
    #define PACKAGE_TARNAME ""
    #define PACKAGE_VERSION ""
    #define VERSION "1.2.21"
    configure: exit 77

    You need to make sure the source is for the same version i.e. if you run apache 2.0.52 you need the source of 2.0.52. I successfully ran mixed installs, but I would not recommend it. You can download the required source from Apache.
    As for your compiler problem, make sure you have �/usr/ccs/bin/� in the your path, if you do not have it installed you will have to add the pkg �SUNWsprot�. You do not have 'make' in yout path.
    Make sure you have the following packages installed:
    SUNWbtool, SUNWsprot, SUNWtoo
    SUNWhea, SUNWarc, SUNWlibm, SUNWlibms
    SUNWdfbh, SUNWcg6h, SUNWxwinc, SUNWolinc,
    SUNWxglh,SUNWarcx, SUNWbtoox, SUNWdplx,
    SUNWscpux, SUNWsprox, SUNWlmsx, SUNWlmx
    SUNWlibCx, SUNWtoox, SUNWsra, SUNWsrh

  • Compilation problem with templates while using option -m64

    Hi,
    I have compilation problem with template while using option -m64.
    No problem while using option -m32.
    @ uname -a
    SunOS snt5010 5.10 Generic_127111-11 sun4v sparc SUNW,SPARC-Enterprise-T5220
    $ CC -V
    CC: Sun C++ 5.9 SunOS_sparc Patch 124863-01 2007/07/25
    Here is some C++ program
    ############# foo5.cpp #############
    template <typename T, T N, unsigned long S = sizeof(T) * 8>
    struct static_number_of_ones
    static const T m_value = static_number_of_ones<T, N, S - 1>::m_value >> 1;
    static const unsigned long m_count = static_number_of_ones<T, N, S - 1>::m_count + (static_number_of_ones<T, N, S - 1>::m_value & 0x1);
    template <typename T, T N>
    struct static_number_of_ones<T, N, 0>
    static const T m_value = N;
    static const unsigned long m_count = 0;
    template <typename T, T N>
    struct static_is_power_of_2
    static const bool m_result = (static_number_of_ones<T,N>::m_count == 1);
    template <unsigned long N>
    struct static_number_is_power_of_2
    static const bool m_result = (static_number_of_ones<unsigned long, N>::m_count == 1);
    int main(int argc)
    int ret = 0;
    if (argc > 1)
    ret += static_is_power_of_2<unsigned short, 16>::m_result;
    ret += static_is_power_of_2<unsigned int, 16>::m_result;
    ret += static_is_power_of_2<unsigned long, 16>::m_result;
    ret += static_number_is_power_of_2<16>::m_result;
    else
    ret += static_is_power_of_2<unsigned short, 17>::m_result;
    ret += static_is_power_of_2<unsigned int, 17>::m_result;
    ret += static_is_power_of_2<unsigned long, 17>::m_result;
    ret += static_number_is_power_of_2<17>::m_result;
    return ret;
    Compiation:
    @ CC -m32 foo5.cpp
    // No problem
    @ CC -m64 foo5.cpp
    "foo5.cpp", line 20: Error: An integer constant expression is required here.
    "foo5.cpp", line 36: Where: While specializing "static_is_power_of_2<unsigned long, 16>".
    "foo5.cpp", line 36: Where: Specialized in non-template code.
    "foo5.cpp", line 26: Error: An integer constant expression is required here.
    "foo5.cpp", line 37: Where: While specializing "static_number_is_power_of_2<16>".
    "foo5.cpp", line 37: Where: Specialized in non-template code.
    "foo5.cpp", line 20: Error: An integer constant expression is required here.
    "foo5.cpp", line 43: Where: While specializing "static_is_power_of_2<unsigned long, 17>".
    "foo5.cpp", line 43: Where: Specialized in non-template code.
    "foo5.cpp", line 26: Error: An integer constant expression is required here.
    "foo5.cpp", line 44: Where: While specializing "static_number_is_power_of_2<17>".
    "foo5.cpp", line 44: Where: Specialized in non-template code.
    4 Error(s) detected.
    Predefined macro:
    @ CC -m32 -xdumpmacros=defs foo5.cpp | & tee log32
    @ CC -m64 -xdumpmacros=defs foo5.cpp | & tee log64
    @ diff log32 log64
    7c7
    < #define __TIME__ "09:24:58"
    #define __TIME__ "09:25:38"20c20
    < #define __sparcv8plus 1
    #define __sparcv9 1[snipped]
    =========================
    What is wrong?
    Thanks,
    Alex Vinokur

    Bug 6749491 has been filed for this problem. It will be visible at [http://bugs.sun.com] in a day or two.
    If you have a service contract with Sun, you can ask to have this bug's priority raised, and get a pre-release version of a compiler patch that fixes the problem.
    Otherwise, you can check for new patches from time to time at
    [http://developers.sun.com/sunstudio/downloads/patches/]
    and see whether this bug is listed as fixed.

  • Pro*Cobol PCO Compilation problem in Linux

    Hi,
    DB :oracle 11g on RHEL 5.5
    when we are compiling the (Pro*cobol ) PCO code it is giving us the error :
    System default option values taken from: /oracle/oracle11g/app/product/11.2.0/dbhome_1/precomp/admin/pcbcfg.cfg
    Error at line 320, column 35 in file BR2385.PCO
    WHERE A.SOC_NO = :PARAM-SOC
    ..................................1
    PCB-S-00223, Undeclared variable "PARAM-SOC".
    when we change the pcbcfg.cfg file with flag : declare_section=no it's compile without error.
    But in this scenario cobol app doesn't run.
    if we declare the undeclared variable in the section
    EXEC SQL BEGIN DECLARE SECTION END-EXEC.
    PARAM-SOC PIC X(25).
    EXEC SQL END DECLARE SECTION END-EXEC.
    and compile it with declare_section=yes then cobol app. run fine.
    Are different files generated (cob,int,gnt) after compilation with the option declare_section=no and declare_section=yes.
    Pls help us in this regards. we have lot of file which having these issue and we don't want to do manual changes "EXEC SQL BEGIN" in it.
    Thanks in advance..

    Your code is faulty and has to be fixed.
    No compilation problem is present, the compiler correctly barfs.
    As this is not a support forum, kindly keep your non-issues out of this forum.
    Thank you!!!
    Sybrand Bakker
    Senior Oracle DBA

  • Occi::Number compilation problem in Linux

    Hi,
    I got following error when I complile my application which uses OCCI (Oracle C++ Call Interface) shiped with Oracle 9.2. I added the compiler flag -Dlint .
    When I dont add the compiler flag I dont get following error. My machine is running RedHat linux 7.3
    /usr/bin/g++ -c -I/opt/ora9/product/9.2/rdbms/demo -I/opt/ora9/product/9.2/rdbms/public -I/opt/ora9/product/9.2/plsql/public -I/opt/ora9/product/9.2/network/public myapp.cpp -g -Wall -DLiS -Dlint -DORACLE -I../include -DQT_THREAD_SUPPORT
    In file included from /opt/ora9/product/9.2/rdbms/demo/occi.h:40,
    from ../include/DatabaseSupport.h:17,
    from myapp.cpp:4:
    /opt/ora9/product/9.2/rdbms/demo/occiData.h:374: `oracle::occi::Number::Number (char)' has already been
    declared in `oracle::occi::Number'
    /opt/ora9/product/9.2/rdbms/demo/occiData.h:408: `oracle::occi::Number::operator char () const' has
    already been declared in `oracle::occi::Number'
    If I dont compile my application with -Dlint compiler flag I cant run the application.
    I think this is a bug in occi::Number class
    Any solusion??
    Thanking in advance
    nkran

    Your code is faulty and has to be fixed.
    No compilation problem is present, the compiler correctly barfs.
    As this is not a support forum, kindly keep your non-issues out of this forum.
    Thank you!!!
    Sybrand Bakker
    Senior Oracle DBA

  • Before Update Trigger compilation problem

    Hello experts! I have a compilation problem for a trigger I am trying to create.
    As a matter of fact it should update INT_INITIAL with the old value of INT_LOCK.
    The compilation fails and the debugger raises an ORA 01747 error (invalid declaration for user table, user column etc.)
    Do you have an idea what is wrong with my code?
    create or replace
    TRIGGER TRIGGER_INT_INITIAL
    BEFORE UPDATE ON  TBL_MATRIX_INTERMEDIATE_RESULT
    FOR EACH ROW
    Begin
      IF NVL(:new.INT_INITIAL, 0) != :old.INT_LOCK THEN
           UPDATE TBL_MATRIX_INTERMEDIATE_RESULT set
          :NEW.INT_INITIAL = :old.INT_LOCK;
      END IF;
    END;Regards,
    Seb

    Hi Seb,
    You don't need to use UPDATE stmt here as you are updating the same table on which your trigger is fired. So it may cause mutating table error too.
    when you use :new.colname it will immediately take care of the new value to be inserted in the respective column.
    So no need to write Update stmt.
    Hence remove,
    UPDATE TBL_MATRIX_INTERMEDIATE_RESULT set And use := is an assignment operator whereas = is to equate..
    :=Twinkle

  • Problem migrating from JSF Mojarra 1.2 to 2.0

    As my subject suggests, I am having a problem migrating from JSF 1.2 to JSF 2.0.
    As a first step, all that I had done was to replace both 'jsf-api.jar' and 'jsf-impl.jar' with the newer version 2.0 and restart my server.
    As expected, server failed to publish with the following error message on the console. Any hint on solving this issue is highly appreciated.
    The error message goes as below:
    <Jun 30, 2009 10:31:54 AM PDT> <Error> <HTTP> <BEA-101371> <There was a failure when processing annotations for application D:\MalcolmX\web. Please make sure that the annotations are valid. The error is com.sun.faces.taglib.jsf_core.BeanValidatorTag>
    <Jun 30, 2009 10:31:54 AM PDT> <Error> <Deployer> <BEA-149205> <Failed to initialize the application '_auto_generated_ear_' due to error weblogic.application.ModuleException: Failed to load webapp: '/'.
    weblogic.application.ModuleException: Failed to load webapp: '/'
         at weblogic.servlet.internal.WebAppModule.prepare(WebAppModule.java:387)
         at weblogic.application.internal.flow.ScopedModuleDriver.prepare(ScopedModuleDriver.java:176)
         at weblogic.application.internal.flow.ModuleListenerInvoker.prepare(ModuleListenerInvoker.java:93)
         at weblogic.application.internal.flow.DeploymentCallbackFlow$1.next(DeploymentCallbackFlow.java:387)
         at weblogic.application.utils.StateMachineDriver.nextState(StateMachineDriver.java:37)
         Truncated. see log file for complete stacktrace
    java.lang.ClassNotFoundException: com.sun.faces.taglib.jsf_core.BeanValidatorTag
         at weblogic.utils.classloaders.GenericClassLoader.findLocalClass(GenericClassLoader.java:283)
         at weblogic.utils.classloaders.GenericClassLoader.findClass(GenericClassLoader.java:256)
         at weblogic.utils.classloaders.ChangeAwareClassLoader.findClass(ChangeAwareClassLoader.java:54)
         at java.lang.ClassLoader.loadClass(ClassLoader.java:306)
         at java.lang.ClassLoader.loadClass(ClassLoader.java:251)
         Truncated. see log file for complete stacktrace
    Thanks.

    SirG wrote:
    As expected, server failedWow :P
    The error message goes as below:
    java.lang.ClassNotFoundException: com.sun.faces.taglib.jsf_core.BeanValidatorTagIs it in classpath? Exception says it is not.
    Don't you have some JSF 1.2 libraries around somewhere else in classpath? Appserver/lib? JDK/lib? Etc. You might have a mix of JSF 1.2 and JSF 2.0 in the classpath and the exception is just been caused by this collision.

Maybe you are looking for