CIN compiling error as following!!

I have add the command in projiect seting like"C:\Program Files\National Instruments\LabVIEW 6.1\cintools\ $(TargetName)-d $(WkspDir)\$(OutDir)" and "
$(OutDir)$(TargetName).lsb",but still get the error! What should i do??
--------------------Configuration: VI_name - Win32 Debug--------------------
Performing Custom Build Step on .\Debug\VI_name.dll
'C:\Program' is not recognized as an internal or external command,
operable program or batch file.
Error executing c:\winnt\system32\cmd.exe.
VI_name.dll - 1 error(s), 0 warning(s)

gpibssx;
Probably you are having a problem with the custom step in order to create the CIN. For some reason, some people have bad experiences with the custom step. You have to be very careful writing the command.
I wrote a small VI to take care of that. Just ignore the custom step and when VC++ finish, run the VI to create the .lsb file. You can download the VI from here:
http://www.jyestudio.com/lview.shtml
Its name is CIN Custom Step. I hope this help.
Regards;
Enrique
www.vartortech.com

Similar Messages

  • CIN Compilation error in MSVC 6.0

    I am trying to generate a CIN for the following example C code (mult.c)
    * CIN source file
    #include "extcode.h"
    CIN MgErr CINRun(float32 *A, float32 *B, float32 *AB);
    CIN MgErr CINRun(float32 *A, float32 *B, float32 *AB) {
    *AB = *A * *B;
    return noErr;
    and I get the following error during compilation in MSVC6
    fatal error C1010: unexpected end of file while looking for precompiled header directive
    Error executing cl.exe.
    my preprocessor path in project settings is
    c:\progra~1\nation~1\Labvie~1.1\cintools\
    I tried the full path name. I also tried putting the extcode.h in the same directory of mult.c and then explicitly added extcode.h in the project but
    keep on getting the same error message.
    I will greatly appreciate any pointer to what I am doing incorrectly.
    kushal

    Kushal:
    Regular line oriented languages use a two step process of first
    compiling individual module (.c or .cpp) files into object files and
    then second linking them, i.e. setting them up into a single
    executable and filling in all the address offsets with real addresses.
    Finally, if the program uses a run-time library (.DLL) this gets
    linked in when the program executes but for this to happen, the
    program has to know that it is going to import (DLLIMPORT) these
    functions so it can know the function entry points.
    You can select build, compile your to compile filename.cpp (or
    filename.c) to determine if there are any compile errors without
    having to build the whole executable and link all your compiled
    objects instead of Build, Rebuild All.
    This way you can separate the problem into either a compile or a link
    problem. If it compiles with no errors, but rebuild all gives you
    errors, then the problem is definitely a link problem. From your
    description, it sounds to me like you are having a link problem
    Your particular problem is with the precompiled header (.PCH) file
    that Microsoft Visual C is using to link with when building your
    project. Something is broken with that PCH file. The good news is
    that you don't usually need to use PCH files. It's just an option
    that Microsoft uses to let you recompile your code faster (because
    they've already been compiled hence precompiled header.)
    Try turning off the use precompiled headers option. This may fix your
    problem. If not then you may need to turn them back on and try to
    figure out what is broken with your PCH file (perhaps it doesn't
    exist?)
    To turn off using PCH's look under the Project menu under settings,
    switch to the C/C++ tab and then select Precompiled Headers under the
    Category drop down selector on the C/C++ tab and tell it that you
    don't want to use PCH's.
    I hope this has been helpful.
    Douglas De Clue
    LabVIEW programmer (and MSVC/C++ guy too...
    [email protected]
    Kushal wrote in message news:<[email protected]>...
    > Enrique:
    >
    > The problem is before the custom step. I can't even compile the file
    > mult.c.
    >
    > I reinstalled the MSVC 6.0 and tried to create projects in two
    > different ways.
    >
    > 1. A simple DLL project
    > 2. A DLL that exports some symbols
    >
    > but get the same error while compiling mult.c
    >
    > I am using LabVIEW 6.1, MSVC 6.0 and Windows ME
    > creating a project named cintest.
    >
    > And it is not the code. I tried omitting a ' ; ' at the end of a
    > statement but the bug does not get caught and I keep getting the same
    > error message I reported originally.
    >
    > Thanks for all your suggestions
    >
    > kushal

  • Compilation error in PL/SQL

    Hi All,
    Please find the strange query situation in PLSQL.
    If i run the query without PLSQL block (i.e. declar begin end) it runs well and insert data
    in table but if put the same query in PLSQL block it gives compilation error.
    Following is the spool
    SQL> select * from v$version;
    BANNER                                                                                                                                     
    Oracle8i Enterprise Edition Release 8.1.7.4.0 - Production                                                                                 
    PL/SQL Release 8.1.7.4.0 - Production                                                                                                      
    CORE     8.1.7.0.0     Production                                                                                                                  
    TNS for IBM/AIX RISC System/6000: Version 8.1.7.4.0 - Production                                                                           
    NLSRTL Version 3.4.1.0.0 - Production                                                                                                      
    SQL> insert into smcbom_load_hours_temp
      2  select data_set_name,deptclass,dept,smcbom_flex_budget.get_period(v_date) v_period,sum(v_hr),-1,sysdate,-1,sysdate
      3  from (
      4  select plan_level,sp.data_set_name,
      5  sp.value1,smcbom_flex_budget.calculate_period_days(sp.period1),inweight ,
      6  usagerate ,operationseq,percent,
      7  sbov.group_id,sp.alloy,sp.planner_code,
      8  sbov.days,sbov.totaloffsetdays,deptclass,dept,
      9  decode(plan_level,1,(sp.value14/smcbom_flex_budget.calculate_period_days(sp.period14)) * (percent/100) * inweight * usagerate *
    10  (SELECT MAX(INWEIGHT)
    11  FROM  SMCBOM_BOM_OPERATION_VIEW
    12  WHERE ALLOY=sbov.alloy
    13  AND   PLANNER_CODE=sbov.planner_code
    14  AND   PLAN_LEVEL = 0
    15  AND   GROUP_ID = sbov.group_id ),
    16  0,(sp.value14/smcbom_flex_budget.calculate_period_days(sp.period14)) * (percent/100) * inweight * usagerate ,
    17  1) v_hr,
    18  smcbom_flex_budget.get_start_date(sp.period14)+sbov.totaloffsetdays v_date,
    19  sum(-sbov.totaloffsetdays)
    20  over (partition by sp.alloy,sp.planner_code,sbov.group_id
    21  order by plan_level asc,operationseq desc)  new_offset
    22  from smcbom_bom_operation_view sbov,smcbom_sales_prod_forecasts sp
    23  where sbov.alloy= sp.alloy
    24  and   sbov.planner_code=sp.planner_code
    25  and group_id=521136
    26  )
    27  group by data_set_name,deptclass,dept,smcbom_flex_budget.get_period(v_date);
    23 rows created.
    SQL> commit;
    Commit complete.
    SQL> declare
      2  begin
      3  insert into smcbom_load_hours_temp
      4  select data_set_name,deptclass,dept,smcbom_flex_budget.get_period(v_date) v_period,sum(v_hr),-1,sysdate,-1,sysdate
      5  from (
      6  select plan_level,sp.data_set_name,
      7  sp.value1,smcbom_flex_budget.calculate_period_days(sp.period1),inweight ,
      8  usagerate ,operationseq,percent,
      9  sbov.group_id,sp.alloy,sp.planner_code,
    10  sbov.days,sbov.totaloffsetdays,deptclass,dept,
    11  decode(plan_level,1,(sp.value14/smcbom_flex_budget.calculate_period_days(sp.period14)) * (percent/100) * inweight * usagerate *
    12  (SELECT MAX(INWEIGHT)
    13  FROM  SMCBOM_BOM_OPERATION_VIEW
    14  WHERE ALLOY=sbov.alloy
    15  AND   PLANNER_CODE=sbov.planner_code
    16  AND   PLAN_LEVEL = 0
    17  AND   GROUP_ID = sbov.group_id ),
    18  0,(sp.value14/smcbom_flex_budget.calculate_period_days(sp.period14)) * (percent/100) * inweight * usagerate ,
    19  1) v_hr,
    20  smcbom_flex_budget.get_start_date(sp.period14)+sbov.totaloffsetdays v_date,
    21  sum(-sbov.totaloffsetdays)
    22  over (partition by sp.alloy,sp.planner_code,sbov.group_id
    23  order by plan_level asc,operationseq desc)  new_offset
    24  from smcbom_bom_operation_view sbov,smcbom_sales_prod_forecasts sp
    25  where sbov.alloy= sp.alloy
    26  and   sbov.planner_code=sp.planner_code
    27  and group_id=521136
    28  )
    29  group by data_set_name,deptclass,dept,smcbom_flex_budget.get_period(v_date);
    30  end;
    31  /
    (SELECT MAX(INWEIGHT)
    ERROR at line 12:
    ORA-06550: line 12, column 2:
    PLS-00103: Encountered the symbol "SELECT" when expecting one of the following:
    ( - + mod not null others <an identifier>
    <a double-quoted delimited-identifier> <a bind variable> avg
    count current exists max min prior sql stddev sum variance
    execute forall time timestamp interval date
    <a string literal with character set specification>
    <a number> <a single-quoted SQL string>
    ORA-06550: line 22, column 6:
    PLS-00103: Encountered the symbol "(" when expecting one of the following:
    , from
    SQL> spool off;

    In some versions of Oracle (certainly all of the 8.x versions and earlier, and possibly some of the earlier 9 versions) the SQL parsers in the SQL engine and in the PL/SQL engine were different. Some features that worked directly in SQL did not work in PL/SQL. Scalar sub-queries were one of those things.
    You have three options. You can try to re-write the insert statement to eliminate the PL/SQL unimplemented feature. You can create a view in the database for the SELECT part of the insert statement then use that view in the insert. finally, and least desirable, you can build the whole statment as a string, and use EXECUTE IMMEDIATE to run it in PL/SQL.
    HTH
    John

  • TSQL code that causes table data to be deleted rather than fail with a compilation error

    Afternoon,
    I recently did this by accident and it felt as though it should have failed with a compilation error rather than run
    A query of the form
    delete from jobs
    where id in
    select id from calibrations
    will delete all rows in the jobs table when the id column exists in the jobs table, but not the calibrations table. This should fail with a compilation error.
    the following sql can be used to generate a test database to show the problem
    USE [test]
    GO
    /****** Object:  Table [dbo].[calibrations]    Script Date: 28/11/2014 13:32:59 ******/
    SET ANSI_NULLS ON
    GO
    SET QUOTED_IDENTIFIER ON
    GO
    CREATE TABLE [dbo].[calibrations](
        [JobId] [int] NULL,
        [textfield] [nvarchar](50) NULL
    ) ON [PRIMARY]
    GO
    /****** Object:  Table [dbo].[jobs]    Script Date: 28/11/2014 13:32:59 ******/
    SET ANSI_NULLS ON
    GO
    SET QUOTED_IDENTIFIER ON
    GO
    CREATE TABLE [dbo].[jobs](
        [Id] [int] NOT NULL,
        [Name] [nchar](10) NULL
    ) ON [PRIMARY]
    GO
    INSERT [dbo].[calibrations] ([JobId], [textfield]) VALUES (1, N'something')
    GO
    INSERT [dbo].[jobs] ([Id], [Name]) VALUES (1, N'a         ')
    GO
    INSERT [dbo].[jobs] ([Id], [Name]) VALUES (2, N'b         ')
    GO
    INSERT [dbo].[jobs] ([Id], [Name]) VALUES (3, N'c         ')
    GO
    INSERT [dbo].[jobs] ([Id], [Name]) VALUES (4, N'd         ')
    GO
    INSERT [dbo].[jobs] ([Id], [Name]) VALUES (5, N'e         ')
    GO
    INSERT [dbo].[jobs] ([Id], [Name]) VALUES (6, N'f         ')
    GO
    Simon
    simon

    will delete all rows in the jobs table when the id column exists in the jobs table,
    but not the calibrations table. This should fail with a compilation error.
    Hello Simon,
    That's a bug in your T-SQL Statement, not in SQL Server. The Statement as it is valid and column "id" exists, so why should it fail on compilation?
    And that is the reason why we always should use full qualified object name, e.g. like
    delete from jobs AS J
    where J.id in
    select SUB.id from calibrations AS SUB
    and this Statement should fail on compilation.
    Olaf Helper
    [ Blog] [ Xing] [ MVP]

  • Template compilation error

    I am getting compilation error on following peice of code:
    template <typename KEY>
    class XYZ
    private:
        map<KEY,int>  m_Map;     
        typedef map<KEY,int>::iterator it;
    }Error: No parameters provided for template.
    I have CC version Sun C++ 5.5

    Following code is compiled successfully. I added 'typename' keyword. Without this keyword compiler shows warning but produces correct code. Have you installed the latest patch for your compiler?
    % cat test.cc
    #include <map>
    using namespace std;
    template <typename KEY>
    class XYZ
    private:
    map<KEY,int> m_Map;
    typedef typename map<KEY,int>::iterator it;
    XYZ<int> s;
    % CC -V -c test.cc
    CC: Sun C++ 5.5 Patch 113817-19 2006/10/13
    ccfe: Sun C++ 5.5 Patch 113817-19 2006/10/13

  • Compilation error while deploying

    i have a application ,which contains bmp entity bean,
    and a client which invokes the bean.
    iam successfully building the .ear file ,using ant build tool,then while deploying the application on OC4J.
    itz throwing an compilation error as follows:
    deployment message:
    Node started with id=7808552576960
    Oracle9iAS (9.0.4.0.0) Containers for J2EE initialized
    Notification ==> Start deploying...
    Notification ==> ApplicationDeployer.execute() begins...
    Notification ==> Undeploy previous deployment
    Notification ==> Copy the archive to J:\Oracle9iAS\j2ee\home\applications\employee-info.ear
    Notification ==> Unpack employee-info.ear begins...
    Notification ==> Unpack employee-info.ear ends...
    Notification ==> Intialize employee-info.ear begins...
    Copying default deployment descriptor from archive at J:\Oracle9iAS\j2ee\home\ap
    plications\employee-info/META-INF/orion-application.xml to deployment directory
    J:\Oracle9iAS\j2ee\home\application-deployments\employee-info...
    Notification ==> Intialize employee-info.ear ends...
    Copying default deployment descriptor from archive at J:\Oracle9iAS\j2ee\home\ap
    plications\employee-info/bmp_employee.jar/META-INF/orion-ejb-jar.xml to deployme
    nt directory J:\Oracle9iAS\j2ee\home\application-deployments\employee-info\bmp_e
    mployee.jar...
    Auto-deploying bmp_employee.jar (No previous deployment found)...
    Error compiling J:\Oracle9iAS\j2ee\home\applications\employee-info/bmp_employee.
    jar: ejbCreate() method not found in bean-class com.emp.employee.EmployeeBean
    Copying default deployment descriptor from archive at J:\Oracle9iAS\j2ee\home\ap
    plications\employee-info/client.jar/META-INF/orion-application-client.xml to dep
    loyment directory J:\Oracle9iAS\j2ee\home\application-deployments\employee-info\
    client.jar...
    Notification ==> ApplicationDeployer.execute() ends.
    Notification ==> Operation Completes
    here itz pointing that the EmployeeBean packaged in the ear file doesnot have ejbCreate(..) method ,but when i
    see the bean in the ear ,it contains ejbCreate().
    let me know where, i might have gone wrong.
    waiting 4 suggestions.

    Hi
    Check these if it helps,
    1)You should have ejbCreate methods coresponding to the create methods in the Home interface, with the same method signature.
    2)Also they should have "public" access.
    Shrini

  • What does compiler error " import test; `.`expected" mean ?

    Hi,
    I have a compiler error for following lines. There is a file called Const.java and this file is located on the same directory with the file I intend to compile. However, it seems compiler looks for an import package...
    What does "import test;" command mean ? What is missing in following source code ?
    c:\test> javac -classpath ./ -d ./ *.java one/*.java
    Error :
    test2.java:1: '.' expected
    import test;
    ^
    Source :
    (c:\test\test.java)
    class test
         public static void main(String[] args)
              System.out.println("Hello World!");
    (c:\test\one\test2.java)
    package one;
    import test;
    class test2
         public static void main(String[] args)
              System.out.println("Hello World!");

    Source :
    (c:\test\test.java)
    class test
         public static void main(String[] args)
              System.out.println("Hello World!");
    Since you have no package statement in here, then it is said to reside in the default package. This means, (I believe) that you will not need to use an import statement to use this class. However, if I am wrong, which you can find out in testing, another solution would be to include all you classes in the same package, in this class have both source files start with the line :
    package one;Hope this helped.
    Ed

  • Compilation error while calling static method from another class

    Hi,
    I am new to Java Programming. I have written two class files Dummy1 and Dummy2.java in the same package Test.
    In Dummy1.java I have declared a static final variable and a static method as you can see it below.
    package Test;
    import java.io.*;
    public class Dummy1
    public static final int var1= 10;
    public static int varDisp(int var2)
    return(var1+var2);
    This is program is compiling fine.
    I have called the static method varDisp from the class Dummy2 and it is as follows
    package Test;
    import java.io.*;
    public class Dummy2
    public int var3=15;
    public int test=0;
    test+=Dummy1.varDisp(var3);
    and when i compile Dummy2.java, there is a compilation error <identifier > expected.
    Please help me in this program.

    public class Dummy2
    public int var3=15;
    public int test=0;
    test+=Dummy1.varDisp(var3);
    }test+=Dummy1.varDisplay(var3);
    must be in a method, it cannot just be out somewhere in the class!

  • Compile Error: "schema 'name' does not exist

    Im trying to build a program that quereys a table in a database but i keep getting this error. Am i missing a link between the files or am i missing a line of code in my program??

    Apologies. I receive a compiler error which reads as follows;
    java.lang.ClassNotFoundException: org.apache.derby.jdbc.EmbeddedDriver
    java.sql.SQLSyntaxErrorException: Schema 'DEMO' does not exist
    Heres the main body of code i am trying to execute.
    public class Main {
    * @param args the command line arguments
    public static void main(String[] args) {
    // TODO code application logic here
    try{
    Class.forName("org.apache.derby.jdbc.EmbeddedDriver");
    }catch(ClassNotFoundException e){
    System.out.println(e);
    try{
    Connection con = DriverManager.getConnection("jdbc:derby://localhost:1527/SimpleDBDemo", "demo", "demo");
    Statement stmt = con.createStatement();
    ResultSet rs = stmt.executeQuery("SELECT * FROM DEMO.Table1");
    while (rs.next()) {
    String s = rs.getString("Name");
    float n = rs.getFloat("Age");
    System.out.println(s + " " + n);
    }catch(SQLException e){
    System.err.println(e);
    I am using NetBeans IDE and have created a database under: Services->Databases-> Java DB->SimpleDBDemo.
    I have a database connection in which theres a simple table (called "TABLE1") created which contains the names and ages of two people.
    Hope this makes the problem a bit clearer.
    Any help would be greatly appreciated.

  • Experiencing "The type or namespace name 'DirectoryServices' does not exist in the namespace 'System' (are you missing an assembly reference?)" compilation error

    I am just starting to implement a new user login authentication process wherein after prompting user for username & password, I hope to authenticate them againts our company Active Directory user data. Since I am just starting, I only have very few things
    done at this point which is how I wanted to work on this so that my development environment is still at its simplest state.
    I am using the following for development:
    MS-Visual Studios Professional 2013 Version 12.0.30501.00 Update 2, and
    MS .NET Framework Version 4.5.50938.
    Here are my project solution's current items:
    Web.config:
    <?xml version="1.0"?>
    <!--
    For more information on how to configure your ASP.NET application, please visit
    http://go.microsoft.com/fwlink/?LinkId=169433
    -->
    <configuration>
    <system.web>
    <compilation debug="true" targetFramework="4.5" />
    <httpRuntime targetFramework="4.5" />
    </system.web>
    <system.webServer>
    <defaultDocument enabled="true">
    <files>
    <add value="Login.aspx" />
    </files>
    </defaultDocument>
    </system.webServer>
    </configuration>
    Web.Debug.config:
    <?xml version="1.0" encoding="utf-8"?>
    <!-- For more information on using web.config transformation visit http://go.microsoft.com/fwlink/?LinkId=125889 -->
    <configuration xmlns:xdt="http://schemas.microsoft.com/XML-Document-Transform">
    <!--
    In the example below, the "SetAttributes" transform will change the value of
    "connectionString" to use "ReleaseSQLServer" only when the "Match" locator
    finds an attribute "name" that has a value of "MyDB".
    <connectionStrings>
    <add name="MyDB"
    connectionString="Data Source=ReleaseSQLServer;Initial Catalog=MyReleaseDB;Integrated Security=True"
    xdt:Transform="SetAttributes" xdt:Locator="Match(name)"/>
    </connectionStrings>
    -->
    <system.web>
    <compilation xdt:Transform="RemoveAttributes(debug)" />
    <!--
    In the example below, the "Replace" transform will replace the entire
    <customErrors> section of your web.config file.
    Note that because there is only one customErrors section under the
    <system.web> node, there is no need to use the "xdt:Locator" attribute.
    <customErrors defaultRedirect="GenericError.htm"
    mode="RemoteOnly" xdt:Transform="Replace">
    <error statusCode="500" redirect="InternalError.htm"/>
    </customErrors>
    -->
    </system.web>
    </configuration>
    Web.Assemblies.config:
    <?xml version="1.0"?>
    <configuration>
    <system.web>
    <compilation debug="false" targetFramework="4.5" />
    <httpRuntime targetFramework="4.5" />
    <assemblies>
    <add assembly="System.DirectoryServices, Version=4.0.0.0, Culture=neutral PublicKeyToken=b03f5f7f11d50a3a"/>
    </assemblies>
    </system.web>
    </configuration>
    Login.aspx:
    <%@ Page Language="C#" AutoEventWireup="true" CodeFile="Login.aspx.cs" Inherits="Login" %>
    <!DOCTYPE html>
    <html xmlns="http://www.w3.org/1999/xhtml">
    <head runat="server">
    <title></title>
    </head>
    <body>
    <form id="form1" runat="server">
    <div id="loginForm" style="height: 562px; width: 399px; margin-left: 0px" title="Login Form">
    &nbsp;&nbsp;&nbsp;&nbsp;
    <asp:Label ID="loginPageLabel" runat="server" Font-Bold="True" Font-Names="Arial Black" Font-Size="Large" Text="Please Log In"></asp:Label>
    <br />
    <br />
    &nbsp;&nbsp;&nbsp;&nbsp;&nbsp;&nbsp;&nbsp;&nbsp;
    <asp:Label ID="loginUsernameLabel" runat="server" Text="Username:"></asp:Label>
    &nbsp;&nbsp;&nbsp;
    <asp:TextBox ID="loginUserNameTextBox" runat="server" OnTextChanged="loginUserNameTextBox_TextChanged" Width="213px" Wrap="False" AutoPostBack="True" TabIndex="1"></asp:TextBox>
    <br />
    <br />
    &nbsp;&nbsp;&nbsp;&nbsp;&nbsp;&nbsp;&nbsp;&nbsp;
    <asp:Label ID="loginPasswordLabel" runat="server" Text="Password:"></asp:Label>
    &nbsp;&nbsp;&nbsp;
    <asp:TextBox ID="loginPasswordTextBox" runat="server" OnTextChanged="loginPasswordTextBox_TextChanged" Width="212px" Wrap="False" AutoPostBack="True" TabIndex="2"></asp:TextBox>
    <br />
    <br />
    &nbsp;&nbsp;&nbsp;&nbsp;&nbsp;&nbsp;&nbsp;&nbsp;&nbsp;&nbsp;&nbsp;&nbsp;&nbsp;&nbsp;&nbsp;&nbsp;&nbsp;&nbsp;&nbsp;&nbsp;&nbsp;&nbsp;&nbsp;&nbsp;&nbsp;&nbsp;&nbsp;
    <asp:RadioButton ID="loginUAradioButton" runat="server" Font-Bold="True" OnCheckedChanged="loginUAradioButton_CheckedChanged" Text="TUPSS Associate" AutoPostBack="True" TabIndex="3" />
    &nbsp;&nbsp;
    <asp:RadioButton ID="loginAFradioButton" runat="server" Font-Bold="True" OnCheckedChanged="loginAFradioButton_CheckedChanged" Text="Area Franchisee" AutoPostBack="True" TabIndex="4" />
    <br />
    <br />
    <br />
    &nbsp;&nbsp;&nbsp;&nbsp;&nbsp;&nbsp;&nbsp;&nbsp;&nbsp;&nbsp;&nbsp;&nbsp;&nbsp;&nbsp;&nbsp;&nbsp;&nbsp;&nbsp;&nbsp;&nbsp;&nbsp;&nbsp;&nbsp;&nbsp;&nbsp;&nbsp;&nbsp;&nbsp;
    <asp:Button ID="loginSubmitButton" runat="server" Font-Bold="True" OnClick="loginSubmitButton_Click" Text="Log In" TabIndex="5" />
    &nbsp;&nbsp;&nbsp;&nbsp;&nbsp;&nbsp;&nbsp;&nbsp;&nbsp;&nbsp;&nbsp;&nbsp;&nbsp;&nbsp;&nbsp;
    <asp:Button ID="loginCancelButton" runat="server" Font-Bold="True" OnClick="loginCancelButton_Click" Text="Cancel" TabIndex="6" />
    <br />
    <br />
    &nbsp;&nbsp;
    <asp:Label ID="loginStatusInstructionLabel" runat="server" Text="Status/Instruction:"></asp:Label>
    <br />
    &nbsp;&nbsp;
    <asp:TextBox ID="loginStatusInstructionTextBox" runat="server" Height="230px" MaxLength="100" Rows="12" TextMode="MultiLine" Width="360px" EnableViewState="False" OnTextChanged="loginStatusInstructionTextBox_TextChanged" ReadOnly="True" TabIndex="-1"></asp:TextBox>
    </div>
    </form>
    </body>
    </html>
    Login.aspx.cs:
    using System;
    using System.DirectoryServices;
    public partial class Login : System.Web.UI.Page
    private string uName; // user-entered username
    private string pWord; // user-entered password
    private int loginLoadCycles; // just keeping track of how many times Page_Load is called
    protected void Page_Load(object sender, EventArgs e)
    if (this.loginUserNameTextBox.Text == String.Empty &&
    this.loginPasswordTextBox.Text == String.Empty &&
    this.loginUAradioButton.Checked == false &&
    this.loginAFradioButton.Checked == false)
    this.loginInit();
    this.setLoginVisibilityAndFocus();
    this.loginLoadCycles += 1;
    private void loginInit()
    this.uName = String.Empty;
    this.pWord = String.Empty;
    this.loginLoadCycles = 0;
    private void setLoginVisibilityAndFocus()
    // Decide on whether or not the Login submit & cancel buttons should be enabled or not
    if ( this.loginUserNameTextBox.Text == String.Empty ||
    (this.loginUAradioButton.Checked == false && this.loginAFradioButton.Checked == false) )
    this.loginSubmitButton.Enabled = false;
    this.loginCancelButton.Enabled = false;
    this.loginStatusInstructionTextBox.Text = "Please specify if you are a TUPSS Associate or an Area Franchisee by checking either the 'TUPSS Associate' or 'Area Franchisee' checkbox.";
    else
    this.loginSubmitButton.Enabled = true;
    this.loginCancelButton.Enabled = true;
    if (this.loginPasswordTextBox.Text == String.Empty)
    this.loginStatusInstructionTextBox.Text = "Now that you have entered your username & type, please enter your password.";
    else
    this.loginStatusInstructionTextBox.Text = "When you are ready, please select either the Log In button to login, or the Cancel button to abort.";
    if (this.loginUAradioButton.Checked == false && this.loginAFradioButton.Checked == false)
    this.SetFocus(this.loginUAradioButton);
    else if (this.loginUserNameTextBox.Text == String.Empty)
    this.SetFocus(this.loginUserNameTextBox);
    else if (this.loginPasswordTextBox.Text == String.Empty)
    this.SetFocus(this.loginPasswordTextBox);
    else
    this.SetFocus(this.loginSubmitButton);
    protected void loginUserNameTextBox_TextChanged(object sender, EventArgs e)
    protected void loginPasswordTextBox_TextChanged(object sender, EventArgs e)
    // For some reason, after specifying that the password entry box's textmode to 'Password' setting,
    // the UI's password textbox is emptied
    this.loginStatusInstructionTextBox.Text = "NOTICE:\nThis application is still under development.\n\n" +
    "This is why the password you entered is visible. Once this portion of the application is ready, it will be masked.\n\n" +
    "Also, still need to figure out why when changing this to Password entry mode to mask its entered data, password is getting reset.";
    protected void loginSubmitButton_Click(object sender, EventArgs e)
    this.loginLoadCycles = 0;
    this.uName = this.loginUserNameTextBox.Text;
    this.pWord = this.loginPasswordTextBox.Text;
    if (this.loginUAradioButton.Checked == true && this.loginAFradioButton.Checked == false)
    this.loginLADPauthenticate('U'); // authenticate UPS Associates against UPS Corp's Active Directory
    else if (this.loginUAradioButton.Checked == false && this.loginAFradioButton.Checked == true)
    this.loginLADPauthenticate('A'); // authenticate Area Franchisees against UPS Store's iNet Active Directory
    else
    // set colors to show that this is an error instead of a status message or instruction
    this.loginStatusInstructionTextBox.Text = "ERROR: Cannot log in without specifying if you are an UPS Associate or an Area Franchisee!";
    protected void loginCancelButton_Click(object sender, EventArgs e)
    this.loginStatusInstructionTextBox.Text = "You have selected to cancel from logging in...";
    // Still need to plan what to do when user cancels out of logging in. For now, just initialize class attributes
    this.loginInit();
    protected void loginUAradioButton_CheckedChanged(object sender, EventArgs e)
    String msg = String.Empty;
    if (this.loginUAradioButton.Checked == true)
    this.loginAFradioButton.Checked = false;
    msg = "Thanks for specifying that you are a TUPSS Associate. ";
    if (this.loginUserNameTextBox.Text == String.Empty)
    msg += "Now please specify your username.";
    else if (this.loginPasswordTextBox.Text == String.Empty)
    msg += "Now please enter your password.";
    this.loginStatusInstructionTextBox.Text = msg;
    protected void loginAFradioButton_CheckedChanged(object sender, EventArgs e)
    String msg = String.Empty;
    if (this.loginAFradioButton.Checked == true)
    this.loginUAradioButton.Checked = false;
    msg = "Thanks for specifying that you are an Area Franchisee. ";
    if (this.loginUserNameTextBox.Text == String.Empty)
    msg += "Now please specify your username.";
    else if (this.loginPasswordTextBox.Text == String.Empty)
    msg += "Now please enter your password.";
    this.loginStatusInstructionTextBox.Text = msg;
    private void loginLADPauthenticate(char whichActiveDirectory)
    String msg = "Authenticating user '" + this.uName + "' with password '" + this.pWord + "' against ";
    if (whichActiveDirectory == 'U')
    msg += "UPS Corp's Active Directory...";
    else if (whichActiveDirectory == 'A')
    msg += "The UPS Store's Franchisee Active Directory...";
    msg += "\n\nNOTICE:\nThis is still under development.\n\nAt this point, this application is supposed to do something else now but is not yet ready.";
    this.loginStatusInstructionTextBox.Text = msg;
    this.loginStatusInstructionTextBox.AutoPostBack = true;
    // Authenticate using LDAP
    protected void loginStatusInstructionTextBox_TextChanged(object sender, EventArgs e)
    I confirmed that I have System.DirectoryServices.dll located in
    C:\Windows\Microsoft.NET\assembly\GAC_MSIL\v4.0_4.0.0.0__b03f5f7f11d50a3a\ folder and that I as well as System have read as well as read&execute privileges
    not only to all folders in its path but also to the DLL file itself.
    I would appreciate any help in trying to resolve this compilation error so that I can proceed with implementing LDAP features for this endeavor.
    Thanks so much,
    hguico @ The UPS Store

    Hi,
    For web application problem, please post your thread in
    ASP.NET forum.
    Best Wishes!
    We are trying to better understand customer views on social support experience, so your participation in this interview project would be greatly appreciated if you have time. Thanks for helping make community forums a great place.
    Click
    HERE to participate the survey. Thanks<br/> MSDN Community Support<br/> <br/> Please remember to &quot;Mark as Answer&quot; the responses that resolved your issue. It is a common way to recognize those who have helped you, and
    makes it easier for other visitors to find the resolution later.

  • PL/SQL Procedure Compilation error

    Hi,
    <br><br>
    I have wrote a PL/SQL Stored Procedure to read a couple of table values and then output some data to a file, when I create the procedure on the database I get the following compilation error:
    <br><br>
    LINE/COL ERROR<br>
    -------- -----------------------------------------------------------------<br>
    25/7 PLS-00103: Encountered the symbol ")" when expecting one of the<br>
    following:<br>
    ( - + case mod new null <an identifier><br>
    <a double-quoted delimited-identifier> <a bind variable> avg<br>
    count current max min prior sql stddev sum variance execute<br>
    forall merge time timestamp interval date<br>
    <a string literal with character set specification>
    <a number> <a single-quoted SQL string> pipe<br>
    The symbol "null" was substituted for ")" to continue.<br>
    <br>
    The script is below: <br><br>
    CREATE OR REPLACE <br>
         PROCEDURE TDF_EXTRACT AS<br>
    v_file UTL_FILE.FILE_TYPE;<br>
    YEAR number(4);<br>
    Q1_VALUE NUMBER(7);<br><br>
    BEGIN<br><br>
    SELECT PERSON_VALUE<br>
    INTO     Q1_VALUE<br>
    FROM PERSON<br>
    WHERE ID = 79;<br><br>
    SELECT EXTRACT(YEAR FROM SYSDATE)<br>
    INTO YEAR <br>
    FROM DUAL;<br><br>
    v_file := UTL_FILE.FOPEN(location => '/tmp',<br>
    filename => 'extratced_values.txt',<br>
    open_mode => 'W',<br>
    max_linesize => 32767);<br><br>
    UTL_FILE.PUT_LINE(v_file,<br>
    'Q1'     ||     YEAR     ||     '23'     ||     Q1_VALUE || '\r\n' ||<br>
              );<br><br>
    UTL_FILE.FCLOSE(v_file);<br><br>
    END TDF_EXTRACT;

    'Q1' || YEAR || '23' || Q1_VALUE || '\r\n' ||
    );Syntax error during concatenation, maybe?
    C.
    Message was edited by:
    cd

  • Compiled Error in Xcode for iphone game and other questions

    Dear all,
    Hi, I am a newbie of xcode and objective-c and I have a few questions regarding to the code sample of a game attached below. It is written in objective C, Xcode for iphone4 simulator. It is part of the code of 'ball bounce against brick" game. Instead of creating the image by IB, the code supposes to create (programmatically) 5 X 4 bricks using 4 different kinds of bricks pictures (bricktype1.png...). I have the bricks defined in .h file properly and method written in .m.
    My questions are for the following code:
    - (void)initializeBricks
    brickTypes[0] = @"bricktype1.png";
    brickTypes[1] = @"bricktype2.png";
    brickTypes[2] = @"bricktype3.png";
    brickTypes[3] = @"bricktype4.png";
    int count = 0;`
    for (int y = 0; y < BRICKS_HEIGHT; y++)
    for (int x = 0; x < BRICKS_WIDTH; x++)
    - Line1 UIImage *image = [ImageCache loadImage:brickTypes[count++ % 4]];
    - Line2 bricks[x][y] = [[[UIImageView alloc] initWithImage:image] autorelease];
    - Line3 CGRect newFrame = bricks[x][y].frame;
    - Line4 newFrame.origin = CGPointMake(x * 64, (y * 40) + 50);
    - Line5 bricks[x][y].frame = newFrame;
    - Line6 [self.view addSubview:bricks[x][y]]
    1) When it is compiled, error "ImageCache undeclared" in Line 1. But I have already added the png to the project. What is the problem and how to fix it? (If possible, please suggest code and explain what it does and where to put it.)
    2) How does the following in Line 1 work? Does it assign the element (name of .png) of brickType to image?
    brickTypes[count ++ % 4]
    For instance, returns one of the file name bricktype1.png to the image object? If true, what is the max value of "count", ends at 5? (as X increments 5 times for each Y). But then "count" will exceed the max 'index value' of brickTypes which is 3!
    3) In Line2, does the image object which is being allocated has a name and linked with the .png already at this line *before* it is assigned to brick[x][y]?
    4) What do Line3 and Line5 do? Why newFrame on left in line3 but appears on right in Line5?
    5) What does Line 4 do?
    Thanks
    North

    Hi North -
    macbie wrote:
    1) When it is compiled, error "ImageCache undeclared" in Line 1. ...
    UIImage *image = [ImageCache loadImage:brickTypes[count++ % 4]]; // Line 1
    The compiler is telling you it doesn't know what ImageCache refers to. Is ImageCache the name of a custom class? In that case you may have omitted #import "ImageCache.h". Else if ImageCache refers to an instance of some class, where is that declaration made? I can't tell you how to code the missing piece(s) because I can't guess the answers to these questions.
    Btw, if the png file images were already the correct size, it looks like you could substitute this for Line 1:
    UIImage *image = [UIImage imageNamed:brickTypes[count++ % 4]]; // Line 1
    2) How does the following in Line 1 work? Does it assign the element (name of .png) of brickType to image?
    brickTypes[count ++ % 4]
    Though you don't show the declaration of brickTypes, it appears to be a "C" array of NSString object pointers. Thus brickTypes[0] is the first string, and brickTypes[3] is the last string.
    The expression (count++ % 4) does two things. Firstly, the trailing ++ operator means the variable 'count' will be incremented as soon as the current expression is evaluated. Thus 'count' is zero (its initial value) the first time through the inner loop, its value is one the second time, and two the third time. The following two code blocks do exactly the same thing::
    int index = 0;
    NSString *filename = brickTypes[index++];
    int index = 0;
    NSString *filename = brickTypes[index];
    index = index + 1;
    The percent sign is the "modulus operator" so x%4 means "x modulo 4", which evaluates to the remainder after x is divided by 4. If x starts at 0, and is incremented once everytime through a loop, we'll get the following sequence of values for x%4: 0, 1, 2, 3, 0, 1, 2, 3, 0, 1, ...
    So repeated evaluation of (brickTypes[count++ % 4]) produces the sequence: @"bricktype1.png", @"bricktype2.png", @"bricktype3.png", @"bricktype4.png", @"bricktype1.png", @"bricktype2.png", @"bricktype3.png", @"bricktype4.png", @"bricktype1.png", @"bricktype2.png", ...
    3) In Line2, does the image object which is being allocated has a name and linked with the .png already at this line *before* it is assigned to brick[x][y]?
    Line 2 allocs an object of type UIImageView and specifies the data at 'image' as the picture to be displayed by the new object. Since we immediately assign the address of the new UIImageView object to an element of the 'bricks' array, that address isn't stored in any named variable.
    The new UIImageView object is not associated with the name of the png file from which its picture originated. In fact the UIImage object which inited the UIImageView object is also not associated with that png filename. In other words, once a UIImage object is initialized from the contents of an image file, it's not possible to obtain the name of that file from the UIImage object. Note when you add a png media object to a UIImageView object in IB, the filename of the png resource will be retained and used to identify the image view object. But AFAIK, unless you explicitly save it somewhere in your code, that filename will not be available at run time.
    4) What do Line3 and Line5 do? Why newFrame on left in line3 but appears on right in Line5?
    5) What does Line 4 do?
    In Line 2 we've set the current element of 'bricks' to the address of a new UIImageView object which will display one of the 4 brick types. By default, the frame of a UIImageView object is set to the size of the image which initialized it. So after Line 2, we know that frame.size for the current array element is correct (assuming the image size of the original png file was what we want to display, or assuming that the purpose of [ImageCache loadImage:...] is to adjust the png size).
    Then in Line 3, we set the rectangle named newFrame to the frame of the current array element, i.e. to the frame of the UIImageView object whose address is stored in the current array element. So now we have a rectangle whose size (width, height) is correct for the image to be displayed. But where will this rectangle be placed on the superview? The placement of this rectangle is determined by its origin.
    Line 4 computes the origin we want. Now we have a rectangle with both the correct size and the correct origin.
    Line 5 sets the frame of the new UIImageView object to the rectangle we constructed in Lines 3 and 4. When that object is then added to the superview in Line 6, it will display an image of the correct size at the correct position.
    - Ray

  • Flex compilation error

    Hi All,
    I am getting flex compilation error when i deploy the models which were developed in older version7.0, now it is 7.01.I am getting the following error in 7.01 version.
    Flex2Compiler.Build: Error in executing a process for Flex compilation: /usr/sap/BWD/DVEBMGS30/j2ee/cluster/server0/GUIMachine_Business_Packages/[KCRXK59]MyModels.SMIScoreCard/FLEX_COMPILATION_FOLDER/AAD583.mxml
    Does the older version models doesnot deploy in new versions?
    Thanks
    Srinivas K

    Hello Srinivas,
    Currently i am also facing the same issue , Can you let us know were you able to solve the problem u encountered , if yes how?
    Thanks and Regards,
    Ronniee

  • Flex compilation error 1004

    Compilation is ok, but the deployment is giving this error messages:
    Error in executing a process for Flex compilation, Error 1004: Operator '%' must be followed by an operand
          (D:usrsapJ2EJC01j2eeclusterserverGUIMachine_Business_PackagesTest_59674FLEX_COMPILATION_FOLEDRAAD8G.mxml:154)
    Error 1004: Operator '%' must be followed by an operand
          (D:usrsapJ2EJC01j2eeclusterserverGUIMachine_Business_PackagesTest_59674FLEX_COMPILATION_FOLEDRAAD8G.mxml:154)
    Error 1004: Operator '%' must be followed by an operand
          (D:usrsapJ2EJC01j2eeclusterserverGUIMachine_Business_PackagesTest_59674FLEX_COMPILATION_FOLEDRAAD8G.mxml:154)
    Error 1033: ')' expected
          (D:usrsapJ2EJC01j2eeclusterserverGUIMachine_Business_PackagesTest_59674FLEX_COMPILATION_FOLEDRAAD8G.mxml:154)
    Error 1033: ')' expected
          (D:usrsapJ2EJC01j2eeclusterserverGUIMachine_Business_PackagesTest_59674FLEX_COMPILATION_FOLEDRAAD8G.mxml:154)
    Failed to compile AAD8G.mxml
    I do not succeed in finding the cause of this error

    Compilation is ok, but the deployment is giving this error messages:
    Error in compiling Flex application: Error 1004: Operator '=' must be followed by an operand
          (/usr/sap/NW7/DVEBMGS00/j2ee/cluster/server0/GUIMachine_Business_Packages/Poc_59929/FLEX_COMPILATION_FOLDER/AADHE1_P.mxml:374)
    Error 1142: The class 'vc.custom.SkinAssetDependency' could not be loaded.
          (/usr/sap/NW7/DVEBMGS00/j2ee/cluster/server0/GUIMachine_Business_Packages/Poc__59929/FLEX_COMPILATION_FOLDER/AADHDR.mxml)
    Failed to compile AADHDR.mxml
    Edited by: Rafael Ovidio on Feb 15, 2008 10:28 AM

  • Flex compilation error: line exceeds 32k span

    Hi All,
    I am trying to execute my application being developed in VC7.0 (nw04s sneak preview version) using tabbed layers. I have 3 layers and has the following UI components
    1 tab/layer: input form
    2 tab/layer: table control
    3 tab/layer: table control
    Following is the error from the source Viewer window
    <b>com.myComp.myProduct.8J.Empdetailsview</b>
    Error in executing a process for Flex compilation, Error: Branch between 8421 and 41193 around line 0 exceeds 32K span. If possible, please refactor this component.
          (E:\usr\sap\J2E\JC01\j2ee\cluster\server0\GUIMachine_Business_Packages\empModel_18608\FLEX_COMPILATION_FOLEDR\AAD8J-generated.as:2188)
    Error: Branch between 8421 and 41193 around line 0 exceeds 32K span.
    Failed to compile AAD8J.mxml
    PS: Initially I had a table and chart controls in my second layer (no 3rd layer then) and got the same error however, after removing the chart contrl, the app begun to run.
    Now I added a 3rd layer which has one table contrl only and now the app is not working. I also have eventing between my layers..
    Please help
    Thanks
    Sathish

    Hi
    The 32k issue id pretty hard to get rid of once it starts, instead of using the 3rd layer, try and create a nested iview, you can also try and use a nested iview for each layer, this is a bit more complicated to do but does seem to workaround the 32k problem.
    Jarrod

Maybe you are looking for

  • Acrobat X Pro - Duplication of form fields

    I use Acrobat X Pro to make fillable forms and frequently have an issue with form fields duplicating over top of each other when I try to format a group of fields. Our forms are often several pages in length and it's very time consuming to have to re

  • Can we schedule oo alv tree in background?

    hi all can we schedule oo alv tree in background? Thanks venkat

  • Finder: "Always open in column view"

    Hi all, please, what is purpose of the check box "Always open in ... view" in Finder's folder view settings? When I uncheck it, to avoid the item in the Favorites list to open with the last used type of view, it always gets checked back. Is that expe

  • Who has the most duke dollars?

    Is there a place in the JDC where you find find a list of who had the most duke dollars? I think they had this a long time ago, but I'm not sure what happend to it. Thanks, Strider

  • Transfer plug-ins from CS6 to PS CC ?

    I have installed PS CC and would like to move all of my plug-ins from my existing PS CS6 to CC. How do I do this?