Error: Show Details cannot be executed when multiple items are selected in a report filter field or in a slicer

I have connected TABULAR Model to Excel, and in the pivot the filter is on multiple dimensions. When doing the drillthrough action it gives error - Error: Show Details cannot be executed when multiple items are selected in a report filter field or in a slicer
Is there any workaround to this error?  so that drillthrough can be done even with multiple selection.

Hi Vikas,
The reason behind the error message requires the knowledge on what happens at the backend. When you perform a drill-through action, a query is sent to Analysis Services. This query is expressed in a query language called Multi-Dimensional Expression (MDX).
Since the MDX language doesnot support drill-through command against a set (collection of tuples) an error is persisted. 
For now, there is no workaround as it is a limitation of the underlying language that is generating the query.
When multiple items are selected you lose the ability to drill-down on individual metrics. To resolve you must either:
1. Select a single Item.
2. Select all items.
Hope this helps!
Please mark as Answer if this helps! Thanks, Rajasekhar.

Similar Messages

  • How to Display values in order when Multiple values are selected in the Parameter List

    <p>Hi</p><p>I have a report which runs on the parameter(SalesPersonName) selected.<br />Report has a group section where for each SalesPersonName we have different actions(Lead,Prospect,Active and so on) he had performed which is the basis for the group.</p><p>Now if i need multiple Value selection in the parameter,which i am able to acheive but the order in which it gets printed is not the right one.</p><p>I want intially all the actions performed by one sales person printed and then the second one should start.</p><p>Can any one help me in this aspect.</p><p>Thanks in advance</p>

    <p>If I understand your report structure correctly - you have one Grouping on Actions.  So could you not add another grouping on SalesPersonName above the Actions grouping that you currently have?</p><p>So the new structure would be:</p><p>G1 - SalesPersonName</p><p>G2 - Actions (current grouping you have)</p><p> </p><p>Whether or not you suppress or don&#39;t suppress the new grouping is your choice, but it will then force the ordering that you are asking about (assuming I understood) </p>

  • [WP8.1][Xaml]Update ListView items when other items are selected

    hi,
    i am developing an app for windows phone and using listview to list items. i am using custom template for the listview item. this custom template contains labels, image and button.
    i trying to update the other listview items while one item is selected or multiple item selected. to change listview item i am iterating over the listview and try to get custom template using visual tree helper class. using helper class i am able to retrieve
    control from custom template. once i changing the image in listview if i scroll the listview vertically image changed to its default state.
    is it possible to change the custom template values using visual tree helper class or do i need to do some other changes in my code.
    please suggest.
    <ListView x:Name="lst" Grid.Row="2" SelectionMode="Single" SelectedItem="{Binding ListBoxSelectedItem}"
    ItemsSource="{Binding TssVariableInfo}" Padding="0" Margin="0"
    HorizontalAlignment="Stretch" Grid.Column="0" Grid.ColumnSpan="2" ReorderMode="Disabled" AllowDrop="False"
    VerticalAlignment="Stretch" Holding="lst_Holding" >
    <ListView.ItemTemplate>
    <DataTemplate>
    <local:VariableTemplateSelectorClass Content="{Binding}" FontFamily="Segoe UI" >
    <local:VariableTemplateSelectorClass.IsLiteAndNonDuplicate >
    <DataTemplate>
    <Border BorderThickness="0,1,0,1" BorderBrush="DarkGray" x:Name="bordername">
    <Grid Margin="0,0,0,0" Tapped="Grid_Tap" x:Name="GridVarDetail" Background="#E8E8E8" Holding="Grid_Hold" HorizontalAlignment="Stretch" Width="{Binding ElementName=lst, Path=ActualWidth}">
    <Grid.RowDefinitions>
    <RowDefinition Height="Auto"/>
    <RowDefinition Height="Auto"/>
    <RowDefinition Height="16"/>
    </Grid.RowDefinitions>
    <Grid.ColumnDefinitions>
    <ColumnDefinition Width="6*" />
    <ColumnDefinition Width="4*" />
    </Grid.ColumnDefinitions>
    <Image x:Name="imgLegend" Source="/Assets/Images/Legends/00-Blank.png" Width="13" Height="13" Grid.Row="0" Margin="0,0,0,0" HorizontalAlignment="Left" VerticalAlignment="Center"></Image>
    <TextBlock Foreground="Green" Margin="14,0,0,0" Grid.Row="0" FlowDirection="LeftToRight" x:Name="lblCustomerGivenName" Grid.Column="0" TextWrapping="NoWrap" TextTrimming="WordEllipsis"
    Text="{Binding VariableCustomerGivenName }" FontWeight="Normal" HorizontalAlignment="Left" FontFamily="Calibri" VerticalAlignment="Bottom" FontSize="16" />
    <TextBlock Foreground="Green" Margin="14,0,0,0" Grid.Row="1" VerticalAlignment="Top" Width="Auto" x:Name="lblStandardName" Grid.Column="0" TextWrapping="NoWrap" TextTrimming="WordEllipsis"
    Text="{Binding VariableStandarName}" FontWeight="Normal" HorizontalAlignment="Left" FontFamily="Calibri" FontSize="16" />
    <TextBlock Foreground="Gray" Margin="14,0,0,0" Grid.Row="2" VerticalAlignment="Top" Width="Auto" x:Name="lblSection" Grid.Column="0" TextWrapping="NoWrap" TextTrimming="WordEllipsis"
    Text="{Binding SectionName }" FontWeight="Normal" HorizontalAlignment="Left" FontFamily="Calibri" FontSize="16" />
    <TextBlock Margin="321,0,40,0" Foreground="Red" Grid.Row="0" VerticalAlignment="Bottom" Width="Auto" x:Name="lblValue" Grid.Column="1" TextWrapping="NoWrap"
    Text="{Binding Value}" FontWeight="Normal" HorizontalAlignment="Right" FlowDirection="RightToLeft" FontFamily="Calibri" FontSize="16" />
    <TextBlock Foreground="Gray" Margin="321,0,40,0" Grid.Row="1" VerticalAlignment="Top" Width="Auto" x:Name="lblLastDate" Grid.Column="1" TextWrapping="NoWrap"
    Text="{Binding LastDate}" FontWeight="Normal" HorizontalAlignment="Right" FlowDirection="RightToLeft" FontFamily="Calibri" FontSize="16" />
    <Image Source="/Assets/Images/LeftArrow.png" Height="50" Width="40" Grid.Row="0" Grid.Column="1" Grid.RowSpan="3" HorizontalAlignment="Right" Visibility="Collapsed" x:Name="imgLeftArrow" Tapped="btnMore_Tap" />
    <Image Source="/Assets/Images/2Y-OFF.png" Height="50" Width="40" Grid.Row="0" Grid.Column="1" Grid.RowSpan="3" HorizontalAlignment="Right" Visibility="Collapsed" x:Name="btn2Y" Tapped="btn2Y_Tap"/>
    <Image Source="/Assets/Images/CP-Off.png" Height="50" Width="40" Grid.Row="0" Grid.Column="1" Grid.RowSpan="3" HorizontalAlignment="Right" Visibility="Collapsed" x:Name="btnTL" Tapped="btnTL_Tap" />
    </Grid>
    </Border>
    </DataTemplate>
    </local:VariableTemplateSelectorClass.IsLiteAndNonDuplicate>
    </local:VariableTemplateSelectorClass>
    </DataTemplate>
    </ListView.ItemTemplate>
    </ListView>
    private void Grid_Hold(object sender, HoldingRoutedEventArgs e)
    if (e.HoldingState != Windows.UI.Input.HoldingState.Started)
    return;
    Image imgPlotImage;
    Grid GridVar = (Grid)sender;
    imgPlotImage = (Image)GridVar.FindName("imgLegend");
    General.VariableArrayYAxis.Add(dataObject.VariableID);
    General.DictSelectedVariableType.Add(dataObject.VariableID.ToString(), dataObject.IsTSSLite.ToString());
    GridVar.Background = new SolidColorBrush(Color.FromArgb(100, 255, 255, 255));
    Image imgLeftArrow = (Image)GridVar.FindName("imgLeftArrow");
    imgLeftArrow.Visibility = Windows.UI.Xaml.Visibility.Visible;

    That link is my signature not that i have provided it for reference. 
    You already have implemented binding in your code, just like you have bindings for TextBlock's 'Text' property, likewise you can defined a property for the 'Visibility' of image in the code behind
    e.g.
    private Visibility imgvisible
    public Visibility_ImgVisibility
    get { return imgvisible; }
    set
    if (imgvisible!= value)
    NotifyPropertyChanging("_ImgVisibility");
    imgvisible= value;
    NotifyPropertyChanged("_ImgVisibility");
    Then in xaml file, bind this property with the Visibility property of Image and access it as per your requirement (e.g. on tap of an item)
    http://developer.nokia.com/community/wiki/Using_Crypto%2B%2B_library_with_Windows_Phone_8

  • When menu items are selected they become invsible

    when I select a menu item the words become invisible.

    Start Firefox in [[Safe Mode]] to check if one of the add-ons is causing the problem (switch to the DEFAULT theme: Tools > Add-ons > Themes).
    * Don't make any changes on the Safe mode start window.
    See:
    * [[Troubleshooting extensions and themes]]
    If it does work in Safe-mode then disable all extensions and then try to find which is causing it by enabling one at a time until the problem reappears.
    * Use "Disable all add-ons" on the [[Safe mode]] start window to disable all extensions.
    * Close and restart Firefox after each change via "File > Exit" (Mac: "Firefox > Quit"; Linux: "File > Quit")

  • Display a message when  an item is selected from a dropdownlist

    Hi,
    I need to display a message(kind of alert message) when certain items are selected from the dropdownlist.
    Let me know what is a good way to do this in web elements?
    Thanks

    hello,
    unfortunately there is no validation / alerting for select menus in webelements.
    however...if you're feeling ambitious and or this is a definite requirement for your project...custom functions are open source so you could write an on change javascript function within the WESelect custom function that will find the new value and compare it against your certain items array of values.
    out of curiosity, what is your project's particular need to have an alert for a select menu based on what the end user selects? if this comes up more often or there's a good use case perhaps this could be built into a future version.
    jw

  • Gcc error :  C compiler cannot create executables

    +I am getting the same error from all my Configure scripts+.
    checking whether make sets $(MAKE)... yes
    checking for gcc... gcc
    checking for C compiler default output... configure: error: C compiler cannot create executables
    See `config.log' for more details.
    +config.log shows:+
    configure:1728: checking for gcc
    configure:1744: found /usr/bin/gcc
    configure:1754: result: gcc
    configure:1998: checking for C compiler version
    configure:2001: gcc --version </dev/null >&5
    2.95.2
    configure:2004: $? = 0
    configure:2006: gcc -v </dev/null >&5
    Reading specs from /usr/libexec/gcc/darwin/ppc/2.95.2/specs
    Apple Computer, Inc. version gcc-938, based on gcc version 2.95.2 19991024 (release)
    configure:2009: $? = 0
    configure:2011: gcc -V </dev/null >&5
    gcc: argument to `-V' is missing
    configure:2014: $? = 1
    configure:2038: checking for C compiler default output
    configure:2041: gcc conftest.c >&5
    dyld: lazy symbol binding failed: Symbol not found: _NXOpenFile
    Referenced from: /usr/libexec/gcc/darwin/ppc/cpp-precomp
    Expected in: /usr/lib/libSystem.B.dylib
    dyld: Symbol not found: _NXOpenFile
    Referenced from: /usr/libexec/gcc/darwin/ppc/cpp-precomp
    Expected in: /usr/lib/libSystem.B.dylib
    gcc: Internal compiler error: program cpp-precomp got fatal signal 5
    configure:2044: $? = 1
    configure: failed program was:
    | #line 2017 "configure"
    +The simplest compile has essentially the same error:+
    gcc hello.c
    dyld: lazy symbol binding failed: Symbol not found: _NXOpenFile
    Referenced from: /usr/libexec/gcc/darwin/ppc/cpp-precomp
    Expected in: /usr/lib/libSystem.B.dylib
    dyld: Symbol not found: _NXOpenFile
    Referenced from: /usr/libexec/gcc/darwin/ppc/cpp-precomp
    Expected in: /usr/lib/libSystem.B.dylib
    gcc: Internal compiler error: program cpp-precomp got fatal signal 5
    I'm stumped. This is Mac OS 10.6.5 Snow Leopard; 2 Ghz Intel Core 2 Duo; 4 G RAM.
    gcc2.95.2.pkg installed.
    X11SDK.pkg installed
    This all began when I moved to to MacBook from my old iBook.

    The Snow Leopard install CD has a sub-directory "Optional Installs" which holds a package "Xcode.mpkg". Installing Xcode.mpkg fixed my problem. My compiler is running fine now.

  • "Error:The search cannot be executed because the table has pending changes that would be lost", after DELETE

    Good day,
    On Search Page, I have searched for the record(s) then deleted a record and got confirmation message i.e. Record has deleted. Next when I search for any record I'm getting below error.
    Error
    The search cannot be executed because the table has pending changes that would be lost.
    Could you please help me to fix this issue. Your response is highly appreciated.
    Item properties:
    Item Style : Image
    Action Type: Fire Action
    Event : delete
    Below is the code using in CO and AM
    Controller (processFormRequest):
    if ("delete".equals(pageContext.getParameter(EVENT_PARAM)))
              // The user has clicked a "Delete" icon so we want to display a "Warning"
              // dialog asking if she really wants to delete the employee. Note that we
              // configure the dialog so that pressing the "Yes" button submits to
              // this page so we can handle the action in this processFormRequest( ) method.
              String visit_id = pageContext.getParameter("visit_id");
              String employeeName = pageContext.getParameter("last_name") + ", " + pageContext.getParameter("first_name");
              MessageToken[] tokens = { new MessageToken("EMP_NAME", employeeName)};
              OAException mainMessage = new OAException("FND", "XXXX_EMP_DELETE_WARN", tokens);
              // Note that even though we're going to make our Yes/No buttons submit a
              // form, we still need some non-null value in the constructor's Yes/No
              // URL parameters for the buttons to render, so we just pass empty
              // Strings for this.
              OADialogPage dialogPage = new OADialogPage(OAException.WARNING,
                mainMessage, null, "", "");
              // Always use Message Dictionary for any Strings you want to display.
              String yes = pageContext.getMessage("AK", "FWK_TBX_T_YES", null);
              String no = pageContext.getMessage("AK", "FWK_TBX_T_NO", null);
              // We set this value so the code that handles this button press is
              // descriptive.
    dialogPage.setOkButtonItemName("DeleteYesButton");
              // The following configures the Yes/No buttons to be submit buttons,
              // and makes sure that we handle the form submit in the originating
              // page (the "Employee" summary) so we can handle the "Yes"
              // button selection in this controller.
    dialogPage.setOkButtonToPost(true);
    dialogPage.setNoButtonToPost(true);
    dialogPage.setPostToCallingPage(true);
              // Now set our Yes/No labels instead of the default OK/Cancel.
    dialogPage.setOkButtonLabel(yes);
    dialogPage.setNoButtonLabel(no);
              // We need to keep hold of the employeeNumber and employeeName.
              // The OADialogPage gives us a convenient means
              // of doing this. Note that the use of the Hashtable is 
              // most appropriate for passing multiple parameters. See the OADialogPage
              // javadoc for an alternative when dealing with a single parameter.
              java.util.Hashtable formParams = new java.util.Hashtable(1);
    formParams.put("visit_id", visit_id);
    formParams.put("empName", employeeName);
    dialogPage.setFormParameters(formParams);
              pageContext.redirectToDialogPage(dialogPage);
        else if (pageContext.getParameter("DeleteYesButton") != null)
              // User has confirmed that she wants to delete this employee.
              // Invoke a method on the AM to set the current row in the VO and
              // call remove() on this row.
              String employeeNumber = pageContext.getParameter("visit_id");
              String employeeName = pageContext.getParameter("empName");
              Serializable[] parameters = { employeeNumber };
             // OAApplicationModule am = pageContext.getApplicationModule(webBean);
    am.invokeMethod("deleteEmployee", parameters);
              // Now, redisplay the page with a confirmation message at the top. Note
              // that the deleteEmployee() method in the AM commits, and our code
              // won't get this far if any exceptions are thrown.
              MessageToken[] tokens = { new MessageToken("EMP_NAME", employeeName) };
              OAException message = new OAException("FND",
                "XXXX_EMP_DELETE_CONFIRM", tokens, OAException.CONFIRMATION, null);
    pageContext.putDialogMessage(message);
    Application Module:
      public void deleteEmployee(String visit_id)
            // First, we need to find the selected employee in our VO.
            // When we find it, we call remove( ) on the row which in turn
            // calls remove on the associated EmployeeEOImpl object.
            int empToDelete = Integer.parseInt(visit_id);
              OAViewObject vo = (OAViewObject)getNonEmployeesSummaryVO1();
        NonEmployeesSummaryVORowImpl row = null;
            // This tells us the number of rows that have been fetched in the
            // row set, and will not pull additional rows in like some of the
            // other "get count" methods.
           int fetchedRowCount = vo.getFetchedRowCount();
            // We use a separate iterator -- even though we could step through the
            // rows without it -- because we don't want to affect row currency.
            RowSetIterator deleteIter = vo.createRowSetIterator("deleteIter");
    if (fetchedRowCount > 0)
              deleteIter.setRangeStart(0);
              deleteIter.setRangeSize(fetchedRowCount);
              for (int i = 0; i < fetchedRowCount; i++)
                row = (NonEmployeesSummaryVORowImpl)deleteIter.getRowAtRangeIndex(i);
                // For performance reasons, we generate ViewRowImpls for all
                // View Objects. When we need to obtain an attribute value,
                // we use the named accessors instead of a generic String lookup.
                // Number primaryKey = (Number)row.getAttribute("EmployeeId");
                Number primaryKey = row.getVisitId();
                if (primaryKey.compareTo(empToDelete) == 0)
                  // This performs the actual delete.
                  row.remove();
                    getTransaction().commit();
                  break; // only one possible selected row in this case
            // Always close the iterator when you're done.
            deleteIter.closeRowSetIterator();
          } // end deleteEmployee
    Thanks,
    Ravi

    Hi
    Check this link Getting error in search page search cannot be executed
    Regards,
    Dilip

  • Issues installing ruby 1.9.3 - error: C compiler cannot create executables

    I am trying to install ruby 1.9.3 on my Macbook pro but I've run into a wall.
    Here are the essentials;
    OS: OS X 10.7.3
    Xcode: 4.3
    When I run the rvm command I get the following...
    "rvm install 1.9.3"
    Fetching yaml-0.1.4.tar.gz to /Users/vindigo/.ram/archives
    Extracting yaml-0.1.4.tar.gz to /Users/vindigo/.rvm/src
    Configuring yaml in /Users/vindigo/.rvm/src/yaml-0.1.4.
    Error running ' ./configure --prefix="/Users/vindigo/.rvm/usr"  ', please read /Users/vindigo/.rvm/log/ruby-1.9.3-p125/yaml/configure.log
    Compiling yaml in /Users/vindigo/.rvm/src/yaml-0.1.4.
    Error running 'make ', please read /Users/vindigo/.rvm/log/ruby-1.9.3-p125/yaml/make.log
    Database file /Users/vindigo/.rvm/config/packages does not exist.
    Installing Ruby from source to: /Users/vindigo/.rvm/rubies/ruby-1.9.3-p125, this may take a while depending on your cpu(s)...
    ruby-1.9.3-p125 - #fetching
    ruby-1.9.3-p125 - #extracted to /Users/vindigo/.rvm/src/ruby-1.9.3-p125 (already extracted)
    ruby-1.9.3-p125 - #configuring
    Error running ' ./configure --prefix=/Users/vindigo/.rvm/rubies/ruby-1.9.3-p125 --enable-shared --disable-install-doc --with-libyaml --with-opt-dir=/Users/vindigo/.rvm/usr ', please read /Users/vindigo/.rvm/log/ruby-1.9.3-p125/configure.log
    There has been an error while running configure. Halting the installation.
    CONFIGURE.LOG
    [2012-02-26 14:56:49]  ./configure --prefix="/Users/vindigo/.rvm/usr" 
    checking for a BSD-compatible install... /usr/bin/install -c
    checking whether build environment is sane... yes
    checking for a thread-safe mkdir -p... config/install-sh -c -d
    checking for gawk... no
    checking for mawk... no
    checking for nawk... no
    checking for awk... awk
    checking whether make sets $(MAKE)... yes
    checking for gcc... gcc
    checking whether the C compiler works... no
    configure: error: in `/Users/vindigo/.rvm/src/yaml-0.1.4':
    configure: error: C compiler cannot create executables
    See `config.log' for more details
    MAKE.LOG
    make: *** No targets specified and no makefile found.  Stop.
    Another suggestion I received was to use the following command...
    "rvm install 1.9.3 --with-gcc=clang"
    but I get the same results.
    At this point I've exhausted my options and I am not sure what to try next, other than starting from scratch and reloading the entire OS.
    Any help would be greatly appreaciated.
    Thanks,
    Rich

    Phew!  That was harrowing.
    Found this, and it solved the problem.  Refreshingly, it was written in English and done well at that! 
    http://pragmaticstudio.com/blog/2010/9/23/install-rails-ruby-mac
    Follow all the instructions.  The main missing ingredient for me was downloading the developer tools for the command line from Apple.  I had to register there, but it was free. These tools seemed to install the compiler where it was needed.  You might need a github something or other, I don't know.  I think I downloaded it as some point.  Anyway, I did everything this author told me, and now I have my first rails app!  Good luck - Joel

  • [Solved] error: C compiler cannot create executable

    I dont understand, I compiled many package in the past an now look like GCC is broken somewhere. I tried to reinstall base-devel and pacman to get a new makepkg.conf and the error is still there.
    Here is the output error:
    patching file daemon/gdm-server.c
    Hunk #1 succeeded at 131 (offset 4 lines).
    patching file data/greeter-autostart/gnome-settings-daemon.desktop.in.in
    patching file data/greeter-autostart/polkit-gnome-authentication-agent-1.desktop.in.in
    patching file gui/simple-chooser/gdm-chooser-session.c
    patching file daemon/gdm-server.c
    Hunk #1 succeeded at 33 with fuzz 2.
    Hunk #2 succeeded at 156 (offset 4 lines).
    Hunk #3 succeeded at 402 (offset 4 lines).
    checking for a BSD-compatible install... /bin/install -c
    checking whether build environment is sane... yes
    checking for a thread-safe mkdir -p... /bin/mkdir -p
    checking for gawk... gawk
    checking whether make sets $(MAKE)... yes
    checking whether to enable maintainer-specific portions of Makefiles... no
    checking for style of include used by make... GNU
    checking for gcc... gcc
    checking whether the C compiler works... no
    configure: error: in `/tmp/yaourt-tmp-srivo/abs-gdm/src/gdm-2.32.0':
    configure: error: C compiler cannot create executables
    See `config.log' for more details
    Abandon...
    I tryed to build this one with yaourt -Sb but the same happen when I try to copy the content of the ABS tree in a folder and use makepkg instead.
    Last edited by srivo (2010-10-28 09:54:29)

    Here it is.  Thanks Wonder.
    This file contains any messages produced by compilers while
    running configure, to aid debugging if configure makes a mistake.
    It was created by gdm configure 2.32.0, which was
    generated by GNU Autoconf 2.66. Invocation command line was
    $ ./configure --prefix=/usr --sysconfdir=/etc --libexecdir=/usr/lib/gdm --localstatedir=/var --disable-static --with-at-spi-registryd-directory=/usr/lib/at-spi --disable-scrollkeeper
    ## Platform. ##
    hostname = hacker
    uname -m = i686
    uname -r = 2.6.35-ARCH
    uname -s = Linux
    uname -v = #1 SMP PREEMPT Wed Sep 29 07:17:20 UTC 2010
    /usr/bin/uname -p = unknown
    /bin/uname -X = unknown
    /bin/arch = i686
    /usr/bin/arch -k = unknown
    /usr/convex/getsysinfo = unknown
    /usr/bin/hostinfo = unknown
    /bin/machine = unknown
    /usr/bin/oslevel = unknown
    /bin/universe = unknown
    PATH: /bin
    PATH: /usr/bin
    PATH: /sbin
    PATH: /usr/sbin
    PATH: /opt/java/bin
    PATH: /opt/java/jre/bin
    PATH: /opt/NX/bin
    PATH: /usr/lib/perl5/vendor_perl/bin
    PATH: /usr/bin/perlbin/vendor
    PATH: /usr/lib/perl5/core_perl/bin
    ## Core tests. ##
    configure:2778: checking for a BSD-compatible install
    configure:2846: result: /bin/install -c
    configure:2857: checking whether build environment is sane
    configure:2907: result: yes
    configure:3048: checking for a thread-safe mkdir -p
    configure:3087: result: /bin/mkdir -p
    configure:3100: checking for gawk
    configure:3116: found /bin/gawk
    configure:3127: result: gawk
    configure:3138: checking whether make sets $(MAKE)
    configure:3160: result: yes
    configure:3253: checking whether to enable maintainer-specific portions of Makefiles
    configure:3262: result: no
    configure:3289: checking for style of include used by make
    configure:3317: result: GNU
    configure:3387: checking for gcc
    configure:3403: found /usr/bin/gcc
    configure:3414: result: gcc
    configure:3643: checking for C compiler version
    configure:3652: gcc --version >&5
    gcc (GCC) 4.5.1
    Copyright (C) 2010 Free Software Foundation, Inc.
    This is free software; see the source for copying conditions. There is NO
    warranty; not even for MERCHANTABILITY or FITNESS FOR A PARTICULAR PURPOSE.
    configure:3663: $? = 0
    configure:3652: gcc -v >&5
    Using built-in specs.
    COLLECT_GCC=gcc
    COLLECT_LTO_WRAPPER=/usr/lib/gcc/i686-pc-linux-gnu/4.5.1/lto-wrapper
    Target: i686-pc-linux-gnu
    Configured with: ../configure --prefix=/usr --enable-languages=c,c++,fortran,objc,obj-c++,ada --enable-shared --enable-threads=posix --enable-__cxa_atexit --enable-clocale=gnu --enable-gnu-unique-object --enable-lto --enable-plugin --disable-multilib --disable-libstdcxx-pch --with-system-zlib --with-ppl --with-cloog --libdir=/usr/lib --libexecdir=/usr/lib --mandir=/usr/share/man --infodir=/usr/share/info
    Thread model: posix
    gcc version 4.5.1 (GCC)
    configure:3663: $? = 0
    configure:3652: gcc -V >&5
    gcc: '-V' option must have argument
    configure:3663: $? = 1
    configure:3652: gcc -qversion >&5
    gcc: unrecognized option '-qversion'
    gcc: no input files
    configure:3663: $? = 1
    configure:3683: checking whether the C compiler works
    configure:3705: gcc -march=native -O2 -pipe -Wl,--hash-style=gnu -Wl,--as-needed conftest.c >&5
    /usr/lib/gcc/i686-pc-linux-gnu/4.5.1/../../../crt1.o: In function `_start':
    (.text+0xc): undefined reference to `__libc_csu_fini'
    /usr/lib/gcc/i686-pc-linux-gnu/4.5.1/../../../crt1.o: In function `_start':
    (.text+0x11): undefined reference to `__libc_csu_init'
    collect2: ld returned 1 exit status
    configure:3709: $? = 1
    configure:3747: result: no
    configure: failed program was:
    | /* confdefs.h */
    | #define PACKAGE_NAME "gdm"
    | #define PACKAGE_TARNAME "gdm"
    | #define PACKAGE_VERSION "2.32.0"
    | #define PACKAGE_STRING "gdm 2.32.0"
    | #define PACKAGE_BUGREPORT "[url]http://bugzilla.gnome.org/enter_bug.cgi?product=gdm[/url]"
    | #define PACKAGE_URL ""
    | #define PACKAGE "gdm"
    | #define VERSION "2.32.0"
    | /* end confdefs.h. */
    |
    | int
    | main ()
    | {
    |
    | ;
    | return 0;
    | }
    configure:3752: error: in `/tmp/yaourt-tmp-srivoallan/abs-gdm/src/gdm-2.32.0':
    configure:3754: error: C compiler cannot create executables
    See `config.log' for more details
    ## Cache variables. ##
    ac_cv_env_APPLET_CFLAGS_set=
    ac_cv_env_APPLET_CFLAGS_value=
    ac_cv_env_APPLET_LIBS_set=
    ac_cv_env_APPLET_LIBS_value=
    ac_cv_env_CANBERRA_GTK_CFLAGS_set=
    ac_cv_env_CANBERRA_GTK_CFLAGS_value=
    ac_cv_env_CANBERRA_GTK_LIBS_set=
    ac_cv_env_CANBERRA_GTK_LIBS_value=
    ac_cv_env_CCC_set=
    ac_cv_env_CCC_value=
    ac_cv_env_CC_set=
    ac_cv_env_CC_value=
    ac_cv_env_CFLAGS_set=set
    ac_cv_env_CFLAGS_value='-march=native -O2 -pipe'
    ac_cv_env_CHECK_CFLAGS_set=
    ac_cv_env_CHECK_CFLAGS_value=
    ac_cv_env_CHECK_LIBS_set=
    ac_cv_env_CHECK_LIBS_value=
    ac_cv_env_COMMON_CFLAGS_set=
    ac_cv_env_COMMON_CFLAGS_value=
    ac_cv_env_COMMON_LIBS_set=
    ac_cv_env_COMMON_LIBS_value=
    ac_cv_env_CPPFLAGS_set=
    ac_cv_env_CPPFLAGS_value=
    ac_cv_env_CPP_set=
    ac_cv_env_CPP_value=
    ac_cv_env_CXXCPP_set=
    ac_cv_env_CXXCPP_value=
    ac_cv_env_CXXFLAGS_set=set
    ac_cv_env_CXXFLAGS_value='-march=native -O2 -pipe'
    ac_cv_env_CXX_set=
    ac_cv_env_CXX_value=
    ac_cv_env_DAEMON_CFLAGS_set=
    ac_cv_env_DAEMON_CFLAGS_value=
    ac_cv_env_DAEMON_LIBS_set=
    ac_cv_env_DAEMON_LIBS_value=
    ac_cv_env_GCONF_CFLAGS_set=
    ac_cv_env_GCONF_CFLAGS_value=
    ac_cv_env_GCONF_LIBS_set=
    ac_cv_env_GCONF_LIBS_value=
    ac_cv_env_GTHREAD_CFLAGS_set=
    ac_cv_env_GTHREAD_CFLAGS_value=
    ac_cv_env_GTHREAD_LIBS_set=
    ac_cv_env_GTHREAD_LIBS_value=
    ac_cv_env_GTK_CFLAGS_set=
    ac_cv_env_GTK_CFLAGS_value=
    ac_cv_env_GTK_LIBS_set=
    ac_cv_env_GTK_LIBS_value=
    ac_cv_env_LDFLAGS_set=set
    ac_cv_env_LDFLAGS_value='-Wl,--hash-style=gnu -Wl,--as-needed'
    ac_cv_env_LIBS_set=
    ac_cv_env_LIBS_value=
    ac_cv_env_LIBXKLAVIER_CFLAGS_set=
    ac_cv_env_LIBXKLAVIER_CFLAGS_value=
    ac_cv_env_LIBXKLAVIER_LIBS_set=
    ac_cv_env_LIBXKLAVIER_LIBS_value=
    ac_cv_env_PKG_CONFIG_LIBDIR_set=
    ac_cv_env_PKG_CONFIG_LIBDIR_value=
    ac_cv_env_PKG_CONFIG_PATH_set=set
    ac_cv_env_PKG_CONFIG_PATH_value=/usr/lib/pkgconfig
    ac_cv_env_PKG_CONFIG_set=
    ac_cv_env_PKG_CONFIG_value=
    ac_cv_env_SIMPLE_CHOOSER_CFLAGS_set=
    ac_cv_env_SIMPLE_CHOOSER_CFLAGS_value=
    ac_cv_env_SIMPLE_CHOOSER_LIBS_set=
    ac_cv_env_SIMPLE_CHOOSER_LIBS_value=
    ac_cv_env_SIMPLE_GREETER_CFLAGS_set=
    ac_cv_env_SIMPLE_GREETER_CFLAGS_value=
    ac_cv_env_SIMPLE_GREETER_LIBS_set=
    ac_cv_env_SIMPLE_GREETER_LIBS_value=
    ac_cv_env_UPOWER_CFLAGS_set=
    ac_cv_env_UPOWER_CFLAGS_value=
    ac_cv_env_UPOWER_LIBS_set=
    ac_cv_env_UPOWER_LIBS_value=
    ac_cv_env_XLIB_CFLAGS_set=
    ac_cv_env_XLIB_CFLAGS_value=
    ac_cv_env_XLIB_LIBS_set=
    ac_cv_env_XLIB_LIBS_value=
    ac_cv_env_XMKMF_set=
    ac_cv_env_XMKMF_value=
    ac_cv_env_build_alias_set=
    ac_cv_env_build_alias_value=
    ac_cv_env_host_alias_set=
    ac_cv_env_host_alias_value=
    ac_cv_env_target_alias_set=
    ac_cv_env_target_alias_value=
    ac_cv_path_install='/bin/install -c'
    ac_cv_path_mkdir=/bin/mkdir
    ac_cv_prog_AWK=gawk
    ac_cv_prog_ac_ct_CC=gcc
    ac_cv_prog_make_make_set=yes
    ## Output variables. ##
    ACLOCAL='${SHELL} /tmp/yaourt-tmp-srivoallan/abs-gdm/src/gdm-2.32.0/missing --run aclocal-1.11'
    ALL_LINGUAS=''
    AMDEPBACKSLASH='\'
    AMDEP_FALSE='#'
    AMDEP_TRUE=''
    AMTAR='${SHELL} /tmp/yaourt-tmp-srivoallan/abs-gdm/src/gdm-2.32.0/missing --run tar'
    AM_BACKSLASH='\'
    AM_DEFAULT_VERBOSITY='0'
    APPLET_CFLAGS=''
    APPLET_LIBS=''
    AR=''
    AT_BINDIR=''
    AT_SPI_REGISTRYD_DIR=''
    AUTOCONF='${SHELL} /tmp/yaourt-tmp-srivoallan/abs-gdm/src/gdm-2.32.0/missing --run autoconf'
    AUTOHEADER='${SHELL} /tmp/yaourt-tmp-srivoallan/abs-gdm/src/gdm-2.32.0/missing --run autoheader'
    AUTOMAKE='${SHELL} /tmp/yaourt-tmp-srivoallan/abs-gdm/src/gdm-2.32.0/missing --run automake-1.11'
    AWK='gawk'
    BINDIR=''
    CANBERRA_GTK_CFLAGS=''
    CANBERRA_GTK_LIBS=''
    CATALOGS=''
    CATOBJEXT=''
    CC='gcc'
    CCDEPMODE=''
    CFLAGS='-march=native -O2 -pipe'
    CHECK_CFLAGS=''
    CHECK_LIBS=''
    COMMON_CFLAGS=''
    COMMON_LIBS=''
    CPP=''
    CPPFLAGS=''
    CXX=''
    CXXCPP=''
    CXXDEPMODE=''
    CXXFLAGS='-march=native -O2 -pipe'
    CYGPATH_W='echo'
    DAEMON_CFLAGS=''
    DAEMON_LIBS=''
    DATADIR=''
    DATADIRNAME=''
    DBUS_SYS_DIR=''
    DEBUG_CFLAGS=''
    DEFS=''
    DEPDIR='.deps'
    DISTCHECK_CONFIGURE_FLAGS=''
    DOC_USER_FORMATS=''
    DSYMUTIL=''
    DUMPBIN=''
    ECHO_C=''
    ECHO_N='-n'
    ECHO_T=''
    EGREP=''
    ENABLE_SK_FALSE=''
    ENABLE_SK_TRUE=''
    EXEEXT=''
    EXTRA_CHOOSER_LIBS=''
    EXTRA_DAEMON_LIBS=''
    EXTRA_DYNAMIC_LIBS=''
    EXTRA_FLEXI_LIBS=''
    EXTRA_GREETER_LIBS=''
    EXTRA_SETUP_LIBS=''
    EXTRA_SLAVE_LIBS=''
    EXTRA_TEST_LIBS=''
    EXTRA_XNEST_LIBS=''
    FGREP=''
    GCONFTOOL=''
    GCONF_CFLAGS=''
    GCONF_LIBS=''
    GCONF_SCHEMAS_INSTALL_FALSE=''
    GCONF_SCHEMAS_INSTALL_TRUE=''
    GCONF_SCHEMA_CONFIG_SOURCE=''
    GCONF_SCHEMA_FILE_DIR=''
    GDMCHOOSER=''
    GDM_CUSTOM_CONF=''
    GDM_DEFAULTS_CONF=''
    GDM_GROUPNAME=''
    GDM_OLD_CONF=''
    GDM_PID_FILE=''
    GDM_SCREENSHOT_DIR=''
    GDM_SESSION_DEFAULT_PATH=''
    GDM_USERNAME=''
    GDM_WORKING_DIR=''
    GDM_XAUTH_DIR=''
    GETTEXT_PACKAGE=''
    GLIB_GENMARSHAL=''
    GMOFILES=''
    GMSGFMT=''
    GREP=''
    GTHREAD_CFLAGS=''
    GTHREAD_LIBS=''
    GTK_CFLAGS=''
    GTK_LIBS=''
    HAVE_ADT_FALSE=''
    HAVE_ADT_TRUE=''
    HAVE_CHECK_FALSE=''
    HAVE_CHECK_TRUE=''
    HAVE_GNOME_DOC_UTILS_FALSE=''
    HAVE_GNOME_DOC_UTILS_TRUE=''
    HAVE_LIBAUDIT_FALSE=''
    HAVE_LIBAUDIT_TRUE=''
    HAVE_LIBXKLAVIER=''
    HAVE_LIBXKLAVIER_FALSE=''
    HAVE_LIBXKLAVIER_TRUE=''
    HAVE_PAM=''
    HELP_DIR=''
    INSTALL_DATA='${INSTALL} -m 644'
    INSTALL_PROGRAM='${INSTALL}'
    INSTALL_SCRIPT='${INSTALL}'
    INSTALL_STRIP_PROGRAM='$(install_sh) -c -s'
    INSTOBJEXT=''
    INTLLIBS=''
    INTLTOOL_CAVES_RULE=''
    INTLTOOL_DESKTOP_RULE=''
    INTLTOOL_DIRECTORY_RULE=''
    INTLTOOL_EXTRACT=''
    INTLTOOL_KBD_RULE=''
    INTLTOOL_KEYS_RULE=''
    INTLTOOL_MERGE=''
    INTLTOOL_OAF_RULE=''
    INTLTOOL_PERL=''
    INTLTOOL_POLICY_RULE=''
    INTLTOOL_PONG_RULE=''
    INTLTOOL_PROP_RULE=''
    INTLTOOL_SCHEMAS_RULE=''
    INTLTOOL_SERVER_RULE=''
    INTLTOOL_SERVICE_RULE=''
    INTLTOOL_SHEET_RULE=''
    INTLTOOL_SOUNDLIST_RULE=''
    INTLTOOL_THEME_RULE=''
    INTLTOOL_UI_RULE=''
    INTLTOOL_UPDATE=''
    INTLTOOL_XAM_RULE=''
    INTLTOOL_XML_NOMERGE_RULE=''
    INTLTOOL_XML_RULE=''
    LANG_CONFIG_FILE=''
    LD=''
    LDFLAGS='-Wl,--hash-style=gnu -Wl,--as-needed'
    LIBDIR=''
    LIBEXECDIR=''
    LIBOBJS=''
    LIBS=''
    LIBTOOL=''
    LIBWRAP_LIBS=''
    LIBXKLAVIER_CFLAGS=''
    LIBXKLAVIER_LIBS=''
    LIPO=''
    LN_S=''
    LOCALSTATEDIR=''
    LTLIBOBJS=''
    MAINT='#'
    MAINTAINER_MODE_FALSE=''
    MAINTAINER_MODE_TRUE='#'
    MAKEINFO='${SHELL} /tmp/yaourt-tmp-srivoallan/abs-gdm/src/gdm-2.32.0/missing --run makeinfo'
    MKDIR_P='/bin/mkdir -p'
    MKDTEMP_MISSING_FALSE=''
    MKDTEMP_MISSING_TRUE=''
    MKINSTALLDIRS=''
    MSGFMT=''
    MSGFMT_OPTS=''
    MSGMERGE=''
    NM=''
    NMEDIT=''
    OBJDUMP=''
    OBJEXT=''
    OMF_DIR=''
    OS_SOLARIS_FALSE=''
    OS_SOLARIS_TRUE=''
    OTOOL64=''
    OTOOL=''
    PACKAGE='gdm'
    PACKAGE_BUGREPORT='http://bugzilla.gnome.org/enter_bug.cgi?product=gdm'
    PACKAGE_NAME='gdm'
    PACKAGE_STRING='gdm 2.32.0'
    PACKAGE_TARNAME='gdm'
    PACKAGE_URL=''
    PACKAGE_VERSION='2.32.0'
    PAM_LIBS=''
    PAM_PREFIX=''
    PATH_SEPARATOR=':'
    PKG_CONFIG=''
    PKG_CONFIG_LIBDIR=''
    PKG_CONFIG_PATH='/usr/lib/pkgconfig'
    PLUGIN_LIBTOOL_FLAGS=''
    POFILES=''
    POSUB=''
    PO_IN_DATADIR_FALSE=''
    PO_IN_DATADIR_TRUE=''
    RANLIB=''
    RBAC_LIBS=''
    SBINDIR=''
    SED=''
    SET_MAKE=''
    SHELL='/bin/sh'
    SIMPLE_CHOOSER_CFLAGS=''
    SIMPLE_CHOOSER_LIBS=''
    SIMPLE_GREETER_CFLAGS=''
    SIMPLE_GREETER_LIBS=''
    SOUND_PROGRAM=''
    STRIP=''
    SYSCONFDIR=''
    UPOWER=''
    UPOWER_CFLAGS=''
    UPOWER_LIBS=''
    USE_NLS=''
    VERSION='2.32.0'
    WARN_CFLAGS=''
    WITH_CONSOLE_KIT=''
    WITH_CONSOLE_KIT_FALSE=''
    WITH_CONSOLE_KIT_TRUE=''
    XDMCP_LIBS=''
    XDMCP_SUPPORT_FALSE=''
    XDMCP_SUPPORT_TRUE=''
    XEVIE_OPTION=''
    XGETTEXT=''
    XINERAMA_LIBS=''
    XLIB_CFLAGS=''
    XLIB_LIBS=''
    XMKMF=''
    XSESSION_SHELL=''
    X_CFLAGS=''
    X_CONFIG_OPTIONS=''
    X_EXTRA_LIBS=''
    X_LIBS=''
    X_PATH=''
    X_PRE_LIBS=''
    X_SERVER=''
    X_SERVER_PATH=''
    X_XNEST_CMD=''
    X_XNEST_CONFIG_OPTIONS=''
    X_XNEST_UNSCALED_FONTPATH=''
    ac_ct_CC='gcc'
    ac_ct_CXX=''
    ac_ct_DUMPBIN=''
    am__EXEEXT_FALSE=''
    am__EXEEXT_TRUE=''
    am__fastdepCC_FALSE=''
    am__fastdepCC_TRUE=''
    am__fastdepCXX_FALSE=''
    am__fastdepCXX_TRUE=''
    am__include='include'
    am__isrc=''
    am__leading_dot='.'
    am__quote=''
    am__tar='${AMTAR} chof - "$$tardir"'
    am__untar='${AMTAR} xf -'
    authdir=''
    bindir='${exec_prefix}/bin'
    build=''
    build_alias=''
    build_cpu=''
    build_os=''
    build_vendor=''
    datadir='${datarootdir}'
    datarootdir='${prefix}/share'
    dmconfdir=''
    docdir='${datarootdir}/doc/${PACKAGE_TARNAME}'
    dvidir='${docdir}'
    exec_prefix='NONE'
    gdmconfdir=''
    gdmlocaledir=''
    host=''
    host_alias=''
    host_cpu=''
    host_os=''
    host_vendor=''
    htmldir='${docdir}'
    includedir='${prefix}/include'
    infodir='${datarootdir}/info'
    install_sh='${SHELL} /tmp/yaourt-tmp-srivoallan/abs-gdm/src/gdm-2.32.0/install-sh'
    libdir='${exec_prefix}/lib'
    libexecdir='/usr/lib/gdm'
    localedir='${datarootdir}/locale'
    localstatedir='/var'
    logdir=''
    mandir='${datarootdir}/man'
    mkdir_p='/bin/mkdir -p'
    oldincludedir='/usr/include'
    pdfdir='${docdir}'
    pixmapdir=''
    prefix='/usr'
    program_transform_name='s,x,x,'
    psdir='${docdir}'
    sbindir='${exec_prefix}/sbin'
    sharedstatedir='${prefix}/com'
    sysconfdir='/etc'
    sysconfsubdir=''
    target_alias=''
    ## confdefs.h. ##
    /* confdefs.h */
    #define PACKAGE_NAME "gdm"
    #define PACKAGE_TARNAME "gdm"
    #define PACKAGE_VERSION "2.32.0"
    #define PACKAGE_STRING "gdm 2.32.0"
    #define PACKAGE_BUGREPORT "[url]http://bugzilla.gnome.org/enter_bug.cgi?product=gdm[/url]"
    #define PACKAGE_URL ""
    #define PACKAGE "gdm"
    #define VERSION "2.32.0"
    configure: exit 77
    Last edited by srivo (2010-10-27 13:28:27)

  • Error: "The search cannot be executed because the table has pending changes that would be lost."

    Hello,
    I'm working a developing an OA page that will displays the contents of an Oracle table and allows the user to update records in a table as needed.
    When I hit submit button to save the changes in the update page, the control goes back to main page (where all the table records are displayed). It displays the updated record with the new information.However when I hit "Go" button on the mainPG, I get the error "The search cannot be executed because the table has pending changes that would be lost. and the changes are not committed.
    ANy suggestions on where I should look will be greatly appreciated.
    Posting code for my controller
    =======================
              if ( pageContext.getParameter("saveRate") != null )
              personam.invokeMethod("saveRateToDatabase");
    Code from my AM
    =============
        public void saveRateToDatabase()
          getOADBTransaction().commit();
          System.out.println("40--After commit has been executed");
    Code from my VORowImpl
    ===================
    package cggv.oracle.apps.gl.server;
    import oracle.apps.fnd.framework.server.OAViewRowImpl;
    import oracle.jbo.domain.Date;
    import oracle.jbo.domain.Number;
    import oracle.jbo.server.AttributeDefImpl;
    // ---    File generated by Oracle ADF Business Components Design Time.
    // ---    Custom code may be added to this class.
    // ---    Warning: Do not modify method signatures of generated methods.
    public class xxCggGlRatesVORowImpl extends OAViewRowImpl {
        public static final int RATEID = 0;
        public static final int FROMCURRENCY = 1;
        public static final int TOCURRENCY = 2;
        public static final int FROMCONVERSIONDATE = 3;
        public static final int TOCONVERSIONDATE = 4;
        public static final int USERCONVERSIONTYPE = 5;
        public static final int CONVERSIONRATE = 6;
        public static final int MODEFLAG = 7;
        /**This is the default constructor (do not remove)
        public xxCggGlRatesVORowImpl() {
        /**Gets the attribute value for the calculated attribute RateId
        public Number getRateId() {
            return (Number) getAttributeInternal(RATEID);
        /**Sets <code>value</code> as the attribute value for the calculated attribute RateId
        public void setRateId(Number value) {
            setAttributeInternal(RATEID, value);
            //populateAttribute(RATEID, value);
        /**Gets the attribute value for the calculated attribute FromCurrency
        public String getFromCurrency() {
            return (String) getAttributeInternal(FROMCURRENCY);
        /**Sets <code>value</code> as the attribute value for the calculated attribute FromCurrency
        public void setFromCurrency(String value) {
            setAttributeInternal(FROMCURRENCY, value);      
        /**Gets the attribute value for the calculated attribute ToCurrency
        public String getToCurrency() {
            return (String) getAttributeInternal(TOCURRENCY);
        /**Sets <code>value</code> as the attribute value for the calculated attribute ToCurrency
        public void setToCurrency(String value) {
            setAttributeInternal(TOCURRENCY, value);
        /**Gets the attribute value for the calculated attribute FromConversionDate
        public Date getFromConversionDate() {
            return (Date) getAttributeInternal(FROMCONVERSIONDATE);
        /**Sets <code>value</code> as the attribute value for the calculated attribute FromConversionDate
        public void setFromConversionDate(Date value) {
            setAttributeInternal(FROMCONVERSIONDATE, value);      
        /**Gets the attribute value for the calculated attribute ToConversionDate
        public Date getToConversionDate() {
            return (Date) getAttributeInternal(TOCONVERSIONDATE);
        /**Sets <code>value</code> as the attribute value for the calculated attribute ToConversionDate
        public void setToConversionDate(Date value) {
            setAttributeInternal(TOCONVERSIONDATE, value);       
        /**Gets the attribute value for the calculated attribute UserConversionType
        public String getUserConversionType() {
            return (String) getAttributeInternal(USERCONVERSIONTYPE);
        /**Sets <code>value</code> as the attribute value for the calculated attribute UserConversionType
        public void setUserConversionType(String value) {
            setAttributeInternal(USERCONVERSIONTYPE, value);
        /**Gets the attribute value for the calculated attribute ConversionRate
        public Number getConversionRate() {
            return (Number) getAttributeInternal(CONVERSIONRATE);
        /**Sets <code>value</code> as the attribute value for the calculated attribute ConversionRate
        public void setConversionRate(Number value) {
            setAttributeInternal(CONVERSIONRATE, value);
        /**Gets the attribute value for the calculated attribute ModeFlag
        public String getModeFlag() {
            return (String) getAttributeInternal(MODEFLAG);
        /**Sets <code>value</code> as the attribute value for the calculated attribute ModeFlag
        public void setModeFlag(String value) {
            setAttributeInternal(MODEFLAG, value);      
        /**getAttrInvokeAccessor: generated method. Do not modify.
        protected Object getAttrInvokeAccessor(int index,
                                               AttributeDefImpl attrDef) throws Exception {
            switch (index) {
            case RATEID:
                return getRateId();
            case FROMCURRENCY:
                return getFromCurrency();
            case TOCURRENCY:
                return getToCurrency();
            case FROMCONVERSIONDATE:
                return getFromConversionDate();
            case TOCONVERSIONDATE:
                return getToConversionDate();
            case USERCONVERSIONTYPE:
                return getUserConversionType();
            case CONVERSIONRATE:
                return getConversionRate();
            case MODEFLAG:
                return getModeFlag();
            default:
                return super.getAttrInvokeAccessor(index, attrDef);
        /**setAttrInvokeAccessor: generated method. Do not modify.
        protected void setAttrInvokeAccessor(int index, Object value,
                                             AttributeDefImpl attrDef) throws Exception {
            switch (index) {
            case RATEID:
                setRateId((Number)value);
                return;
            case FROMCURRENCY:
                setFromCurrency((String)value);
                return;
            case TOCURRENCY:
                setToCurrency((String)value);
                return;
            case FROMCONVERSIONDATE:
                setFromConversionDate((Date)value);
                return;
            case TOCONVERSIONDATE:
                setToConversionDate((Date)value);
                return;
            case USERCONVERSIONTYPE:
                setUserConversionType((String)value);
                return;
            case CONVERSIONRATE:
                setConversionRate((Number)value);
                return;
            case MODEFLAG:
                setModeFlag((String)value);
                return;
            default:
                super.setAttrInvokeAccessor(index, value, attrDef);
                return;
        /**Gets xxCggGlRatesEO entity object.
        public xxCggGlRatesEOImpl getxxCggGlRatesEO() {
            return (xxCggGlRatesEOImpl)getEntity(0);

    Hi,
    Check these links:
    Oracle Apps: Search cannot be executed because the table has pending changes that would be lost
    Re: Getting error in search page search cannot be executed
    http://jneelmani.blogspot.in/2009/11/oaf-search-cannot-be-executed-because.html
    --Sushant

  • Installing Clamav: configure: error: C compiler cannot create executables

    I want to install clamav-0.93.3 but i keep getting an error at ./configure
    This server doesn't have access to internet so blastwave isn't an option i think.
    Here is my config.log
    This file contains any messages produced by compilers while
    running configure, to aid debugging if configure makes a mistake.
    It was created by clamav configure 0.93.3, which was
    generated by GNU Autoconf 2.61. Invocation command line was
    $ ./configure CC=/usr/bin/gcc
    ## Platform. ##
    hostname = host-fs1
    uname -m = i86pc
    uname -r = 5.10
    uname -s = SunOS
    uname -v = Generic_118855-36
    /usr/bin/uname -p = i386
    /bin/uname -X = System = SunOS
    Node = host-fs1
    Release = 5.10
    KernelID = Generic_118855-36
    Machine = i86pc
    BusType = <unknown>
    Serial = <unknown>
    Users = <unknown>
    OEM# = 0
    Origin# = 1
    NumCPU = 4
    /bin/arch = i86pc
    /usr/bin/arch -k = i86pc
    /usr/convex/getsysinfo = unknown
    /usr/bin/hostinfo = unknown
    /bin/machine = unknown
    /usr/bin/oslevel = unknown
    /bin/universe = unknown
    PATH: /sbin
    PATH: /usr/sbin
    PATH: /usr/bin
    PATH: /usr/sfw/bin
    PATH: /usr/sfw/sbin
    PATH: /usr/ccs/bin
    PATH: /usr/openwin/bin
    PATH: /usr/dt/bin
    PATH: /opt/sfw/bin
    PATH: /opt/sfw/sbin
    ## Core tests. ##
    configure:2028: checking build system type
    configure:2046: result: i386-pc-solaris2.10
    configure:2068: checking host system type
    configure:2083: result: i386-pc-solaris2.10
    configure:2105: checking target system type
    configure:2120: result: i386-pc-solaris2.10
    configure:2205: result: creating target.h - canonical system defines
    configure:2351: checking for a BSD-compatible install
    configure:2407: result: config/install-sh -c
    configure:2418: checking whether build environment is sane
    configure:2461: result: yes
    configure:2489: checking for a thread-safe mkdir -p
    configure:2528: result: config/install-sh -c -d
    configure:2541: checking for gawk
    configure:2571: result: no
    configure:2541: checking for mawk
    configure:2571: result: no
    configure:2541: checking for nawk
    configure:2557: found /usr/bin/nawk
    configure:2568: result: nawk
    configure:2579: checking whether make sets $(MAKE)
    configure:2604: result: no
    configure:2803: checking for gawk
    configure:2830: result: nawk
    configure:2854: checking for a BSD-compatible install
    configure:2910: result: config/install-sh -c
    configure:2921: checking whether ln -s works
    configure:2925: result: yes
    configure:2932: checking whether make sets $(MAKE)
    configure:2957: result: no
    configure:3048: checking for style of include used by make
    configure:3076: result: none
    configure:3146: checking for gcc
    configure:3173: result: /usr/bin/gcc
    configure:3411: checking for C compiler version
    configure:3418: /usr/bin/gcc --version >&5
    gcc (GCC) 3.4.6
    Copyright (C) 2006 Free Software Foundation, Inc.
    This is free software; see the source for copying conditions. There is NO
    warranty; not even for MERCHANTABILITY or FITNESS FOR A PARTICULAR PURPOSE.
    configure:3421: $? = 0
    configure:3428: /usr/bin/gcc -v >&5
    Reading specs from /usr/local/lib/gcc/i386-pc-solaris2.10/3.4.6/specs
    Configured with: ../configure with-as=/usr/ccs/bin/as with-ld=/usr/ccs/bin/ld enable-shared enable-languages=c,c++,f77
    Thread model: posix
    gcc version 3.4.6
    configure:3431: $? = 0
    configure:3438: /usr/bin/gcc -V >&5
    gcc: `-V' option must have argument
    configure:3441: $? = 1
    configure:3464: checking for C compiler default output file name
    configure:3491: /usr/bin/gcc conftest.c >&5
    gcc: installation problem, cannot exec `as': No such file or directory
    configure:3494: $? = 1
    configure:3532: result:
    configure: failed program was:
    | /* confdefs.h. */
    | #define PACKAGE_NAME "clamav"
    | #define PACKAGE_TARNAME "clamav"
    | #define PACKAGE_VERSION "0.93.3"
    | #define PACKAGE_STRING "clamav 0.93.3"
    | #define PACKAGE_BUGREPORT "http://bugs.clamav.net/"
    | #define PACKAGE PACKAGE_NAME
    | #define VERSION "0.93.3"
    | /* end confdefs.h. */
    |
    | int
    | main ()
    | {
    |
    | ;
    | return 0;
    | }
    configure:3539: error: C compiler cannot create executables
    See `config.log' for more details.
    ## Cache variables. ##
    ac_cv_build=i386-pc-solaris2.10
    ac_cv_env_CC_set=set
    ac_cv_env_CC_value=/usr/bin/gcc
    ac_cv_env_CFLAGS_set=
    ac_cv_env_CFLAGS_value=
    ac_cv_env_CPPFLAGS_set=
    ac_cv_env_CPPFLAGS_value=
    ac_cv_env_CPP_set=
    ac_cv_env_CPP_value=
    ac_cv_env_LDFLAGS_set=
    ac_cv_env_LDFLAGS_value=
    ac_cv_env_LIBS_set=
    ac_cv_env_LIBS_value=
    ac_cv_env_build_alias_set=
    ac_cv_env_build_alias_value=
    ac_cv_env_host_alias_set=
    ac_cv_env_host_alias_value=
    ac_cv_env_target_alias_set=
    ac_cv_env_target_alias_value=
    ac_cv_host=i386-pc-solaris2.10
    ac_cv_prog_AWK=nawk
    ac_cv_prog_ac_ct_CC=/usr/bin/gcc
    ac_cv_prog_make_make_set=no
    ac_cv_target=i386-pc-solaris2.10
    ## Output variables. ##
    ACLOCAL='${SHELL} /usr/src/clamav-0.93.3src/config/missing --run aclocal-1.10'
    AMDEPBACKSLASH='\'
    AMDEP_FALSE='#'
    AMDEP_TRUE=''
    AMTAR='${SHELL} /usr/src/clamav-0.93.3src/config/missing --run tar'
    AR=''
    AUTOCONF='${SHELL} /usr/src/clamav-0.93.3src/config/missing --run autoconf'
    AUTOHEADER='${SHELL} /usr/src/clamav-0.93.3src/config/missing --run autoheader'
    AUTOMAKE='${SHELL} /usr/src/clamav-0.93.3src/config/missing --run automake-1.10'
    AWK='nawk'
    BUILD_CLAMD_FALSE=''
    BUILD_CLAMD_TRUE=''
    CC='/usr/bin/gcc'
    CCDEPMODE=''
    CFGDIR=''
    CFLAGS=''
    CLAMAVGROUP=''
    CLAMAVUSER=''
    CLAMAV_MILTER_LIBS=''
    CLAMD_LIBS=''
    CPP=''
    CPPFLAGS=''
    CYGPATH_W='echo'
    DBDIR=''
    DEFS=''
    DEPDIR='.deps'
    DSYMUTIL=''
    ECHO='echo'
    ECHO_C=''
    ECHO_N='-n'
    ECHO_T=''
    EGREP=''
    ENABLE_UNRAR_FALSE=''
    ENABLE_UNRAR_TRUE=''
    EXEEXT=''
    FRESHCLAM_LIBS=''
    GETENT=''
    GREP=''
    HAVE_LIBGMP=''
    HAVE_MILTER_FALSE=''
    HAVE_MILTER_TRUE=''
    INSTALL_DATA='${INSTALL} -m 644'
    INSTALL_PROGRAM='${INSTALL}'
    INSTALL_SCRIPT='${INSTALL}'
    INSTALL_STRIP_PROGRAM='$(install_sh) -c -s'
    LDFLAGS=''
    LIBBZ2=''
    LIBBZ2_PREFIX=''
    LIBCLAMAV_LIBS=''
    LIBCLAMAV_VERSION='4:4:0'
    LIBGMP=''
    LIBGMP_PREFIX=''
    LIBOBJS=''
    LIBS=''
    LIBTOOL=''
    LN_S='ln -s'
    LTLIBBZ2=''
    LTLIBGMP=''
    LTLIBOBJS=''
    MAINT=''
    MAINTAINER_MODE_FALSE=''
    MAINTAINER_MODE_TRUE=''
    MAKEINFO='${SHELL} /usr/src/clamav-0.93.3src/config/missing --run makeinfo'
    NMEDIT=''
    OBJEXT=''
    PACKAGE='clamav'
    PACKAGE_BUGREPORT='http://bugs.clamav.net/'
    PACKAGE_NAME='clamav'
    PACKAGE_STRING='clamav 0.93.3'
    PACKAGE_TARNAME='clamav'
    PACKAGE_VERSION='0.93.3'
    PATH_SEPARATOR=':'
    RANLIB=''
    SED=''
    SET_MAKE='MAKE=make'
    SHELL='/bin/bash'
    STRIP=''
    THREAD_LIBS=''
    TH_SAFE=''
    VERSION='0.93.3'
    VERSIONSCRIPTFLAG=''
    VERSIONSCRIPT_FALSE=''
    VERSIONSCRIPT_TRUE=''
    ac_ct_CC='/usr/bin/gcc'
    am__fastdepCC_FALSE=''
    am__fastdepCC_TRUE=''
    am__include='#'
    am__isrc=''
    am__leading_dot='.'
    am__quote=''
    am__tar='${AMTAR} chof - "$$tardir"'
    am__untar='${AMTAR} xf -'
    bindir='${exec_prefix}/bin'
    build='i386-pc-solaris2.10'
    build_alias=''
    build_cpu='i386'
    build_os='solaris2.10'
    build_vendor='pc'
    datadir='${datarootdir}'
    datarootdir='${prefix}/share'
    docdir='${datarootdir}/doc/${PACKAGE_TARNAME}'
    dvidir='${docdir}'
    exec_prefix='NONE'
    host='i386-pc-solaris2.10'
    host_alias=''
    host_cpu='i386'
    host_os='solaris2.10'
    host_vendor='pc'
    htmldir='${docdir}'
    includedir='${prefix}/include'
    infodir='${datarootdir}/info'
    install_sh='$(SHELL) /usr/src/clamav-0.93.3src/config/install-sh'
    libdir='${exec_prefix}/lib'
    libexecdir='${exec_prefix}/libexec'
    localedir='${datarootdir}/locale'
    localstatedir='${prefix}/var'
    mandir='${datarootdir}/man'
    mkdir_p='$(top_builddir)/config/install-sh -c -d'
    oldincludedir='/usr/include'
    pdfdir='${docdir}'
    prefix='NONE'
    program_transform_name='s,x,x,'
    psdir='${docdir}'
    sbindir='${exec_prefix}/sbin'
    sendmailprog=''
    sharedstatedir='${prefix}/com'
    sysconfdir='${prefix}/etc'
    target='i386-pc-solaris2.10'
    target_alias=''
    target_cpu='i386'
    target_os='solaris2.10'
    target_vendor='pc'
    ## confdefs.h. ##
    #define PACKAGE_NAME "clamav"
    #define PACKAGE_TARNAME "clamav"
    #define PACKAGE_VERSION "0.93.3"
    #define PACKAGE_STRING "clamav 0.93.3"
    #define PACKAGE_BUGREPORT "http://bugs.clamav.net/"
    #define PACKAGE PACKAGE_NAME
    #define VERSION "0.93.3"
    configure: exit 77
    Can anyone please help me i am desperate......
    thanxs

    I need to download the dvd image again its about 2 GB.
    I've downloaded the image. scp SUNWPROT to the server.
    this is the install it didn't go well:
    root@host-fs1:/usr/src# pkgadd -d . SUNWsprot
    Processing package instance <SUNWsprot> from </usr/share/src>
    Solaris Bundled tools(i386) 5.10,REV=2004.12.18
    Copyright 2004 Sun Microsystems, Inc. All rights reserved.
    Use is subject to license terms.
    This appears to be an attempt to install the same architecture and
    version of a package which is already installed. This installation
    will attempt to overwrite this package.
    The installation of this package was previously terminated and
    installation was never successfully completed.
    Do you want to continue with the installation of <SUNWsprot> [y,n,?] y
    Using </> as the package base directory.
    ## Processing package information.
    ## Processing system information.
    16 package pathnames are already properly installed.
    ## Verifying package dependencies.
    ## Verifying disk space requirements.
    ## Checking for conflicts with packages already installed.
    ## Checking for setuid/setgid programs.
    This package contains scripts which will be executed with super-user
    permission during the process of installing this package.
    Do you want to continue with the installation of <SUNWsprot> [y,n,?] y
    Installing Solaris Bundled tools as <SUNWsprot>
    ## Installing part 1 of 1.
    cpio: Can't read input: end of file encountered prior to expected end of archive.
    1 errors
    Unarchiving of /usr/share/src/SUNWsprot/archive/none failed with error 1
    pkgadd: ERROR: class action script did not complete successfully
    Installation of <SUNWsprot> failed.
    Any suggestions?
    Edited by: arragon_jaap on 25-aug-2008 11:37

  • Error: C compiler cannot create executables

    Install ctags-5.7 ~
    ./configure  Error
    Error Message:checking for C compiler default output file name... configure: error: C compiler cannot create executables
    config.log:
    This file contains any messages produced by compilers while
    running configure, to aid debugging if configure makes a mistake.
    It was created by configure, which was
    generated by GNU Autoconf 2.59.  Invocation command line was
      $ ./configure
    ## Platform. ##
    hostname = kanoumatoMac-mini.local
    uname -m = x86_64
    uname -r = 12.0.0
    uname -s = Darwin
    uname -v = Darwin Kernel Version 12.0.0: Sun Jun 24 23:00:16 PDT 2012; root:xnu-2050.7.9~1/RELEASE_X86_64
    /usr/bin/uname -p = i386
    /bin/uname -X     = unknown
    /bin/arch              = unknown
    /usr/bin/arch -k       = unknown
    /usr/convex/getsysinfo = unknown
    hostinfo               = Mach kernel version:
               Darwin Kernel Version 12.0.0: Sun Jun 24 23:00:16 PDT 2012; root:xnu-2050.7.9~1/RELEASE_X86_64
    Kernel configured for up to 4 processors.
    2 processors are physically available.
    4 processors are logically available.
    Processor type: i486 (Intel 80486)
    Processors active: 0 1 2 3
    Primary memory available: 6.00 gigabytes
    Default processor set: 135 tasks, 684 threads, 4 processors
    Load average: 1.09, Mach factor: 2.90
    /bin/machine           = unknown
    /usr/bin/oslevel       = unknown
    /bin/universe          = unknown
    PATH: /Developer/usr/bin/
    PATH: /usr/bin
    PATH: /bin
    PATH: /usr/sbin
    PATH: /sbin
    PATH: /usr/local/bin
    ## Core tests. ##
    configure:1401: checking whether to install link to etags
    configure:1408: result: no
    configure:1411: checking whether to install readtags object file
    configure:1418: result: no
    configure:1491: checking for gcc
    configure:1507: found /Developer/usr/bin//gcc
    configure:1517: result: gcc
    configure:1761: checking for C compiler version
    configure:1764: gcc --version </dev/null >&5
    i686-apple-darwin11-llvm-gcc-4.2 (GCC) 4.2.1 (Based on Apple Inc. build 5658) (LLVM build 2336.1.00)
    Copyright (C) 2007 Free Software Foundation, Inc.
    This is free software; see the source for copying conditions.  There is NO
    warranty; not even for MERCHANTABILITY or FITNESS FOR A PARTICULAR PURPOSE.
    configure:1767: $? = 0
    configure:1769: gcc -v </dev/null >&5
    Using built-in specs.
    Target: i686-apple-darwin11
    Configured with: /private/var/tmp/llvmgcc42/llvmgcc42-2336.1~22/src/configure --disable-checking --enable-werror --prefix=/Developer/usr/llvm-gcc-4.2 --mandir=/share/man --enable-languages=c,objc,c++,obj-c++ --program-prefix=llvm- --program-transform-name=/^[cg][^.-]*$/s/$/-4.2/ --with-slibdir=/usr/lib --build=i686-apple-darwin11 --enable-llvm=/private/var/tmp/llvmgcc42/llvmgcc42-2336.1~22/dst-llvmCore/Devel oper/usr/local --program-prefix=i686-apple-darwin11- --host=x86_64-apple-darwin11 --target=i686-apple-darwin11 --with-gxx-include-dir=/usr/include/c++/4.2.1
    Thread model: posix
    gcc version 4.2.1 (Based on Apple Inc. build 5658) (LLVM build 2336.1.00)
    configure:1772: $? = 0
    configure:1774: gcc -V </dev/null >&5
    llvm-gcc-4.2: argument to `-V' is missing
    configure:1777: $? = 1
    configure:1800: checking for C compiler default output file name
    configure:1803: gcc    conftest.c  >&5
    ld: library not found for -lcrt1.10.6.o
    collect2: ld returned 1 exit status
    configure:1806: $? = 1
    configure: failed program was:
    | /* confdefs.h.  */
    |
    | #define PACKAGE_NAME ""
    | #define PACKAGE_TARNAME ""
    | #define PACKAGE_VERSION ""
    | #define PACKAGE_STRING ""
    | #define PACKAGE_BUGREPORT ""
    | #define DEFAULT_FILE_FORMAT 2
    | /* end confdefs.h.  */
    |
    | int
    | main ()
    | {
    |
    |   ;
    |   return 0;
    | }
    configure:1845: error: C compiler cannot create executables
    See `config.log' for more details.
    ## Cache variables. ##
    ac_cv_env_CC_set=
    ac_cv_env_CC_value=
    ac_cv_env_CFLAGS_set=
    ac_cv_env_CFLAGS_value=
    ac_cv_env_CPPFLAGS_set=
    ac_cv_env_CPPFLAGS_value=
    ac_cv_env_CPP_set=
    ac_cv_env_CPP_value=
    ac_cv_env_LDFLAGS_set=
    ac_cv_env_LDFLAGS_value=
    ac_cv_env_build_alias_set=
    ac_cv_env_build_alias_value=
    ac_cv_env_host_alias_set=
    ac_cv_env_host_alias_value=
    ac_cv_env_target_alias_set=
    ac_cv_env_target_alias_value=
    ac_cv_prog_ac_ct_CC=gcc
    ## Output variables. ##
    CC='gcc'
    CFLAGS=''
    CPP=''
    CPPFLAGS=''
    DEFS=''
    ECHO_C='ECHO_N=''
    ECHO_T=''
    EGREP=''
    EXEEXT=''
    LDFLAGS=''
    LIBOBJS=''
    LIBS=''
    LN_S=''
    LTLIBOBJS=''
    OBJEXT=''
    PACKAGE_BUGREPORT=''
    PACKAGE_NAME=''
    PACKAGE_STRING=''
    PACKAGE_TARNAME=''
    PACKAGE_VERSION=''
    PATH_SEPARATOR=':'
    SHELL='/bin/sh'
    STRIP=''
    ac_ct_CC='gcc'
    bindir='${exec_prefix}/bin'
    build_alias=''
    datadir='${prefix}/share'
    exec_prefix='NONE'
    host_alias=''
    includedir='${prefix}/include'
    infodir='${prefix}/info'
    install_targets='install-ctags'
    libdir='${exec_prefix}/lib'
    libexecdir='${exec_prefix}/libexec'
    localstatedir='${prefix}/var'
    mandir='${prefix}/man'
    oldincludedir='/usr/include'
    prefix='NONE'
    program_transform_name='s,x,x,'
    sbindir='${exec_prefix}/sbin'
    sharedstatedir='${prefix}/com'
    sort_found=''
    sysconfdir='${prefix}/etc'
    target_alias=''
    ## confdefs.h. ##
    #define DEFAULT_FILE_FORMAT 2
    #define PACKAGE_BUGREPORT ""
    #define PACKAGE_NAME ""
    #define PACKAGE_STRING ""
    #define PACKAGE_TARNAME ""
    #define PACKAGE_VERSION ""
    configure: exit 77

    ctags comes Mountain Lion. If you wish to download and install a newer version, it compiles perfectly. I don't know what problem the original poster had. If you are having specific problems, I suggest you post exactly what problems you are having in your own thread in the Developer Forums.

  • [SOLVED] configure: error: C compiler cannot create executables

    I have tried to build three AUR packages, but the builds always fail with the following output:
    ==> Entering fakeroot environment...
    ==> Starting build()...
    checking build system type... i686-pc-linux-gnu
    checking host system type... i686-pc-linux-gnu
    checking build system type... (cached) i686-pc-linux-gnu
    checking target system type... i686-pc-linux-gnu
    checking for a BSD-compatible install... /bin/install -c
    checking whether build environment is sane... yes
    checking for a thread-safe mkdir -p... /bin/mkdir -p
    checking for gawk... gawk
    checking whether make sets $(MAKE)... no
    checking for style of include used by make... none
    checking for gcc... gcc
    checking for C compiler default output file name...
    configure: error: in `/home/learner/builds/tuxmath/src/tuxmath_w_fonts-1.7.2':
    configure: error: C compiler cannot create executables
    See `config.log' for more details.
    ==> ERROR: Build Failed.
    Aborting...
    I could not find the indicated config.log file.
    I installed all the dependencies indicated in the wiki, but I have a feeling I must be missing basic in my configuration.  Both gcc and base-devel are installed.  I've also run makepkg as root.  What amI doing wrong?
    Last edited by intelligo (2010-02-04 00:33:14)

    Here's the config,log:
    This file contains any messages produced by compilers while
    running configure, to aid debugging if configure makes a mistake.
    It was created by Tux Of Math Command configure 1.7.2, which was
    generated by GNU Autoconf 2.63. Invocation command line was
    $ ./configure --prefix=/usr
    ## Platform. ##
    hostname = uknow4kids
    uname -m = i686
    uname -r = 2.6.32-ARCH
    uname -s = Linux
    uname -v = #1 SMP PREEMPT Mon Jan 25 20:06:48 UTC 2010
    /usr/bin/uname -p = unknown
    /bin/uname -X = unknown
    /bin/arch = i686
    /usr/bin/arch -k = unknown
    /usr/convex/getsysinfo = unknown
    /usr/bin/hostinfo = unknown
    /bin/machine = unknown
    /usr/bin/oslevel = unknown
    /bin/universe = unknown
    PATH: /bin
    PATH: /usr/bin
    PATH: /sbin
    PATH: /usr/sbin
    PATH: /usr/bin/perlbin/site
    PATH: /usr/bin/perlbin/vendor
    PATH: /usr/bin/perlbin/core
    ## Core tests. ##
    configure:1951: checking build system type
    configure:1969: result: i686-pc-linux-gnu
    configure:1991: checking host system type
    configure:2006: result: i686-pc-linux-gnu
    configure:2034: checking build system type
    configure:2052: result: i686-pc-linux-gnu
    configure:2074: checking target system type
    configure:2089: result: i686-pc-linux-gnu
    configure:2134: checking for a BSD-compatible install
    configure:2202: result: /bin/install -c
    configure:2213: checking whether build environment is sane
    configure:2256: result: yes
    configure:2281: checking for a thread-safe mkdir -p
    configure:2320: result: /bin/mkdir -p
    configure:2333: checking for gawk
    configure:2349: found /bin/gawk
    configure:2360: result: gawk
    configure:2371: checking whether make sets $(MAKE)
    configure:2397: result: no
    configure:2604: checking for style of include used by make
    configure:2632: result: none
    configure:2702: checking for gcc
    configure:2718: found /usr/bin/gcc
    configure:2729: result: gcc
    configure:2961: checking for C compiler version
    configure:2969: gcc --version >&5
    gcc (GCC) 4.4.3
    Copyright (C) 2010 Free Software Foundation, Inc.
    This is free software; see the source for copying conditions. There is NO
    warranty; not even for MERCHANTABILITY or FITNESS FOR A PARTICULAR PURPOSE.
    configure:2973: $? = 0
    configure:2980: gcc -v >&5
    Using built-in specs.
    Target: i686-pc-linux-gnu
    Configured with: ../configure --prefix=/usr --enable-shared --enable-languages=c,c++,fortran,objc,obj-c++,ada --enable-threads=posix --mandir=/usr/share/man --infodir=/usr/share/info --enable-__cxa_atexit --disable-multilib --libdir=/usr/lib --libexecdir=/usr/lib --enable-clocale=gnu --disable-libstdcxx-pch --with-tune=generic
    Thread model: posix
    gcc version 4.4.3 (GCC)
    configure:2984: $? = 0
    configure:2991: gcc -V >&5
    gcc: '-V' option must have argument
    configure:2995: $? = 1
    configure:3018: checking for C compiler default output file name
    configure:3040: gcc -march=i686 -mtune=generic -O2 -pipe -Wl,--hash-style=gnu -Wl,--as-needed conftest.c >&5
    gcc: error trying to exec '/usr/lib/gcc/i686-pc-linux-gnu/4.4.3/cc1': execv: Exec format error
    configure:3044: $? = 1
    configure:3082: result:
    configure: failed program was:
    | /* confdefs.h. */
    | #define PACKAGE_NAME "Tux Of Math Command"
    | #define PACKAGE_TARNAME "tuxmath"
    | #define PACKAGE_VERSION "1.7.2"
    | #define PACKAGE_STRING "Tux Of Math Command 1.7.2"
    | #define PACKAGE_BUGREPORT "[email protected]"
    | #define PACKAGE "tuxmath"
    | #define VERSION "1.7.2"
    | #define PROGRAM_NAME "tuxmath"
    | /* end confdefs.h. */
    |
    | int
    | main ()
    | {
    |
    | ;
    | return 0;
    | }
    configure:3088: error: in `/home/learner/builds/tuxmath/src/tuxmath_w_fonts-1.7.2':
    configure:3091: error: C compiler cannot create executables
    See `config.log' for more details.
    ## Cache variables. ##
    ac_cv_build=i686-pc-linux-gnu
    ac_cv_env_CC_set=
    ac_cv_env_CC_value=
    ac_cv_env_CFLAGS_set=set
    ac_cv_env_CFLAGS_value='-march=i686 -mtune=generic -O2 -pipe'
    ac_cv_env_CPPFLAGS_set=
    ac_cv_env_CPPFLAGS_value=
    ac_cv_env_CPP_set=
    ac_cv_env_CPP_value=
    ac_cv_env_LDFLAGS_set=set
    ac_cv_env_LDFLAGS_value='-Wl,--hash-style=gnu -Wl,--as-needed'
    ac_cv_env_LIBS_set=
    ac_cv_env_LIBS_value=
    ac_cv_env_YACC_set=
    ac_cv_env_YACC_value=
    ac_cv_env_YFLAGS_set=
    ac_cv_env_YFLAGS_value=
    ac_cv_env_build_alias_set=
    ac_cv_env_build_alias_value=
    ac_cv_env_host_alias_set=
    ac_cv_env_host_alias_value=
    ac_cv_env_target_alias_set=
    ac_cv_env_target_alias_value=
    ac_cv_host=i686-pc-linux-gnu
    ac_cv_path_install='/bin/install -c'
    ac_cv_path_mkdir=/bin/mkdir
    ac_cv_prog_AWK=gawk
    ac_cv_prog_ac_ct_CC=gcc
    ac_cv_prog_make_make_set=no
    ac_cv_target=i686-pc-linux-gnu
    ## Output variables. ##
    ACLOCAL='${SHELL} /home/learner/builds/tuxmath/src/tuxmath_w_fonts-1.7.2/missing --run aclocal-1.10'
    ALLOCA=''
    AMDEPBACKSLASH='\'
    AMDEP_FALSE='#'
    AMDEP_TRUE=''
    AMTAR='${SHELL} /home/learner/builds/tuxmath/src/tuxmath_w_fonts-1.7.2/missing --run tar'
    AUTOCONF='${SHELL} /home/learner/builds/tuxmath/src/tuxmath_w_fonts-1.7.2/missing --run autoconf'
    AUTOHEADER='${SHELL} /home/learner/builds/tuxmath/src/tuxmath_w_fonts-1.7.2/missing --run autoheader'
    AUTOMAKE='${SHELL} /home/learner/builds/tuxmath/src/tuxmath_w_fonts-1.7.2/missing --run automake-1.10'
    AWK='gawk'
    BUILD_MINGW32_FALSE=''
    BUILD_MINGW32_TRUE=''
    CC='gcc'
    CCDEPMODE=''
    CFLAGS='-march=i686 -mtune=generic -O2 -pipe'
    CPP=''
    CPPFLAGS=''
    CYGPATH_W='echo'
    DEFS=''
    DEPDIR='.deps'
    ECHO_C=''
    ECHO_N='-n'
    ECHO_T=''
    EGREP=''
    EXEEXT=''
    GETTEXT_MACRO_VERSION=''
    GMSGFMT=''
    GMSGFMT_015=''
    GREP=''
    INSTALL_DATA='${INSTALL} -m 644'
    INSTALL_PROGRAM='${INSTALL}'
    INSTALL_SCRIPT='${INSTALL}'
    INSTALL_STRIP_PROGRAM='$(install_sh) -c -s'
    INTLLIBS=''
    INTL_MACOSX_LIBS=''
    LDFLAGS='-Wl,--hash-style=gnu -Wl,--as-needed'
    LIBICONV=''
    LIBINTL=''
    LIBOBJS=''
    LIBS=''
    LTLIBICONV=''
    LTLIBINTL=''
    LTLIBOBJS=''
    MAKEINFO='${SHELL} /home/learner/builds/tuxmath/src/tuxmath_w_fonts-1.7.2/missing --run makeinfo'
    MKDIR_P='/bin/mkdir -p'
    MSGFMT=''
    MSGFMT_015=''
    MSGMERGE=''
    NAME_VERSION='tuxmath-1.7.2'
    NSIS=''
    NSI_BUILD_FALSE=''
    NSI_BUILD_TRUE=''
    NSI_DLL_DIR=''
    NSI_INSTALL_DIR=''
    OBJEXT=''
    PACKAGE='tuxmath'
    PACKAGE_BUGREPORT='[email protected]'
    PACKAGE_NAME='Tux Of Math Command'
    PACKAGE_STRING='Tux Of Math Command 1.7.2'
    PACKAGE_TARNAME='tuxmath'
    PACKAGE_VERSION='1.7.2'
    PATH_SEPARATOR=':'
    POSUB=''
    POW_LIB=''
    RANLIB=''
    SDL_CFLAGS=''
    SDL_CONFIG=''
    SDL_LIBS=''
    SET_MAKE='MAKE=make'
    SHELL='/bin/sh'
    STRIP=''
    USE_NLS=''
    VERSION='1.7.2'
    WINDRES=''
    XGETTEXT=''
    XGETTEXT_015=''
    XGETTEXT_EXTRA_OPTIONS=''
    YACC=''
    YFLAGS=''
    ac_ct_CC='gcc'
    am__fastdepCC_FALSE=''
    am__fastdepCC_TRUE=''
    am__include='#'
    am__isrc=''
    am__leading_dot='.'
    am__quote=''
    am__tar='${AMTAR} chof - "$$tardir"'
    am__untar='${AMTAR} xf -'
    bindir='${exec_prefix}/bin'
    build='i686-pc-linux-gnu'
    build_alias=''
    build_cpu='i686'
    build_os='linux-gnu'
    build_vendor='pc'
    datadir='${datarootdir}'
    datarootdir='${prefix}/share'
    docdir='${datarootdir}/doc/${PACKAGE_TARNAME}'
    dvidir='${docdir}'
    exec_prefix='NONE'
    host='i686-pc-linux-gnu'
    host_alias=''
    host_cpu='i686'
    host_os='linux-gnu'
    host_vendor='pc'
    htmldir='${docdir}'
    includedir='${prefix}/include'
    infodir='${datarootdir}/info'
    install_sh='$(SHELL) /home/learner/builds/tuxmath/src/tuxmath_w_fonts-1.7.2/install-sh'
    libdir='${exec_prefix}/lib'
    libexecdir='${exec_prefix}/libexec'
    localedir='${datarootdir}/locale'
    localstatedir='${prefix}/var'
    mandir='${datarootdir}/man'
    mkdir_p='/bin/mkdir -p'
    oldincludedir='/usr/include'
    pdfdir='${docdir}'
    prefix='/usr'
    program_transform_name='s,x,x,'
    psdir='${docdir}'
    sbindir='${exec_prefix}/sbin'
    sharedstatedir='${prefix}/com'
    sysconfdir='${prefix}/etc'
    target='i686-pc-linux-gnu'
    target_alias=''
    target_cpu='i686'
    target_os='linux-gnu'
    target_vendor='pc'
    ## confdefs.h. ##
    #define PACKAGE_NAME "Tux Of Math Command"
    #define PACKAGE_TARNAME "tuxmath"
    #define PACKAGE_VERSION "1.7.2"
    #define PACKAGE_STRING "Tux Of Math Command 1.7.2"
    #define PACKAGE_BUGREPORT "[email protected]"
    #define PACKAGE "tuxmath"
    #define VERSION "1.7.2"
    #define PROGRAM_NAME "tuxmath"
    configure: exit 77
    And here's makepkg.conf:
    # /etc/makepkg.conf
    # SOURCE ACQUISITION
    #-- The download utilities that makepkg should use to acquire sources
    # Format: 'protocol::agent'
    DLAGENTS=('ftp::/usr/bin/wget -c --passive-ftp -t 3 --waitretry=3 -O %o %u'
    'http::/usr/bin/wget -c -t 3 --waitretry=3 -O %o %u'
    'https::/usr/bin/wget -c -t 3 --waitretry=3 --no-check-certificate -O %o %u'
    'rsync::/usr/bin/rsync -z %u %o'
    'scp::/usr/bin/scp -C %u %o')
    # Other common tools:
    # /usr/bin/snarf
    # /usr/bin/lftpget -c
    # /usr/bin/curl
    # ARCHITECTURE, COMPILE FLAGS
    CARCH="i686"
    CHOST="i686-pc-linux-gnu"
    #-- Exclusive: will only run on i686
    # -march (or -mcpu) builds exclusively for an architecture
    # -mtune optimizes for an architecture, but builds for whole processor family
    CFLAGS="-march=i686 -mtune=generic -O2 -pipe"
    CXXFLAGS="-march=i686 -mtune=generic -O2 -pipe"
    LDFLAGS="-Wl,--hash-style=gnu -Wl,--as-needed"
    #-- Make Flags: change this for DistCC/SMP systems
    #MAKEFLAGS="-j2"
    # BUILD ENVIRONMENT
    # Defaults: BUILDENV=(fakeroot !distcc color !ccache)
    # A negated environment option will do the opposite of the comments below.
    #-- fakeroot: Allow building packages as a non-root user
    #-- distcc: Use the Distributed C/C++/ObjC compiler
    #-- color: Colorize output messages
    #-- ccache: Use ccache to cache compilation
    BUILDENV=(fakeroot !distcc color !ccache)
    #-- If using DistCC, your MAKEFLAGS will also need modification. In addition,
    #-- specify a space-delimited list of hosts running in the DistCC cluster.
    #DISTCC_HOSTS=""
    # GLOBAL PACKAGE OPTIONS
    # These are default values for the options=() settings
    # Default: OPTIONS=(strip docs libtool emptydirs zipman purge)
    # A negated option will do the opposite of the comments below.
    #-- strip: Strip symbols from binaries/libraries in STRIP_DIRS
    #-- docs: Save doc directories specified by DOC_DIRS
    #-- libtool: Leave libtool (.la) files in packages
    #-- emptydirs: Leave empty directories in packages
    #-- zipman: Compress manual (man and info) pages in MAN_DIRS with gzip
    #-- purge: Remove files specified by PURGE_TARGETS
    OPTIONS=(strip docs libtool emptydirs zipman purge)
    #-- File integrity checks to use. Valid: md5, sha1, sha256, sha384, sha512
    INTEGRITY_CHECK=(md5)
    #-- Manual (man and info) directories to compress (if zipman is specified)
    MAN_DIRS=({usr{,/local}{,/share},opt/*}/{man,info})
    #-- Doc directories to remove (if !docs is specified)
    DOC_DIRS=(usr/{,local/}{,share/}{doc,gtk-doc} opt/*/{doc,gtk-doc})
    #-- Directories to be searched for the strip option (if strip is specified)
    STRIP_DIRS=(bin lib sbin usr/{bin,lib,sbin,local/{bin,lib,sbin}} opt/*/{bin,lib,sbin})
    #-- Files to be removed from all packages (if purge is specified)
    PURGE_TARGETS=(usr/{,share}/info/dir .packlist *.pod)
    # PACKAGE OUTPUT
    # Default: put built package and cached source in build directory
    #-- Destination: specify a fixed directory where all packages will be placed
    #PKGDEST=/home/packages
    #-- Source cache: specify a fixed directory where source files will be cached
    #SRCDEST=/home/sources
    #-- Packager: name/email of the person or organization building packages
    #PACKAGER="John Doe <[email protected]>"
    # EXTENSION DEFAULTS
    # WARNING: Do NOT modify these variables unless you know what you are
    # doing.
    PKGEXT='.pkg.tar.gz'
    SRCEXT='.src.tar.gz'
    # vim: set ft=sh ts=2 sw=2 et:
    Thanks for your help!

  • [Solved] error: C compiler cannot create executables; see 'config.log'

    Trying to build avant-window-navigator from the aur using yaourt results in this error message.  I recently upgraded my system and suspect this may be the cause, but I'm not sure how to proceed from here.  My config.log follows.
    This file contains any messages produced by compilers while
    running configure, to aid debugging if configure makes a mistake.
    It was created by avant-window-navigator configure 0.4.1, which was
    generated by GNU Autoconf 2.68. Invocation command line was
    $ ./configure --prefix=/usr --sysconfdir=/usr/share --disable-static --disable-pymod-checks
    ## Platform. ##
    hostname = vectorman
    uname -m = x86_64
    uname -r = 3.2.7-1-ARCH
    uname -s = Linux
    uname -v = #1 SMP PREEMPT Tue Feb 21 09:51:29 CET 2012
    /usr/bin/uname -p = unknown
    /bin/uname -X = unknown
    /bin/arch = x86_64
    /usr/bin/arch -k = unknown
    /usr/convex/getsysinfo = unknown
    /usr/bin/hostinfo = unknown
    /bin/machine = unknown
    /usr/bin/oslevel = unknown
    /bin/universe = unknown
    PATH: /usr/local/bin
    PATH: /usr/bin
    PATH: /bin
    PATH: /usr/local/sbin
    PATH: /usr/sbin
    PATH: /sbin
    PATH: /usr/bin/vendor_perl
    PATH: /usr/bin/core_perl
    ## Core tests. ##
    configure:2498: checking for a BSD-compatible install
    configure:2566: result: /bin/install -c
    configure:2577: checking whether build environment is sane
    configure:2627: result: yes
    configure:2768: checking for a thread-safe mkdir -p
    configure:2807: result: /bin/mkdir -p
    configure:2820: checking for gawk
    configure:2836: found /usr/bin/gawk
    configure:2847: result: gawk
    configure:2858: checking whether make sets $(MAKE)
    configure:2880: result: yes
    configure:2961: checking whether to enable maintainer-specific portions of Makefiles
    configure:2970: result: no
    configure:2999: checking for style of include used by make
    configure:3027: result: GNU
    configure:3098: checking for gcc
    configure:3114: found /usr/bin/gcc
    configure:3125: result: gcc
    configure:3354: checking for C compiler version
    configure:3363: gcc --version >&5
    gcc (GCC) 4.6.2 20111223 (prerelease)
    Copyright (C) 2011 Free Software Foundation, Inc.
    This is free software; see the source for copying conditions. There is NO
    warranty; not even for MERCHANTABILITY or FITNESS FOR A PARTICULAR PURPOSE.
    configure:3374: $? = 0
    configure:3363: gcc -v >&5
    Using built-in specs.
    COLLECT_GCC=gcc
    COLLECT_LTO_WRAPPER=/usr/lib/gcc/x86_64-unknown-linux-gnu/4.6.2/lto-wrapper
    Target: x86_64-unknown-linux-gnu
    Configured with: /build/src/gcc-4.6-20111223/configure --prefix=/usr --libdir=/usr/lib --libexecdir=/usr/lib --mandir=/usr/share/man --infodir=/usr/share/info --with-bugurl=https://bugs.archlinux.org/ --enable-languages=c,c++,ada,fortran,go,lto,objc,obj-c++ --enable-shared --enable-threads=posix --with-system-zlib --enable-__cxa_atexit --disable-libunwind-exceptions --enable-clocale=gnu --enable-gnu-unique-object --enable-linker-build-id --with-ppl --enable-cloog-backend=isl --enable-lto --enable-gold --enable-ld=default --enable-plugin --with-plugin-ld=ld.gold --enable-multilib --disable-libssp --disable-libstdcxx-pch --enable-checking=release --with-fpmath=sse
    Thread model: posix
    gcc version 4.6.2 20111223 (prerelease) (GCC)
    configure:3374: $? = 0
    configure:3363: gcc -V >&5
    gcc: error: unrecognized option '-V'
    gcc: fatal error: no input files
    compilation terminated.
    configure:3374: $? = 1
    configure:3363: gcc -qversion >&5
    gcc: error: unrecognized option '-qversion'
    gcc: fatal error: no input files
    compilation terminated.
    configure:3374: $? = 1
    configure:3394: checking whether the C compiler works
    configure:3416: gcc -march=x86-64 -mtune=generic -O2 -pipe -Wl,--hash-style=gnu -Wl,--as-needed conftest.c >&5
    /usr/lib/gcc/x86_64-unknown-linux-gnu/4.6.2/cc1: error while loading shared libraries: libcloog-isl.so.2: cannot open shared object file: No such file or directory
    configure:3420: $? = 1
    configure:3458: result: no
    configure: failed program was:
    | /* confdefs.h */
    | #define PACKAGE_NAME "avant-window-navigator"
    | #define PACKAGE_TARNAME "avant-window-navigator"
    | #define PACKAGE_VERSION "0.4.1"
    | #define PACKAGE_STRING "avant-window-navigator 0.4.1"
    | #define PACKAGE_BUGREPORT "https://bugs.launchpad.net/awn"
    | #define PACKAGE_URL ""
    | #define EXTRA_VERSION ""
    | #define PACKAGE "avant-window-navigator"
    | #define VERSION "0.4.1"
    | /* end confdefs.h. */
    |
    | int
    | main ()
    | {
    |
    | ;
    | return 0;
    | }
    configure:3463: error: in `/tmp/yaourt-tmp-terry/aur-avant-window-navigator-bzr/src/awn-build':
    configure:3465: error: C compiler cannot create executables
    See `config.log' for more details
    ## Cache variables. ##
    ac_cv_env_AWN_CFLAGS_set=
    ac_cv_env_AWN_CFLAGS_value=
    ac_cv_env_AWN_LIBS_set=
    ac_cv_env_AWN_LIBS_value=
    ac_cv_env_CC_set=
    ac_cv_env_CC_value=
    ac_cv_env_CFLAGS_set=set
    ac_cv_env_CFLAGS_value='-march=x86-64 -mtune=generic -O2 -pipe'
    ac_cv_env_CPPFLAGS_set=
    ac_cv_env_CPPFLAGS_value=
    ac_cv_env_CPP_set=
    ac_cv_env_CPP_value=
    ac_cv_env_DOCK_CFLAGS_set=
    ac_cv_env_DOCK_CFLAGS_value=
    ac_cv_env_DOCK_LIBS_set=
    ac_cv_env_DOCK_LIBS_value=
    ac_cv_env_GTKDOC_DEPS_CFLAGS_set=
    ac_cv_env_GTKDOC_DEPS_CFLAGS_value=
    ac_cv_env_GTKDOC_DEPS_LIBS_set=
    ac_cv_env_GTKDOC_DEPS_LIBS_value=
    ac_cv_env_LDFLAGS_set=set
    ac_cv_env_LDFLAGS_value='-Wl,--hash-style=gnu -Wl,--as-needed'
    ac_cv_env_LIBS_set=
    ac_cv_env_LIBS_value=
    ac_cv_env_PKG_CONFIG_LIBDIR_set=
    ac_cv_env_PKG_CONFIG_LIBDIR_value=
    ac_cv_env_PKG_CONFIG_PATH_set=
    ac_cv_env_PKG_CONFIG_PATH_value=
    ac_cv_env_PKG_CONFIG_set=
    ac_cv_env_PKG_CONFIG_value=
    ac_cv_env_PYGTK_CFLAGS_set=
    ac_cv_env_PYGTK_CFLAGS_value=
    ac_cv_env_PYGTK_LIBS_set=
    ac_cv_env_PYGTK_LIBS_value=
    ac_cv_env_PYTHON_set=set
    ac_cv_env_PYTHON_value=/usr/bin/python2
    ac_cv_env_TASKMANAGER_CFLAGS_set=
    ac_cv_env_TASKMANAGER_CFLAGS_value=
    ac_cv_env_TASKMANAGER_LIBS_set=
    ac_cv_env_TASKMANAGER_LIBS_value=
    ac_cv_env_build_alias_set=
    ac_cv_env_build_alias_value=
    ac_cv_env_host_alias_set=
    ac_cv_env_host_alias_value=
    ac_cv_env_target_alias_set=
    ac_cv_env_target_alias_value=
    ac_cv_path_install='/bin/install -c'
    ac_cv_path_mkdir=/bin/mkdir
    ac_cv_prog_AWK=gawk
    ac_cv_prog_ac_ct_CC=gcc
    ac_cv_prog_make_make_set=yes
    ## Output variables. ##
    ACLOCAL='${SHELL} /tmp/yaourt-tmp-terry/aur-avant-window-navigator-bzr/src/awn-build/missing --run aclocal-1.11'
    ACLOCAL_AMFLAGS='${ACLOCAL_FLAGS}'
    ALL_LINGUAS=''
    AMDEPBACKSLASH='\'
    AMDEP_FALSE='#'
    AMDEP_TRUE=''
    AMTAR='$${TAR-tar}'
    AM_DEFAULT_VERBOSITY=''
    AM_MAKEFLAGS=''
    APPLETSDIR=''
    AR=''
    AUTOCONF='${SHELL} /tmp/yaourt-tmp-terry/aur-avant-window-navigator-bzr/src/awn-build/missing --run autoconf'
    AUTOHEADER='${SHELL} /tmp/yaourt-tmp-terry/aur-avant-window-navigator-bzr/src/awn-build/missing --run autoheader'
    AUTOMAKE='${SHELL} /tmp/yaourt-tmp-terry/aur-avant-window-navigator-bzr/src/awn-build/missing --run automake-1.11'
    AWK='gawk'
    AWN_CFLAGS=''
    AWN_LIBS=''
    CATALOGS=''
    CATOBJEXT=''
    CC='gcc'
    CCDEPMODE=''
    CFLAGS='-march=x86-64 -mtune=generic -O2 -pipe'
    CPP=''
    CPPFLAGS=''
    CXX=''
    CYGPATH_W='echo'
    DATADIR=''
    DATADIRNAME=''
    DBUS_GLIB_BIN=''
    DEFS=''
    DEPDIR='.deps'
    DISABLE_DEPRECATED_FLAGS=''
    DLLTOOL=''
    DOCK_CFLAGS=''
    DOCK_LIBS=''
    DOLT_BASH=''
    DSYMUTIL=''
    DUMPBIN=''
    ECHO_C=''
    ECHO_N='-n'
    ECHO_T=''
    EGREP=''
    ENABLE_GTK_DOC_FALSE=''
    ENABLE_GTK_DOC_TRUE=''
    EXEEXT=''
    EXTRA_VERSION=''
    F77=''
    FC=''
    FGREP=''
    GCONFTOOL=''
    GCONF_SCHEMAS_INSTALL_FALSE=''
    GCONF_SCHEMAS_INSTALL_TRUE=''
    GCONF_SCHEMA_CONFIG_SOURCE=''
    GCONF_SCHEMA_FILE_DIR=''
    GETTEXT_PACKAGE=''
    GLIB_GENMARSHAL=''
    GMOFILES=''
    GMSGFMT=''
    GREP=''
    GTKDOC_CHECK=''
    GTKDOC_DEPS_CFLAGS=''
    GTKDOC_DEPS_LIBS=''
    GTKDOC_MKPDF=''
    GTKDOC_REBASE=''
    GTK_DOC_BUILD_HTML_FALSE=''
    GTK_DOC_BUILD_HTML_TRUE=''
    GTK_DOC_BUILD_PDF_FALSE=''
    GTK_DOC_BUILD_PDF_TRUE=''
    GTK_DOC_USE_LIBTOOL_FALSE=''
    GTK_DOC_USE_LIBTOOL_TRUE=''
    GTK_DOC_USE_REBASE_FALSE=''
    GTK_DOC_USE_REBASE_TRUE=''
    HTML_DIR=''
    INSTALL_DATA='${INSTALL} -m 644'
    INSTALL_PROGRAM='${INSTALL}'
    INSTALL_SCRIPT='${INSTALL}'
    INSTALL_STRIP_PROGRAM='$(install_sh) -c -s'
    INSTOBJEXT=''
    INTLLIBS=''
    INTLTOOL_CAVES_RULE=''
    INTLTOOL_DESKTOP_RULE=''
    INTLTOOL_DIRECTORY_RULE=''
    INTLTOOL_EXTRACT=''
    INTLTOOL_KBD_RULE=''
    INTLTOOL_KEYS_RULE=''
    INTLTOOL_MERGE=''
    INTLTOOL_OAF_RULE=''
    INTLTOOL_PERL=''
    INTLTOOL_POLICY_RULE=''
    INTLTOOL_PONG_RULE=''
    INTLTOOL_PROP_RULE=''
    INTLTOOL_SCHEMAS_RULE=''
    INTLTOOL_SCHEMA_INI_RULE=''
    INTLTOOL_SERVER_RULE=''
    INTLTOOL_SERVICE_RULE=''
    INTLTOOL_SHEET_RULE=''
    INTLTOOL_SOUNDLIST_RULE=''
    INTLTOOL_THEME_RULE=''
    INTLTOOL_UI_RULE=''
    INTLTOOL_UPDATE=''
    INTLTOOL_V_MERGE=''
    INTLTOOL_V_MERGE_OPTIONS=''
    INTLTOOL_XAM_RULE=''
    INTLTOOL_XML_NOMERGE_RULE=''
    INTLTOOL_XML_RULE=''
    INTLTOOL__v_MERGE_0=''
    INTLTOOL__v_MERGE_=''
    LD=''
    LDA_BINDIR=''
    LDA_DEFSDIR=''
    LDA_VAPIDIR=''
    LDFLAGS='-Wl,--hash-style=gnu -Wl,--as-needed'
    LIBAPPLETDIR=''
    LIBDIR=''
    LIBOBJS=''
    LIBRARY_MODULES=''
    LIBS=''
    LIBTOOL=''
    LIPO=''
    LN_S=''
    LOCALEDIR=''
    LTCOMPILE=''
    LTCXXCOMPILE=''
    LTLIBOBJS=''
    MAINT='#'
    MAINTAINER_MODE_FALSE=''
    MAINTAINER_MODE_TRUE='#'
    MAKEFLAGS=''
    MAKEINFO='${SHELL} /tmp/yaourt-tmp-terry/aur-avant-window-navigator-bzr/src/awn-build/missing --run makeinfo'
    MANIFEST_TOOL=''
    MKDIR_P='/bin/mkdir -p'
    MKINSTALLDIRS=''
    MSGFMT=''
    MSGFMT_OPTS=''
    MSGMERGE=''
    NM=''
    NMEDIT=''
    OBJDUMP=''
    OBJEXT=''
    OTOOL64=''
    OTOOL=''
    PACKAGE='avant-window-navigator'
    PACKAGE_BUGREPORT='https://bugs.launchpad.net/awn'
    PACKAGE_NAME='avant-window-navigator'
    PACKAGE_STRING='avant-window-navigator 0.4.1'
    PACKAGE_TARNAME='avant-window-navigator'
    PACKAGE_URL=''
    PACKAGE_VERSION='0.4.1'
    PATH_SEPARATOR=':'
    PKGDATADIR=''
    PKG_CONFIG=''
    PKG_CONFIG_LIBDIR=''
    PKG_CONFIG_PATH=''
    POFILES=''
    POSUB=''
    PO_IN_DATADIR_FALSE=''
    PO_IN_DATADIR_TRUE=''
    PYGTK_CFLAGS=''
    PYGTK_DEFSDIR=''
    PYGTK_LIBS=''
    PYG_CODEGEN=''
    PYTHON='/usr/bin/python2'
    PYTHON_CPPFLAGS=''
    PYTHON_EXEC_PREFIX=''
    PYTHON_EXTRA_LDFLAGS=''
    PYTHON_EXTRA_LIBS=''
    PYTHON_LDFLAGS=''
    PYTHON_PLATFORM=''
    PYTHON_PREFIX=''
    PYTHON_VERSION=''
    Q=''
    RANLIB=''
    SED=''
    SET_MAKE=''
    SHELL='/bin/sh'
    STANDARD_CPPFLAGS=''
    STRIP=''
    TASKMANAGER_CFLAGS=''
    TASKMANAGER_LIBS=''
    USE_NLS=''
    V=''
    VALAC='/opt/vala-0.12/bin/valac'
    VALA_GEN_INTROSPECT=''
    VAPIGEN=''
    VERSION='0.4.1'
    WARNING_FLAGS=''
    XGETTEXT=''
    ac_ct_AR=''
    ac_ct_CC='gcc'
    ac_ct_DUMPBIN=''
    am__EXEEXT_FALSE=''
    am__EXEEXT_TRUE=''
    am__fastdepCC_FALSE=''
    am__fastdepCC_TRUE=''
    am__include='include'
    am__isrc=''
    am__leading_dot='.'
    am__nodep='_no'
    am__quote=''
    am__tar='$${TAR-tar} chof - "$$tardir"'
    am__untar='$${TAR-tar} xf -'
    bindir='${exec_prefix}/bin'
    build=''
    build_alias=''
    build_cpu=''
    build_os=''
    build_vendor=''
    datadir='${datarootdir}'
    datarootdir='${prefix}/share'
    docdir='${datarootdir}/doc/${PACKAGE_TARNAME}'
    dvidir='${docdir}'
    exec_prefix='NONE'
    host=''
    host_alias=''
    host_cpu=''
    host_os=''
    host_vendor=''
    htmldir='${docdir}'
    includedir='${prefix}/include'
    infodir='${datarootdir}/info'
    install_sh='${SHELL} /tmp/yaourt-tmp-terry/aur-avant-window-navigator-bzr/src/awn-build/install-sh'
    intltool__v_merge_options_0=''
    intltool__v_merge_options_=''
    libdir='${exec_prefix}/lib'
    libexecdir='${exec_prefix}/libexec'
    localedir='${datarootdir}/locale'
    localedir_intermediate=''
    localstatedir='${prefix}/var'
    mandir='${datarootdir}/man'
    mkdir_p='/bin/mkdir -p'
    oldincludedir='/usr/include'
    pdfdir='${docdir}'
    pkgpyexecdir=''
    pkgpythondir=''
    prefix='/usr'
    program_transform_name='s,x,x,'
    psdir='${docdir}'
    pyexecdir=''
    pythondir=''
    sbindir='${exec_prefix}/sbin'
    sharedstatedir='${prefix}/com'
    shavedir=''
    sysconfdir='/usr/share'
    target_alias=''
    ## confdefs.h. ##
    /* confdefs.h */
    #define PACKAGE_NAME "avant-window-navigator"
    #define PACKAGE_TARNAME "avant-window-navigator"
    #define PACKAGE_VERSION "0.4.1"
    #define PACKAGE_STRING "avant-window-navigator 0.4.1"
    #define PACKAGE_BUGREPORT "https://bugs.launchpad.net/awn"
    #define PACKAGE_URL ""
    #define EXTRA_VERSION ""
    #define PACKAGE "avant-window-navigator"
    #define VERSION "0.4.1"
    configure: exit 77
    Last edited by vectorman (2012-02-26 14:47:18)

    /usr/lib/gcc/x86_64-unknown-linux-gnu/4.6.2/cc1: error while loading shared libraries: libcloog-isl.so.2: cannot open shared object file: No such file or directory
    cloog provides libcloog-isl.so cloog /usr/lib/libcloog-isl.so.3 and cloog /usr/lib/libcloog-isl.so.3.0.0 but not libcloog-isl.so.2.
    Edit: https://bbs.archlinux.org/viewtopic.php … 35#p983435
    If your system is fully updated, maybe you're using some custom packages, like glibc https://bbs.archlinux.org/viewtopic.php … 51#p845851
    Last edited by karol (2012-02-26 14:01:30)

  • ORA-12721: operation cannot execute when other sessions are active

    Hi,
    I started my DB like following :
    1) Change INIT.ORA file;  unset parallel_server parameter.
    2) Execute these commands:
    STARTUP MOUNT ;
    ALTER SYSTEM ENABLE RESTRICTED SESSION;
    ALTER SYSTEM SET JOB_QUEUE_PROCESSES=0;
    ALTER SYSTEM SET AQ_TM_PROCESSES=0;
    ALTER DATABASE OPEN;
    SHUTDOWN IMMEDIATE;
    SQL> STARTUP RESTRICT  pfile='C:\oracle\product\10.2.0\db_1\database\initORCL.ora';
    ORACLE instance started.
    SQL> alter database national character set INTERNAL_CONVERT UTF8;
    alter database national character set INTERNAL_CONVERT UTF8
    ERROR at line 1:
    ORA-12721: operation cannot execute when other sessions are activeWhy this error when DB is opened in strict and I'm the only user ?
    SQL> select count (*) from v$session;
      COUNT(*)
            20Any solution ?
    Thank you.

    Hi
    This operation is dangerous, please ensure that you have a full backup before doing that operation.
    Please use that order :
    SHUTDOWN IMMEDIATE;
    -- make sure there is a database backup you can rely on, or create one
    STARTUP MOUNT;
    ALTER SYSTEM ENABLE RESTRICTED SESSION;
    ALTER SYSTEM SET JOB_QUEUE_PROCESSES=0;
    ALTER SYSTEM SET AQ_TM_PROCESSES=0;
    ALTER DATABASE OPEN;
    ALTER DATABASE CHARACTER SET <new_character_set>;
    -- a alter database takes typically only a few minutes or less,
    -- it depends on the number of columns in the database, not the
    -- amount of data.
    SHUTDOWN;
    Please note that :
    The command requires the database to be
    open but only one session, the one executing the command, is allowed.
    For the above error conditions Oracle9i will report one of the errors:
    ORA-12719: operation requires database is in RESTRICTED mode
    ORA-12720: operation requires database is in EXCLUSIVE mode
    ORA-12721: operation cannot execute when other sessions are active
    Oracle9i can also report:
    ORA-12718: operation requires connection as SYS
    if you are not connect as SYS (INTERNAL, "/ AS SYSDBA").
    Let us know if this helps.
    regards,
    Hub
    Edited by: Hub on Dec 10, 2008 1:22 PM

Maybe you are looking for

  • Disk, to Backup the disk connected (via USB) to Airport Extreme

    Hi.. My 1.5TB disk (WD My Book Essential) is connected to Airport Extreme. This disk contains photos, videos, etc. accessible/shared by some MacBook. Now I need to back-up that disk, so probably I need 1 more disk as the backup disk, and the backup p

  • PI 7.0  & PI 7.1

    Experts,    We got PI 7.0  and decided to go ahead with PI 7.1 ,As a  Intial step  we plan to  convert our Sandbox PI 7.0 to PI 7.1. I like to know what is the step for it ( to convert to PI 7.1 ) & What will happen to the existing interface in the S

  • Can't create the user that was deleted by me previously on web.

    1. first, i create one user named "test1", and i can logon using it successfully. 2. then, i delete it in RPD; 3. third, i search out the user "test1" on web and delte it: Settings –> "Oracle BI Presentation Services Administration"–>"Manage Presenta

  • How to write Hebrew in illustrator cc 2014?

    Right now I can write with Hebrew fonts backwards.... How can I set the right direction?

  • Adobe Presenter 10 and compatibility mode

    I use Presenter to create training modules where I work at.  I can publish the module but when the user tries to launch it - they get a blank screen.  I've been shown that staff need to flip into compatibility mode to view the modules.  Is there a wa