Headphone jack issues please help

Help! I was messing with my friend jumping of snow banks while my phone was in my pocket. I noticed snow got near my headphone jack and quickly wiped it off now a couple hours later it permently says headphones are in. What do I do to fix it? And yes, it does work with headphones in.

My son's is having the same problem and I have the same question. Anyone had the problem repaired before?
Don

Similar Messages

  • Mid 2010 15" MBP i5 A1286 POWER ISSUE-PLEASE HELP-

    The MBP works fine when mains connected but the only issue is every time I take the charger out it shuts down on me!!! So I have checked with a multitester & looks good the only thing i find hard to check for power is the battery itself as its hard to get a good connection, also I took to local Apple store & they checked with a new battery but said its still same issue so the guy disconnected nearly all the connecters off to check if they causing issue & he said now the battery is charging.
    So they still have the laptop to do further tests etc, but I’m not sure what could be the problem hear as maybe there is some component which is bad so the battery’s not charging or what else could be the issue please help & advice as I’m really confused as if it was something to do with the logic board then surely it would not even charge even after checking with the multitester or like Apple genius done by disconnecting other components...
    ANY HELP OR ADVICE WOULD BE HELPFULL,
    THANKS GUYS

    THANKS FOR THE HELP GUYS!!! BEEN AROUND 5 DAYS & NOT ONE PERON HAS HELPED...
    BUT YEAH THANKS AGAIN...
    WASTE OF TIME THIS IS...

  • Trackpad Issue - Please Help!

    Hi there,
    Hope you can help me out here.
    I've recently purchased a 15" i7 Macbook pro. The machine is but 3 weeks old &, of course, very well looked after.
    A few days ago, the built-in trackpad started behaving eratically. Cursor moving by itself, not responding to touch, clicking and opening things involuntarily. Not good at all. Many users seem to have had this exact same issue.
    These problems seemed to miraculously stop after a few re-boots and possibly a software update? I really couldn't tell you what resolved the problem.
    Unfortunately I now have a totally different problem.
    There is a thin, possibly 8 to 10mm horizontal strip across the centre of the trackpad that no longer responds to touch. If I move my finger from the botom of the trackpad upwards (or vice versa), the cursor will stop momentarily as it passes over the horizontal strip. The buttons are fine and the rest of the trackpad is fine. For the moment, I've increased the cursor acceleration so that I can at least navigate round the screen with a smaller area of the trackpad. USB magic mouse seems to work fine.
    If anyone else has experienced this &/or found a solution for this issue, please help me out here. I have rifled through endless threads about MBP trackpad issues with little success & do not live close to an apple store/genius bar.
    This is a 3 week old machine that cost me a small fortune. To be getting software/hardware issues so early on in it's lifespan is really rather worrying for the future.
    Appreciate your help here.
    J

    I'm not sure what caused this, but I extended my lunch break and drove the machine down to the Westfield apple store. I didn't have an appointment with the Genius Bar but I managed to persuade one of the staff to speak to a technician in the workshop. She came back into the store and told me that they had replacement trackpads and that , considering the machine was only 3 weeks old, the technicians kindly sandwiched the repair into their timetable at zero cost. 2 Hours later, I now have a perfectly functioning trackpad/machine.
    I can't thank them enough.
    My only gripe is that I couldn't speak to a technician to find out what the problem was, how they resolved it or what causes these issues for future reference. Understanding why these problems occur often helps to build your own framework of understanding. Most of the threads i've read about trackpad issues are largely unresolved with people only speculating the problem/solution.
    The initial issue I had with the trackpad's erratic behaviour seemed to be a well known problem that many are associating with a trackpad firmware update. Unless by pure coincidence I had an immediate & major hardware fault after it, which is unlikely, my personal guess is that the two issues were related.

  • Transport Issue Please help

    Hello,
    I have got a major prolen during transport.
    I have GEMPLOYE1 Which is a time dependient master data. which has Attribute called 0COUNTRY_ID.
    I have a custome attribute Called Actual PSGroup/Grade GPAYSCGR which has a compounpunding attribute 0COUNTRY_ID
    Now when I am trying to transport PSGroup/Grade GPAYSCGR to QA that transport is failing , the log massage is
    Characteristic GEMPLOYE1: Attribute GPAYSCGR compounded to 0COUNTRY_ID has a diff. time-dpdncy
    If any one saw this issue, please help me to fix the same.
    Samit

    Hi Venu,
    We can't add authorisation objects on Individual servers.We need to add authorisations on BWD ie Dev system and transport to BWI QUA system.This is the Process we need to follow as per our rule set.
    So,As the problem mentioned above if i add some auth. objects on BWD DEV system and transport it to BWI QUA system,it is getting transported Successfully to BWI,but the auth.objects what i have added on BW DEV system is not found on BW QUA system.
    What could be the problem for that,Is that the problem with transports like TP error or is it related with some tables of auth.objects...................
    Could u please analyse the problem and tell me the solution for this..........
    Thanks Much
    Swapna.D

  • Headerrenderer issue -Please help

    Headerrenderer issue -Please help
    hi
    I have a datagrid and I am  doing a custom sorting on the grid(by getting data from DB).
    I achieve this by capturing the headerrelease event of datagrid .In thee venthandler I will query from DB and do event.preventdefault to prevent standard grid sorting.
    Now I need to display my own custom ascending/descending arrows in the header.i have created an header renderer for this,
    In the headerrenderer I am lsitening to the headerrelease event of datagrid and in the eventlistener, as per the sortfield, i am trying to make the sort arrow visible/invisible.
    But somehow making the sort arrows visible/invisible is not working.The initial arrow works fine.it is shown the correct column(Name) as done in the init() method.
    The eventhandler is invoked on clicking the column headers and all the alerts are shown.
    Please see the headerrenderer code below and help me.(code is not complete only the relevant part is included)
    <?xml version="1.0" encoding="utf-8"?><mx:HBox   
    xmlns:mx="http://www.adobe.com/2006/mxml" width="100%" height="100%" horizontalScrollPolicy="off" creationComplete="init()" implements="mx.controls.listClasses.IDropInListItemRenderer">  
    public function init():void{
     headerLabel = dataField.label; 
    _dataGrid.addEventListener(DataGridEvent.HEADER_RELEASE,sortChanged,false);  
    if(_dataField.localeCompare('Name')==0)asc.visible=true; } 
    private function sortChanged(e:DataGridEvent){
     var dg:DataGrid=e.currentTarget asDataGrid;
    varcolumn:DataGridColumn = DataGridColumn(e.currentTarget.columns[e.columnIndex]);if(_dataField.localeCompare(e.dataField)==0)
    if(asc.visible ||(!asc.visible&&!desc.visible))
    Alert.show( 
    'in..');
    asc.visible=false;
    desc.visible=true;
    else if(desc.visible){
    asc.visible= true;
    desc.visible=
    false;
    else{
    asc.visible= 
    false;
    desc.visible=
    false;
    ]]>
    </mx:Script>
    <mx:Text text="{_headerLabel}" />
    <mx:Image source="{ascIcon}" id='asc' visible="false">
    <mx:Image source="{descIcon}" id='desc' visible="false"/>
    </mx:HBox>

    I got the solution!!
    i need to assign the headerrendereer to the columns dynamically inorder for this to work:
    if anybody wants to know details of solution let  me know

  • Headphone jack issue solved... ma

    I am on my second zen micro, and guess what? Headphone jack!<SPAN> I was preparing to return it to my local retailer when the ups guy came with my wired remote that I had ordered when I was on my first micro.<SPAN> I decided to try it out just for the hell of it and headphone jack!<SPAN> But wait a minute, what are the odds that the jack on the remote would be defecti've in exactly the same way as the unit itself? Does Malaysia and its many, many solderers have an irrational hatred of headphone jack circuitry no matter what the device?<SPAN> Turns out (at least in my case) no.<SPAN> This is a headphone issue, folks, not a headphone jack issue.<SPAN> What is counter-intuiti've about this is that we all know what headphones do when they fail:<SPAN> either the left or right earbud goes out intermittently in crackly fashion when the wire just above the plug is disturbed, or sometimes just below the earbud itself?the usual wear points.<SPAN> But this failure is different, is it not?<SPAN> There are no crackles. Instead, one channel (not earbud) will fail.<SPAN> In other words, the left channel, for example, will come through both earbuds, so that if you are listening to a Beatles song, you will hear John, Ringo and George playing away, but not Paul singing.<SPAN> But since Paul comes and goes when you wiggle the base of the headphones back and forth in the jack, the assumption is is that the jack is wiggling loose of its contact points.<SPAN> But what really seems to be happening is that an ill-fitting headphone male is wobbling around in its female jack counterpart.<SPAN> I tried two different headphones and was unable to reproduce this failure, while I heard the problem instantly when I plugged my creative headphones into my home stereo.<SPAN>
    This brings me back to creative.<SPAN> If I am right, Creative may have dodged a bullet, or maybe the knew this all along and saw fit not to tell us, as is their way.<SPAN> I did, however, purchase a unit that includes headphones? that don?t work.<SPAN> What if instead of me sending back a second unit, I send you a pair of broken headphones and you send me a pair of non-Creative headphones?<SPAN> Or a coupon for something another pair of headphones?<SPAN> Sounds like a win-win, as they say.

    I fail to see how it would be in Creative's interest to not replace a pair of headphones rather than an entire player.Message Edited by SSR on 07-8-2005 02:06 PM

  • New MacBook Pro Headphone Jack Issues

    Hi, I just got my MacBook Pro barely a week ago and I've noticed an issue when using headphones or external speakers when plugged into the headphone jack. It seems that the computer won't recognize that I have something plugged into the jack, sound just keeps playing through the laptop speakers and not the device connected. I can duplicate this at will:
    Play music through headphones plugged into computer, hit pause. Disconnect headphones and play music through laptop speakers, pause music again and connect headphones. Hit play, and the sound continues to play through the laptop speakers and not the headphones... The only way I can remedy this is my restarting my machine (PITA) or by shutting the lid and waking the computer up. (Still a PITA) Is there a fix for this? I'm updated to the most recent version, 10.6.8 . I never had this issue with my old MacBook Pro pre unibody. I've read elsewhere that another solution is to go into System Preferences > Sound and click "Output" and change the setting "use adio port for" from "sound input" to "sound output" I don't even have those settings listed in my Output tab... Please help!

    Well, the issue has been resolved. The solution was to reset the SMC/PRAM. I thought about doing this but I didn't think I would need to on a brand new computer . At least its back to working order and I didn't have to be without my machine.
    To anyone with this issue, just reset the SMC/PRAM
    SMC Reset: http://support.apple.com/kb/ht3964
    PRAM Reset: http://support.apple.com/kb/HT1379

  • IPod touch 1st Gen. Headphone jack...HELP!!!

    So I had my 1st Generation iPod touch for years now. I actually kind of lost a few years back and now I found it (under my bed all along)! If you didn't know the 1st gen. iPod touch doesn't have any speakers so to listen to music you have to listen through it from a headphone jack. So I tried listening to some a-ha but there was no sound. I couldn't hear a thing. I started twitching my headphones a little bit and the music came but it was all clutter. Finally, after several minutes of twithing and turning...I could hear the song but then my headphones moved a little and the sound became clutter again. After more intensive tries, I came to the conclusion that the headphones have to be in a VERY precise location for it to work properly. I also used the same headphones on my laptop and they were flawless. So...how do I fix this problem and is Apple going to help me on this or do I have to buy something to fix this? Please help because I had this thing for a long time now and I really don't want to throw it out.

    If cycling the  plug n the jack does not solve the problem
    Apple will exchange your iPod for a refurbished one for this price. They do not fix yours. However, it is not worth it for a 1G iPod
    Apple - iPod Repair price                  
    A third-party place like the following will replace the jack for less. Google for more. Agin, not worth it.
    iPhone Repair, Service & Parts: iPod Touch, iPad, MacBook Pro Screens
    Replace the jack yourself
    iPod Touch Repair – iFixit

  • Headphone jack issues 15" MPB Early 2011

    So I've been having an issue with my laptop for a few months, and I haven't been able to figure out or find a solution. So the headphone jack works perfectly in that it still sounds excellent, but there have been a few issues with it.
    Whenever there isn't sound playing on my computer for about 10~15 seconds a loud click goes through whatever is connected to my headphone jack (usually headphones). Following is a sort of odd static that stops once another sound happens on my computer. This hasn't been an issue lately as I've just been running background ambient noises to both lighten the mood that finals bring, and also to stop the annoying clicking that happens. It's especially bad when I plug from the 1/8th inch port through some sort of cord adapter to larger monitors, as the initial click of plugging something into the heaphone port can be quite jarring.
    I've already tried resetting the logic board and doing all the normal reboot options, so I was just wondering if anyone has had the same issue as me, and if so how did you solve it?

    ok, so, using this idea, I stayed in the sound panel, and plugged/removed the headphone.
    What I didn't realize was that the jack actually snaps when it's properly in (on the mac side)
    so, basically I wasn't plugging it in far enough.
    Thank you for helping me figure it out.

  • New Infinity connect issues - please help

    We are having ongoing issues with getting BT infinity installed to our new house.  I really need someone that can actually help us find out what is wrong and how we can resolve the issues we are having.
    It all started a few months ago when we ordered BT infinity and a new phone line to our new Chapel conversion house.
    Initially there were some issues with the engineer being unable to get the phone line to the house. After numerous phone calls and several engineers visits, we these have now been resolved and we do have a working telephone.
    The problem seems to be with the Infinity. Nobody can give me an answer as to why we have not yet got a connection.
    When the phone engineer visited he said that he would try and connect the Infinity in the green box. – When he went to do this he tried to obtain our patching information and was informed that there was no live order for infinity on our number… As there was nothing more he could do he left.
    We then checked with BT and they confirmed that we do have an order for infinity and that there was a problem that needed and engineer to look at. (We have a box and are paying for the service already…
    We were told last week that an engineer was going to attend on Monday 13th Jan and that we definitely would have a connection by last Monday at the latest… - no engineer attended despite my wife spending her 3rd day in the house waiting for an engineer!
    She phone BT on Tuesday and was told that there was a problem and she would be contacted by Thursday Morning at the latest. – Needless to say , No phone call!!
    We really need to sort this connection out.  Is there anyone who can take this and run with it until it’s sorted? – We are getting nowhere talking to random individuals who have no real history of our connection history.
    Please Help!
    Doug

    Hi dougchapel,
    Thanks for posting and welcome!
    I'm sorry for the problems you're having getting set up on BT Infinity.  I can help get you sorted from here.  Click on my username and under the "about me" section you'll see the link to get in touch with us.
    Cheers,
    Robbie
    BTCare Community Mod
    If we have asked you to email us with your details, please make sure you are logged in to the forum, otherwise you will not be able to see our ‘Contact Us’ link within our profiles.
    We are sorry that we are unable to deal with service/account queries via the private message(PM) function so please don't PM your account info, we need to deal with this via our email account :-)
    If someone answers your question correctly please let other members know by clicking on ’Mark as Accepted Solution’.

  • XML Publisher Issue - Please help.

    I am getting the following error when running the XML Report . The program is completing in warning message.
    “Beginning post-processing of request 235281769 on node RMOHSDCGR02 at 19-OCT-2010 10:27:33.
    Post-processing of request 235281769 failed at 19-OCT-2010 10:27:34 with the error message:
    One or more post-processing actions failed. Consult the OPP service log for details.”
    I have checked the OPP file
    SELECT fcpp.concurrent_request_id req_id, fcp.node_name, fcp.logfile_name
    FROM fnd_conc_pp_actions fcpp, fnd_concurrent_processes fcp
    WHERE fcpp.processor_id = fcp.concurrent_process_id
    AND fcpp.action_type = 6
    AND fcpp.concurrent_request_id = 235281769;
    file_details
    [10/9/10 2:18:18 PM] [main] Starting GSF service with concurrent process id = 76893.
    [10/9/10 2:18:18 PM] [main] Initialization Parameters: oracle.apps.fnd.cp.opp.OPPServiceThread:2:0:max_threads=5
    [10/9/10 2:18:18 PM] [Thread-16] Service thread starting up.
    [10/9/10 2:18:18 PM] [Thread-17] Service thread starting up.
    [10/18/10 11:57:11 AM] [OPPServiceThread0] Post-processing request 235281598.
    [10/18/10 11:57:11 AM] [76893:RT235281598] Executing post-processing actions for request 235281598.
    [10/18/10 11:57:12 AM] [76893:RT235281598] Starting XML Publisher post-processing action.
    [10/18/10 11:57:12 AM] [76893:RT235281598]
    Template code: XXDC_MM_UPL_CREDIT_PROF
    Template app: XXDC
    Language: en
    Territory: 00
    Output type: PDF
    [101810_115712335][][EXCEPTION] [DEBUG] ------- Preferences defined PreferenceStore -------
    [101810_115712335][][EXCEPTION] [DEBUG] ------- Environment variables stored in EnvironmentStore -------
    [101810_115712336][][EXCEPTION] [DEBUG] [FND_JDBC_IDLE_THRESHOLD.LOW]:[-1]
    [101810_115712336][][EXCEPTION] [DEBUG] [SECURITY_GROUP_ID]:[0]
    [101810_115712336][][EXCEPTION] [DEBUG] [FND_JDBC_BUFFER_DECAY_INTERVAL]:[300]
    [101810_115712336][][EXCEPTION] [DEBUG] [NLS_CHARACTERSET]:[UTF8]
    [101810_115712336][][EXCEPTION] [DEBUG] [RESP_APPL_ID]:[-1]
    [101810_115712336][][EXCEPTION] [DEBUG] [NLS_LANGUAGE]:[AMERICAN]
    [101810_115712336][][EXCEPTION] [DEBUG] [FND_JDBC_BUFFER_MIN]:[1]
    [101810_115712336][][EXCEPTION] [DEBUG] [FND_JDBC_BUFFER_MAX]:[2]
    [101810_115712337][][EXCEPTION] [DEBUG] [NLS_NUMERIC_CHARACTERS]:[.,]
    [101810_115712337][][EXCEPTION] [DEBUG] [APPS_JDBC_URL]:[jdbc:oracle:thin:@(DESCRIPTION=(LOAD_BALANCE=YES)(FAILOVER=YES)(ADDRESS_LIST=(ADDRESS=(PROTOCOL=tcp)(HOST=rmohsdcgr07.oracleoutsourcing.com)(PORT=10710))(ADDRESS=(PROTOCOL=tcp)(HOST=rmohsdcgr02.oracleoutsourcing.com)(PORT=10710)))(CONNECT_DATA=(SID=DDCGRI)))]
    [101810_115712337][][EXCEPTION] [DEBUG] [RESP_ID]:[-1]
    [101810_115712337][][EXCEPTION] [DEBUG] [FND_MAX_JDBC_CONNECTIONS]:[500]
    [101810_115712337][][EXCEPTION] [DEBUG] [FND_JDBC_USABLE_CHECK]:[false]
    [101810_115712337][][EXCEPTION] [DEBUG] [USER_ID]:[-1]
    [101810_115712337][][EXCEPTION] [DEBUG] [NLS_TERRITORY]:[AMERICA]
    [101810_115712337][][EXCEPTION] [DEBUG] [FND_JDBC_PLSQL_RESET]:[false]
    [101810_115712337][][EXCEPTION] [DEBUG] [FND_JDBC_CONTEXT_CHECK]:[true]
    [101810_115712338][][EXCEPTION] [DEBUG] [NLS_DATE_FORMAT]:[DD-MON-RR]
    [101810_115712338][][EXCEPTION] [DEBUG] [FND_JDBC_BUFFER_DECAY_SIZE]:[5]
    [101810_115712338][][EXCEPTION] [DEBUG] [FND_JDBC_IDLE_THRESHOLD.HIGH]:[-1]
    [101810_115712338][][EXCEPTION] [DEBUG] [NLS_SORT]:[BINARY]
    [101810_115712338][][EXCEPTION] [DEBUG] [NLS_DATE_LANGUAGE]:[AMERICAN]
    [101810_115712338][][EXCEPTION] [DEBUG] [LOGIN_ID]:[-1]
    [101810_115712338][][EXCEPTION] [DEBUG] ------- Properties stored in Java System Properties -------
    [101810_115712338][][EXCEPTION] [DEBUG] [APPLTMP]:[ddcgri/applcsf/tmp]
    [101810_115712339][][EXCEPTION] [DEBUG] [java.runtime.name]:[Java(TM) 2 Runtime Environment, Standard Edition]
    [101810_115712339][][EXCEPTION] [DEBUG] [sun.boot.library.path]:[ddcgri/applmgr/common/util/java/1.5/j2sdk1.5.0_06/jre/lib/i386]
    [101810_115712339][][EXCEPTION] [DEBUG] [java.vm.version]:[1.5.0_06-b05]
    [101810_115712339][][EXCEPTION] [DEBUG] [OVERRIDE_DBC]:[true]
    [101810_115712339][][EXCEPTION] [DEBUG] [dbcfile]:[ddcgri/applmgr/11510/fnd/11.5.0/secure/DDCGRI_rmohsdcgr02/ddcgri.dbc]
    [101810_115712339][][EXCEPTION] [DEBUG] [java.vm.vendor]:[Sun Microsystems Inc.]
    [101810_115712339][][EXCEPTION] [DEBUG] [java.vendor.url]:[http://java.sun.com/]
    [101810_115712339][][EXCEPTION] [DEBUG] [path.separator]:[:]
    [101810_115712339][][EXCEPTION] [DEBUG] [APPLCSF]:[ddcgri/applcsf]
    [101810_115712340][][EXCEPTION] [DEBUG] [java.vm.name]:[Java HotSpot(TM) Server VM]
    [101810_115712340][][EXCEPTION] [DEBUG] [file.encoding.pkg]:[sun.io]
    [101810_115712340][][EXCEPTION] [DEBUG] [user.country]:[US]
    [101810_115712340][][EXCEPTION] [DEBUG] [sun.os.patch.level]:[unknown]
    [101810_115712340][][EXCEPTION] [DEBUG] [java.vm.specification.name]:[Java Virtual Machine Specification]
    [101810_115712340][][EXCEPTION] [DEBUG] [user.dir]:[ddcgri/applcsf/log/DDCGRI_rmohsdcgr02]
    [101810_115712340][][EXCEPTION] [DEBUG] [java.runtime.version]:[1.5.0_06-b05]
    [101810_115712340][][EXCEPTION] [DEBUG] [java.awt.graphicsenv]:[sun.awt.X11GraphicsEnvironment]
    [101810_115712341][][EXCEPTION] [DEBUG] [java.endorsed.dirs]:[ddcgri/applmgr/common/util/java/1.5/j2sdk1.5.0_06/jre/lib/endorsed]
    [101810_115712341][][EXCEPTION] [DEBUG] [os.arch]:[i386]
    [101810_115712341][][EXCEPTION] [DEBUG] [JTFDBCFILE]:[ddcgri/applmgr/11510/fnd/11.5.0/secure/DDCGRI_rmohsdcgr02/ddcgri.dbc]
    [101810_115712341][][EXCEPTION] [DEBUG] [java.io.tmpdir]:[tmp]
    [101810_115712341][][EXCEPTION] [DEBUG] [line.separator]:[
    [101810_115712341][][EXCEPTION] [DEBUG] [java.vm.specification.vendor]:[Sun Microsystems Inc.]
    [101810_115712341][][EXCEPTION] [DEBUG] [os.name]:[Linux]
    [101810_115712341][][EXCEPTION] [DEBUG] [FND_JDBC_BUFFER_MIN]:[1]
    [101810_115712341][][EXCEPTION] [DEBUG] [cpid]:[76893]
    [101810_115712342][][EXCEPTION] [DEBUG] [sun.jnu.encoding]:[ANSI_X3.4-1968]
    [101810_115712342][][EXCEPTION] [DEBUG] [java.library.path]:[ddcgri/applmgr/common/util/java/1.5/j2sdk1.5.0_06/jre/lib/i386/server:/ddcgri/applmgr/common/util/java/1.5/j2sdk1.5.0_06/jre/lib/i386:/ddcgri/applmgr/common/util/java/1.5/j2sdk1.5.0_06/jre/../lib/i386:/ddcgri/product/iAS/lib:/ddcgri/product/806/network/jre11/lib/i686/native_threads:/ddcgri/product/806/network/jre11/lib/linux/native_threads:/ddcgri/applmgr/11510/cz/11.5.0/bin:/ddcgri/product/806/lib:/usr/X11R6/lib:/usr/openwin/lib]
    [101810_115712342][][EXCEPTION] [DEBUG] [java.specification.name]:[Java Platform API Specification]
    [101810_115712342][][EXCEPTION] [DEBUG] [java.class.version]:[49.0]
    [101810_115712342][][EXCEPTION] [DEBUG] [sun.management.compiler]:[HotSpot Server Compiler]
    [101810_115712342][][EXCEPTION] [DEBUG] [os.version]:[2.6.9-89.0.26.0.1.ELlargesmp]
    [101810_115712342][][EXCEPTION] [DEBUG] [LONG_RUNNING_JVM]:[true]
    [101810_115712342][][EXCEPTION] [DEBUG] [user.home]:[ddcgri/product]
    [101810_115712342][][EXCEPTION] [DEBUG] [user.timezone]:[Europe/London]
    [101810_115712343][][EXCEPTION] [DEBUG] [java.awt.printerjob]:[sun.print.PSPrinterJob]
    [101810_115712347][][EXCEPTION] [DEBUG] [file.encoding]:[ANSI_X3.4-1968]
    [101810_115712347][][EXCEPTION] [DEBUG] [java.specification.version]:[1.5]
    [101810_115712347][][EXCEPTION] [DEBUG] [CACHEMODE]:[DISTRIBUTED]
    [101810_115712348][][EXCEPTION] [DEBUG] [java.class.path]:[ddcgri/applmgr/common/util/java/1.5/j2sdk1.5.0_06/jre/lib/rt.jar:/ddcgri/applmgr/common/util/java/1.5/j2sdk1.5.0_06/lib/dt.jar:/ddcgri/applmgr/common/util/java/1.5/j2sdk1.5.0_06/lib/tools.jar:/ddcgri/applmgr/common/util/java/1.5/j2sdk1.5.0_06/jre/lib/charsets.jar:/ddcgri/applmgr/common/java/appsborg2.zip:/ddcgri/product/806/forms60/java:/ddcgri/applmgr/common/java]
    [101810_115712348][][EXCEPTION] [DEBUG] [user.name]:[apddcgri]
    [101810_115712348][][EXCEPTION] [DEBUG] [DBCFILE]:[ddcgri/applmgr/11510/fnd/11.5.0/secure/DDCGRI_rmohsdcgr02/ddcgri.dbc]
    [101810_115712348][][EXCEPTION] [DEBUG] [java.vm.specification.version]:[1.0]
    [101810_115712348][][EXCEPTION] [DEBUG] [java.home]:[ddcgri/applmgr/common/util/java/1.5/j2sdk1.5.0_06/jre]
    [101810_115712348][][EXCEPTION] [DEBUG] [sun.arch.data.model]:[32]
    [101810_115712348][][EXCEPTION] [DEBUG] [user.language]:[en]
    [101810_115712348][][EXCEPTION] [DEBUG] [java.specification.vendor]:[Sun Microsystems Inc.]
    [101810_115712349][][EXCEPTION] [DEBUG] [java.vm.info]:[mixed mode]
    [101810_115712349][][EXCEPTION] [DEBUG] [logfile]:[ddcgri/applcsf/log/DDCGRI_rmohsdcgr02/FNDOPP76893.txt]
    [101810_115712349][][EXCEPTION] [DEBUG] [java.version]:[1.5.0_06]
    [101810_115712349][][EXCEPTION] [DEBUG] [java.ext.dirs]:[ddcgri/applmgr/common/util/java/1.5/j2sdk1.5.0_06/jre/lib/ext]
    [101810_115712349][][EXCEPTION] [DEBUG] [sun.boot.class.path]:[ddcgri/applmgr/common/util/java/1.5/j2sdk1.5.0_06/jre/lib/rt.jar:/ddcgri/applmgr/common/util/java/1.5/j2sdk1.5.0_06/jre/lib/i18n.jar:/ddcgri/applmgr/common/util/java/1.5/j2sdk1.5.0_06/jre/lib/sunrsasign.jar:/ddcgri/applmgr/common/util/java/1.5/j2sdk1.5.0_06/jre/lib/jsse.jar:/ddcgri/applmgr/common/util/java/1.5/j2sdk1.5.0_06/jre/lib/jce.jar:/ddcgri/applmgr/common/util/java/1.5/j2sdk1.5.0_06/jre/lib/charsets.jar:/ddcgri/applmgr/common/util/java/1.5/j2sdk1.5.0_06/jre/classes]
    [101810_115712349][][EXCEPTION] [DEBUG] [java.vendor]:[Sun Microsystems Inc.]
    [101810_115712349][][EXCEPTION] [DEBUG] [FND_JDBC_BUFFER_MAX]:[2]
    [101810_115712349][][EXCEPTION] [DEBUG] [file.separator]:[]
    [101810_115712349][][EXCEPTION] [DEBUG] [java.vendor.url.bug]:[http://java.sun.com/cgi-bin/bugreport.cgi]
    [101810_115712350][][EXCEPTION] [DEBUG] [sun.io.unicode.encoding]:[UnicodeLittle]
    [101810_115712350][][EXCEPTION] [DEBUG] [sun.cpu.endian]:[little]
    [101810_115712350][][EXCEPTION] [DEBUG] [APPLOUT]:[out/DDCGRI_rmohsdcgr02]
    [101810_115712350][][EXCEPTION] [DEBUG] [sun.cpu.isalist]:[]
    [10/18/10 11:57:13 AM] [UNEXPECTED] [76893:RT235281598] java.io.FileNotFoundException: /tdcg1i/applmgr/common/temp/xdoQBnr8m42XW101810_1157132190.fo (No such file or directory)
         at java.io.FileOutputStream.open(Native Method)
         at java.io.FileOutputStream.<init>(FileOutputStream.java:179)
         at java.io.FileOutputStream.<init>(FileOutputStream.java:131)
         at oracle.apps.xdo.common.tmp.TmpFile.createTmpFileJDK118(TmpFile.java:146)
         at oracle.apps.xdo.common.tmp.TmpFile.createTmpFile(TmpFile.java:113)
         at oracle.apps.xdo.template.fo.util.FOUtility.generateFO(FOUtility.java:987)
         at oracle.apps.xdo.template.fo.util.FOUtility.generateFO(FOUtility.java:212)
         at oracle.apps.xdo.template.FOProcessor.createFO(FOProcessor.java:1657)
         at oracle.apps.xdo.template.FOProcessor.generate(FOProcessor.java:967)
         at oracle.apps.xdo.oa.schema.server.TemplateHelper.runProcessTemplate(TemplateHelper.java:5888)
         at oracle.apps.xdo.oa.schema.server.TemplateHelper.processTemplate(TemplateHelper.java:3438)
         at oracle.apps.xdo.oa.schema.server.TemplateHelper.processTemplate(TemplateHelper.java:3527)
         at oracle.apps.fnd.cp.opp.XMLPublisherProcessor.process(XMLPublisherProcessor.java:247)
         at oracle.apps.fnd.cp.opp.OPPRequestThread.run(OPPRequestThread.java:153)
    [10/18/10 11:57:13 AM] [76893:RT235281598] Completed post-processing actions for request 235281598.
    [10/18/10 12:09:20 PM] [OPPServiceThread1] Post-processing request 235281600.
    [10/18/10 12:09:20 PM] [76893:RT235281600] Executing post-processing actions for request 235281600.
    [10/18/10 12:09:20 PM] [76893:RT235281600] Starting XML Publisher post-processing action.
    [10/18/10 12:09:20 PM] [76893:RT235281600]
    Template code: XXDC_MM_UPL_CREDIT_PROF
    Template app: XXDC
    Language: en
    Territory: 00
    Output type: PDF
    [10/18/10 12:09:20 PM] [UNEXPECTED] [76893:RT235281600] java.io.FileNotFoundException: /tdcg1i/applmgr/common/temp/xdoTQ3qo0WVAG101810_1209202901.fo (No such file or directory)
         at java.io.FileOutputStream.open(Native Method)
         at java.io.FileOutputStream.<init>(FileOutputStream.java:179)
         at java.io.FileOutputStream.<init>(FileOutputStream.java:131)
         at oracle.apps.xdo.common.tmp.TmpFile.createTmpFileJDK118(TmpFile.java:146)
         at oracle.apps.xdo.common.tmp.TmpFile.createTmpFile(TmpFile.java:113)
         at oracle.apps.xdo.template.fo.util.FOUtility.generateFO(FOUtility.java:987)
         at oracle.apps.xdo.template.fo.util.FOUtility.generateFO(FOUtility.java:212)
         at oracle.apps.xdo.template.FOProcessor.createFO(FOProcessor.java:1657)
         at oracle.apps.xdo.template.FOProcessor.generate(FOProcessor.java:967)
         at oracle.apps.xdo.oa.schema.server.TemplateHelper.runProcessTemplate(TemplateHelper.java:5888)
         at oracle.apps.xdo.oa.schema.server.TemplateHelper.processTemplate(TemplateHelper.java:3438)
         at oracle.apps.xdo.oa.schema.server.TemplateHelper.processTemplate(TemplateHelper.java:3527)
         at oracle.apps.fnd.cp.opp.XMLPublisherProcessor.process(XMLPublisherProcessor.java:247)
         at oracle.apps.fnd.cp.opp.OPPRequestThread.run(OPPRequestThread.java:153)
    [10/18/10 12:09:20 PM] [76893:RT235281600] Completed post-processing actions for request 235281600.
    [10/18/10 12:18:30 PM] [OPPServiceThread0] Post-processing request 235281602.
    [10/18/10 12:18:30 PM] [76893:RT235281602] Executing post-processing actions for request 235281602.
    [10/18/10 12:18:30 PM] [76893:RT235281602] Starting XML Publisher post-processing action.
    [10/18/10 12:18:30 PM] [76893:RT235281602]
    Template code: XXDC_MM_UPL_CREDIT_PROF
    Template app: XXDC
    Language: en
    Territory: 00
    Output type: PDF
    [10/18/10 12:18:30 PM] [UNEXPECTED] [76893:RT235281602] java.io.FileNotFoundException: /tdcg1i/applmgr/common/temp/xdomVNG5CUiJU101810_1218307062.fo (No such file or directory)
         at java.io.FileOutputStream.open(Native Method)
         at java.io.FileOutputStream.<init>(FileOutputStream.java:179)
         at java.io.FileOutputStream.<init>(FileOutputStream.java:131)
         at oracle.apps.xdo.common.tmp.TmpFile.createTmpFileJDK118(TmpFile.java:146)
         at oracle.apps.xdo.common.tmp.TmpFile.createTmpFile(TmpFile.java:113)
         at oracle.apps.xdo.template.fo.util.FOUtility.generateFO(FOUtility.java:987)
         at oracle.apps.xdo.template.fo.util.FOUtility.generateFO(FOUtility.java:212)
         at oracle.apps.xdo.template.FOProcessor.createFO(FOProcessor.java:1657)
         at oracle.apps.xdo.template.FOProcessor.generate(FOProcessor.java:967)
         at oracle.apps.xdo.oa.schema.server.TemplateHelper.runProcessTemplate(TemplateHelper.java:5888)
         at oracle.apps.xdo.oa.schema.server.TemplateHelper.processTemplate(TemplateHelper.java:3438)
         at oracle.apps.xdo.oa.schema.server.TemplateHelper.processTemplate(TemplateHelper.java:3527)
         at oracle.apps.fnd.cp.opp.XMLPublisherProcessor.process(XMLPublisherProcessor.java:247)
         at oracle.apps.fnd.cp.opp.OPPRequestThread.run(OPPRequestThread.java:153)
    [10/18/10 12:18:30 PM] [76893:RT235281602] Completed post-processing actions for request 235281602.
    [10/18/10 1:45:05 PM] [OPPServiceThread1] Post-processing request 235281611.
    [10/18/10 1:45:05 PM] [76893:RT235281611] Executing post-processing actions for request 235281611.
    [10/18/10 1:45:05 PM] [76893:RT235281611] Starting XML Publisher post-processing action.
    [10/18/10 1:45:05 PM] [76893:RT235281611]
    Template code: XXDC_MM_UPL_CREDIT_PROF
    Template app: XXDC
    Language: en
    Territory: 00
    Output type: PDF
    [10/18/10 1:45:05 PM] [UNEXPECTED] [76893:RT235281611] java.io.FileNotFoundException: /tdcg1i/applmgr/common/temp/xdonSDr1Lclur101810_0145054643.fo (No such file or directory)
         at java.io.FileOutputStream.open(Native Method)
         at java.io.FileOutputStream.<init>(FileOutputStream.java:179)
         at java.io.FileOutputStream.<init>(FileOutputStream.java:131)
         at oracle.apps.xdo.common.tmp.TmpFile.createTmpFileJDK118(TmpFile.java:146)
         at oracle.apps.xdo.common.tmp.TmpFile.createTmpFile(TmpFile.java:113)
         at oracle.apps.xdo.template.fo.util.FOUtility.generateFO(FOUtility.java:987)
         at oracle.apps.xdo.template.fo.util.FOUtility.generateFO(FOUtility.java:212)
         at oracle.apps.xdo.template.FOProcessor.createFO(FOProcessor.java:1657)
         at oracle.apps.xdo.template.FOProcessor.generate(FOProcessor.java:967)
         at oracle.apps.xdo.oa.schema.server.TemplateHelper.runProcessTemplate(TemplateHelper.java:5888)
         at oracle.apps.xdo.oa.schema.server.TemplateHelper.processTemplate(TemplateHelper.java:3438)
         at oracle.apps.xdo.oa.schema.server.TemplateHelper.processTemplate(TemplateHelper.java:3527)
         at oracle.apps.fnd.cp.opp.XMLPublisherProcessor.process(XMLPublisherProcessor.java:247)
         at oracle.apps.fnd.cp.opp.OPPRequestThread.run(OPPRequestThread.java:153)
    [10/18/10 1:45:05 PM] [76893:RT235281611] Completed post-processing actions for request 235281611.
    [10/18/10 2:19:06 PM] [OPPServiceThread0] Post-processing request 235281617.
    [10/18/10 2:19:07 PM] [76893:RT235281617] Executing post-processing actions for request 235281617.
    [10/18/10 2:19:07 PM] [76893:RT235281617] Starting XML Publisher post-processing action.
    [10/18/10 2:19:07 PM] [76893:RT235281617]
    Template code: XXDC_MM_UPL_CREDIT_PROF
    Template app: XXDC
    Language: en
    Territory: 00
    Output type: PDF
    [10/18/10 2:19:07 PM] [UNEXPECTED] [76893:RT235281617] java.io.FileNotFoundException: /tdcg1i/applmgr/common/temp/xdoyj5TzkRids101810_0219070714.fo (No such file or directory)
         at java.io.FileOutputStream.open(Native Method)
         at java.io.FileOutputStream.<init>(FileOutputStream.java:179)
         at java.io.FileOutputStream.<init>(FileOutputStream.java:131)
         at oracle.apps.xdo.common.tmp.TmpFile.createTmpFileJDK118(TmpFile.java:146)
         at oracle.apps.xdo.common.tmp.TmpFile.createTmpFile(TmpFile.java:113)
         at oracle.apps.xdo.template.fo.util.FOUtility.generateFO(FOUtility.java:987)
         at oracle.apps.xdo.template.fo.util.FOUtility.generateFO(FOUtility.java:212)
         at oracle.apps.xdo.template.FOProcessor.createFO(FOProcessor.java:1657)
         at oracle.apps.xdo.template.FOProcessor.generate(FOProcessor.java:967)
         at oracle.apps.xdo.oa.schema.server.TemplateHelper.runProcessTemplate(TemplateHelper.java:5888)
         at oracle.apps.xdo.oa.schema.server.TemplateHelper.processTemplate(TemplateHelper.java:3438)
         at oracle.apps.xdo.oa.schema.server.TemplateHelper.processTemplate(TemplateHelper.java:3527)
         at oracle.apps.fnd.cp.opp.XMLPublisherProcessor.process(XMLPublisherProcessor.java:247)
         at oracle.apps.fnd.cp.opp.OPPRequestThread.run(OPPRequestThread.java:153)
    [10/18/10 2:19:07 PM] [76893:RT235281617] Completed post-processing actions for request 235281617.
    [10/19/10 5:56:25 AM] [OPPServiceThread0] Post-processing request 235281736.
    [10/19/10 5:56:25 AM] [76893:RT235281736] Executing post-processing actions for request 235281736.
    [10/19/10 5:56:25 AM] [76893:RT235281736] Starting XML Publisher post-processing action.
    [10/19/10 5:56:25 AM] [76893:RT235281736]
    Template code: XXDC_MM_UPL_CREDIT_PROF
    Template app: XXDC
    Language: en
    Territory: 00
    Output type: PDF
    [10/19/10 5:56:25 AM] [UNEXPECTED] [76893:RT235281736] java.io.FileNotFoundException: /tdcg1i/applmgr/common/temp/xdocZqznUyg1C101910_0556251555.fo (No such file or directory)
         at java.io.FileOutputStream.open(Native Method)
         at java.io.FileOutputStream.<init>(FileOutputStream.java:179)
         at java.io.FileOutputStream.<init>(FileOutputStream.java:131)
         at oracle.apps.xdo.common.tmp.TmpFile.createTmpFileJDK118(TmpFile.java:146)
         at oracle.apps.xdo.common.tmp.TmpFile.createTmpFile(TmpFile.java:113)
         at oracle.apps.xdo.template.fo.util.FOUtility.generateFO(FOUtility.java:987)
         at oracle.apps.xdo.template.fo.util.FOUtility.generateFO(FOUtility.java:212)
         at oracle.apps.xdo.template.FOProcessor.createFO(FOProcessor.java:1657)
         at oracle.apps.xdo.template.FOProcessor.generate(FOProcessor.java:967)
         at oracle.apps.xdo.oa.schema.server.TemplateHelper.runProcessTemplate(TemplateHelper.java:5888)
         at oracle.apps.xdo.oa.schema.server.TemplateHelper.processTemplate(TemplateHelper.java:3438)
         at oracle.apps.xdo.oa.schema.server.TemplateHelper.processTemplate(TemplateHelper.java:3527)
         at oracle.apps.fnd.cp.opp.XMLPublisherProcessor.process(XMLPublisherProcessor.java:247)
         at oracle.apps.fnd.cp.opp.OPPRequestThread.run(OPPRequestThread.java:153)
    [10/19/10 5:56:25 AM] [76893:RT235281736] Completed post-processing actions for request 235281736.
    [10/19/10 6:07:04 AM] [OPPServiceThread1] Post-processing request 235281738.
    [10/19/10 6:07:04 AM] [76893:RT235281738] Executing post-processing actions for request 235281738.
    [10/19/10 6:07:04 AM] [76893:RT235281738] Starting XML Publisher post-processing action.
    [10/19/10 6:07:04 AM] [76893:RT235281738]
    Template code: XXDC_MM_UPL_CREDIT_PROF
    Template app: XXDC
    Language: en
    Territory: 00
    Output type: PDF
    [10/19/10 6:07:04 AM] [UNEXPECTED] [76893:RT235281738] java.io.FileNotFoundException: /tdcg1i/applmgr/common/temp/xdoZmwsSPwwBh101910_0607047996.fo (No such file or directory)
         at java.io.FileOutputStream.open(Native Method)
         at java.io.FileOutputStream.<init>(FileOutputStream.java:179)
         at java.io.FileOutputStream.<init>(FileOutputStream.java:131)
         at oracle.apps.xdo.common.tmp.TmpFile.createTmpFileJDK118(TmpFile.java:146)
         at oracle.apps.xdo.common.tmp.TmpFile.createTmpFile(TmpFile.java:113)
         at oracle.apps.xdo.template.fo.util.FOUtility.generateFO(FOUtility.java:987)
         at oracle.apps.xdo.template.fo.util.FOUtility.generateFO(FOUtility.java:212)
         at oracle.apps.xdo.template.FOProcessor.createFO(FOProcessor.java:1657)
         at oracle.apps.xdo.template.FOProcessor.generate(FOProcessor.java:967)
         at oracle.apps.xdo.oa.schema.server.TemplateHelper.runProcessTemplate(TemplateHelper.java:5888)
         at oracle.apps.xdo.oa.schema.server.TemplateHelper.processTemplate(TemplateHelper.java:3438)
         at oracle.apps.xdo.oa.schema.server.TemplateHelper.processTemplate(TemplateHelper.java:3527)
         at oracle.apps.fnd.cp.opp.XMLPublisherProcessor.process(XMLPublisherProcessor.java:247)
         at oracle.apps.fnd.cp.opp.OPPRequestThread.run(OPPRequestThread.java:153)
    [10/19/10 6:07:04 AM] [76893:RT235281738] Completed post-processing actions for request 235281738.
    [10/19/10 6:25:28 AM] [OPPServiceThread1] Post-processing request 235281741.
    [10/19/10 6:25:28 AM] [76893:RT235281741] Executing post-processing actions for request 235281741.
    [10/19/10 6:25:28 AM] [76893:RT235281741] Starting XML Publisher post-processing action.
    [10/19/10 6:25:28 AM] [76893:RT235281741]
    Template code: XXDC_MM_UPL_CREDIT_PROF
    Template app: XXDC
    Language: en
    Territory: 00
    Output type: PDF
    [10/19/10 6:25:28 AM] [UNEXPECTED] [76893:RT235281741] java.io.FileNotFoundException: /tdcg1i/applmgr/common/temp/xdoe1cxbJpotK101910_0625284827.fo (No such file or directory)
         at java.io.FileOutputStream.open(Native Method)
         at java.io.FileOutputStream.<init>(FileOutputStream.java:179)
         at java.io.FileOutputStream.<init>(FileOutputStream.java:131)
         at oracle.apps.xdo.common.tmp.TmpFile.createTmpFileJDK118(TmpFile.java:146)
         at oracle.apps.xdo.common.tmp.TmpFile.createTmpFile(TmpFile.java:113)
         at oracle.apps.xdo.template.fo.util.FOUtility.generateFO(FOUtility.java:987)
         at oracle.apps.xdo.template.fo.util.FOUtility.generateFO(FOUtility.java:212)
         at oracle.apps.xdo.template.FOProcessor.createFO(FOProcessor.java:1657)
         at oracle.apps.xdo.template.FOProcessor.generate(FOProcessor.java:967)
         at oracle.apps.xdo.oa.schema.server.TemplateHelper.runProcessTemplate(TemplateHelper.java:5888)
         at oracle.apps.xdo.oa.schema.server.TemplateHelper.processTemplate(TemplateHelper.java:3438)
         at oracle.apps.xdo.oa.schema.server.TemplateHelper.processTemplate(TemplateHelper.java:3527)
         at oracle.apps.fnd.cp.opp.XMLPublisherProcessor.process(XMLPublisherProcessor.java:247)
         at oracle.apps.fnd.cp.opp.OPPRequestThread.run(OPPRequestThread.java:153)
    [10/19/10 6:25:28 AM] [76893:RT235281741] Completed post-processing actions for request 235281741.
    [10/19/10 7:13:07 AM] [OPPServiceThread0] Post-processing request 235281746.
    [10/19/10 7:13:07 AM] [76893:RT235281746] Executing post-processing actions for request 235281746.
    [10/19/10 7:13:07 AM] [76893:RT235281746] Starting XML Publisher post-processing action.
    [10/19/10 7:13:07 AM] [76893:RT235281746]
    Template code: XXDC_MM_UPL_CREDIT_PROF
    Template app: XXDC
    Language: en
    Territory: 00
    Output type: PDF
    [10/19/10 7:13:07 AM] [UNEXPECTED] [76893:RT235281746] java.io.FileNotFoundException: /tdcg1i/applmgr/common/temp/xdopfFpKMviMC101910_0713079968.fo (No such file or directory)
         at java.io.FileOutputStream.open(Native Method)
         at java.io.FileOutputStream.<init>(FileOutputStream.java:179)
         at java.io.FileOutputStream.<init>(FileOutputStream.java:131)
         at oracle.apps.xdo.common.tmp.TmpFile.createTmpFileJDK118(TmpFile.java:146)
         at oracle.apps.xdo.common.tmp.TmpFile.createTmpFile(TmpFile.java:113)
         at oracle.apps.xdo.template.fo.util.FOUtility.generateFO(FOUtility.java:987)
         at oracle.apps.xdo.template.fo.util.FOUtility.generateFO(FOUtility.java:212)
         at oracle.apps.xdo.template.FOProcessor.createFO(FOProcessor.java:1657)
         at oracle.apps.xdo.template.FOProcessor.generate(FOProcessor.java:967)
         at oracle.apps.xdo.oa.schema.server.TemplateHelper.runProcessTemplate(TemplateHelper.java:5888)
         at oracle.apps.xdo.oa.schema.server.TemplateHelper.processTemplate(TemplateHelper.java:3438)
         at oracle.apps.xdo.oa.schema.server.TemplateHelper.processTemplate(TemplateHelper.java:3527)
         at oracle.apps.fnd.cp.opp.XMLPublisherProcessor.process(XMLPublisherProcessor.java:247)
         at oracle.apps.fnd.cp.opp.OPPRequestThread.run(OPPRequestThread.java:153)
    [10/19/10 7:13:08 AM] [76893:RT235281746] Completed post-processing actions for request 235281746.
    [10/19/10 7:22:56 AM] [OPPServiceThread1] Post-processing request 235281748.
    [10/19/10 7:22:56 AM] [76893:RT235281748] Executing post-processing actions for request 235281748.
    [10/19/10 7:22:56 AM] [76893:RT235281748] Starting XML Publisher post-processing action.
    [10/19/10 7:22:56 AM] [76893:RT235281748]
    Template code: XXDC_MM_UPL_CREDIT_PROF
    Template app: XXDC
    Language: en
    Territory: 00
    Output type: PDF
    [10/19/10 7:22:56 AM] [UNEXPECTED] [76893:RT235281748] java.io.FileNotFoundException: /tdcg1i/applmgr/common/temp/xdoLVImdiAcDq101910_0722563869.fo (No such file or directory)
         at java.io.FileOutputStream.open(Native Method)
         at java.io.FileOutputStream.<init>(FileOutputStream.java:179)
         at java.io.FileOutputStream.<init>(FileOutputStream.java:131)
         at oracle.apps.xdo.common.tmp.TmpFile.createTmpFileJDK118(TmpFile.java:146)
         at oracle.apps.xdo.common.tmp.TmpFile.createTmpFile(TmpFile.java:113)
         at oracle.apps.xdo.template.fo.util.FOUtility.generateFO(FOUtility.java:987)
         at oracle.apps.xdo.template.fo.util.FOUtility.generateFO(FOUtility.java:212)
         at oracle.apps.xdo.template.FOProcessor.createFO(FOProcessor.java:1657)
         at oracle.apps.xdo.template.FOProcessor.generate(FOProcessor.java:967)
         at oracle.apps.xdo.oa.schema.server.TemplateHelper.runProcessTemplate(TemplateHelper.java:5888)
         at oracle.apps.xdo.oa.schema.server.TemplateHelper.processTemplate(TemplateHelper.java:3438)
         at oracle.apps.xdo.oa.schema.server.TemplateHelper.processTemplate(TemplateHelper.java:3527)
         at oracle.apps.fnd.cp.opp.XMLPublisherProcessor.process(XMLPublisherProcessor.java:247)
         at oracle.apps.fnd.cp.opp.OPPRequestThread.run(OPPRequestThread.java:153)
    [10/19/10 7:22:56 AM] [76893:RT235281748] Completed post-processing actions for request 235281748.
    [10/19/10 8:00:28 AM] [OPPServiceThread0] Post-processing request 235281752.
    [10/19/10 8:00:28 AM] [76893:RT235281752] Executing post-processing actions for request 235281752.
    [10/19/10 8:00:28 AM] [76893:RT235281752] Starting XML Publisher post-processing action.
    [10/19/10 8:00:28 AM] [76893:RT235281752]
    Template code: XXDC_MM_UPL_CREDIT_PROF
    Template app: XXDC
    Language: en
    Territory: 00
    Output type: PDF
    ------ I could not paste the entire file. Please let me know if it is required.
    [10/19/10 10:52:06 AM] [76893:RT235281774] Completed post-processing actions for request 235281774.
    Please help to fix this issue .
    Thanks,
    Am

    Hi,
    What is the application release? Database version? OS?
    Please see these docs.
    XMl Publisher Reports Fail with java.io.FileNotFoundException on Temp Directory After Cloning [ID 1189764.1]
    JAVA.IO.FILENOTFOUNDEXCEPTION NO SUCH FILE FOR EXCEL FORMAT [ID 428855.1]
    XML Publisher Requests Fail Due To java.io.FileNotFoundException - No such file or directory [ID 1072383.1]
    When Running PDF Report, Getting Error File Is Not Accessable From Node/Machine Or java.io.FileNotFoundException [ID 398897.1]
    Thanks,
    Hussein

  • !!!Very Urgent-Production Issue -Please help

    Hello IDMers,
    We are facing an issue in production, we updated the AD Process form yesterday. Two fields- Employee Type and Employee ID field in AD User Process form got refreshed for all existing users. Those two fields are empty now for all users.
    But these fields have appropriate value in the Xellerate User Table for all users. Now I need to some how populate the Employee Type and Employee ID field for all employees from User Table to AD Process form.
    for example: Consider an Employee called Peter- His emp type is Full Time and Emp ID is 100; which i have it in OIM User Table, but this user is provisioned with AD and now i will have to update his AD Process form so that these two fields are populated. I need to do this for all users in OIM. I guess the prepop adapter triggers only when the form is created for the first time. Please suggest me some ideas.
    Is there a easy way to do this task?
    What my thinking is, I need to have a scheduled task that basically loops through all users and updates their employee type and id field in AD User Form from Xellerate User Table.
    Please help me with this as it is highly important.
    Thanks again every one for your support all the while.
    Regards,
    ~VSN

    hey,
    i was doing lots of migration from one OIM box to another during our last release. I guess something would have gone wrong while doing an import/export from one OIM system to another.
    What I learned was while doing an import the vulnerable object is AD USER (or any resource of OIM) Object (both Process form and process definition), because those are the two objects which you need to import fully no matter how big a change you have done.
    So when you do an import watch out for USER DEFINED FIELDS in the process form because for me the two fields which disappeared were user defined/custom created by me. So make sure you export the latest version;even if you didnt make any changes to them better create a new version copy of the form and then export it.
    Hope that helps.
    ~VSN

  • Join with count() issue, please help!

    Hello All,
    I have this (probably really simple) issue that I cannot seem to resolve...I have 2 tables here (tbl_system_engineer and tbl_task_request)...(only relevant columns are listed below)
    tbl_system_engineer
    - id NUMBER
    - full_name VARCHAR2
    tbl_task_request
    - tr_number NUMBER
    - submitted_on_date DATE (date task was submitted)
    - ass_comp_date DATE (date task is due)
    - closed_date DATE (date task was officially closed)
    - requestor NUMBER (the system engineer id, the person who created this task)
    The query is supposed to summarize how many of the system engineers tasks are as followed:
    - "past completion date" - how many tasks have tbl_task_request.closed_date > tbl_task_request.ass_comp_date OR SYSDATE > tbl_task_request.ass_comp_date for the engineer
    - "Approaching Completion Date" - how many tasks have a tbl_task_request.ass_comp_date in this month but not "past completion date" for the engineer
    - "On Schedule" - how many tasks have a tbl_task_request.ass_comp_date > the end of SYSDATE month and year
    The result set rows are supposed to look like...
    "System Engineer full name", past completion date count, approaching completion date count, on schedule count
    Please help!

    Hi,
    Welcome to the forum!
    That's an example of a Pivot , where you want to GROUP BY a combination of columns, and have some of the columns appear as different columns, not different rows.
    The way to do that is to GROUP BY the expression(s) for which you want rows, and use CASE expressions for the others.
    For example:
    SELECT       e.full_name
    ,       COUNT ( CASE
                   WHEN  r.closed_date     > r.xyz_comp_date
                   OR    SYSDATE          > r.xyz_comp_date
                   THEN  1
                  END
                )     AS overdue
    ,       COUNT ( CASE
                   WHEN  xyz.comp_date     <  ADD_MONTHS ( TRUNC(SYSDATE, 'MONTH')
                                                      , 1
                   AND   r.closed_date     <= r.xyz_comp_date
                   AND   SYSDATE          <= r.xyz_comp_date
                   THEN  1
                  END
                )     AS approaching
    ,       COUNT ( CASE
                   WHEN  xyz.comp_date     >= ADD_MONTHS ( TRUNC(SYSDATE, 'MONTH')
                                                      , 1
                   THEN  1
                  END
                )     AS on_schedule
    FROM       tbl_system_engineer     e
    JOIN       tble_task_request     r     ON     r.requestor     = e.id
    GROUP BY  e.full_name
    ;I don't have versions of your tables, so I can't actually test this. I suspect that some consideration for NULLs needs to be added to the CASE conditions.
    if you post a little sample data (CREATE TABLE and INSERT statements, relevant columns only) then people can test their ideas.
    Sometimes, especially when the columns are mutually exclusive, it's simpler to calculate a value in a sub-query, telling with which column of output each row is associated. That computed value is then used in very simple CASE expressions in the main query,
    Among the annoying features of this site is ithat ir replaces what it thinks are naughty words with s.  I suspect that happend in your post.  I assume all the columns with ** are the same, for which I substituted above.

  • SAP R/3 issue- Please Help

    Hi All,
    Please help in making suggestions on an R/3 issue. The Problem is  we have a standard cube 0PUR_C08 (Purchase Order Item Service Level). Could you please suggest the appropriate ODS and Standard Datasources required to load data into the target cube.
    If possible , please suggest which are the most appropriate R/3 standard tables

    Hi,
    ODS 0PUR_O01 used to load data to cube 0PUR_C08 and the following 4 DS's are used depends on the requierements
    2LIS_02_ITM Purchase Order Items
    2LIS_02_SGR Allocation Schedule Line with Goods Receipt
    2LIS_02_CGR Allocation Confirmation with Goods Receipt
    2LIS_02_SCN Allocation Schedule Line with Confirmation
    Refer the below link for more info.,
    http://help.sap.com/saphelp_nw04/helpdata/en/77/5c27cf43b290408efe91148095d7ff/content.htm
    Regs,
    VACHAN

  • Drag and drop issue, please help.

    I can no longer drag and drop photos within photoshop elements 12.  When working with a layer, I want to move it to a layer within another existing file, and no longer have the option.  The only way I have fixed the issue in the past is uninstall and reinstall the program.  I've read other forum posts and followed the instructions by resetting preferences and it does not work.
    Does anyone have any solutions to this issue?  Please help!

    With both files open, simplest to tile them side by side, you should be able to drag the layer from the source file onto the target file. So long as it shows the 'grasping hand' you can release the mouse and it should add the layer to the target.
    So what is happening now on your system? When you drag the layer to the target what icon is shown - 'grasping hand', 'no entry', something else?
    Cheers,
    Neale
    Insanity is hereditary, you get it from your children
    If this post or another user's post resolves the original issue, please mark the posts as correct and/or helpful accordingly. This helps other users with similar trouble get answers to their questions quicker. Thanks.

Maybe you are looking for

  • Simplify My Family Devices/Accounts

    I need help!  I've tried researching this through blogs etc.  But it's putting it altogether is the problem!  I have the following devices in the family: 1st Adult Member: iPhone 4s, iPad (with retania display) and own Apple ID for iTunes/iCloud (iTu

  • Licence service has stopped working

    Getting the above error when launching Dreamweaver CS4. Have tried all the "solutions" listed on Adobe site to no avail. The last "solution" cleared the error pop up , I get to accept the licence agreement then Dreamweaver crashes. Any advice appreci

  • Trying to figure out how to get font sizes in textfield to show up right

    This is a flash question it just gets a little complicated. Running into a cross platform problem. I have a microsoft .NET application that I created to draw graphics. I put the properties of the drawn object into a database. I then read the properti

  • E61 Open Link from Mail launches wrong browser

    Hi, I've just noticed that, when following a web link from within an email received on my POP3 account, the phone lauches the basic web browser (i.e. the 'Services' application) rather than the more advanced 'Web' application - surely the page should

  • HOW DO I UNINSTALL osx; 10.9?

    It wont support parallels