JVM not found when trying to install NetBeans

Hi all,
I'm a new SUN Certified Java Programmer and I would like to use NetBeans IDE. j2sdk1.4.1_01 seems to be correctly installed on my system (Windows XP Home Edition) (I can see the little Java animation on the download section of this site) and when I run the NetBeans installer I got a message that says "no corresponding JVM found" :'(
My Java teacher has told me to create a JAVA_HOME variable in the system environnement variables and to give it the value "D:\j2sdk1.4.1_01" (Windows XP and sdk are installed on D:\). I've done it but... nothing!
Does anyone have a little idea on how to solve this problem???
Thanks
JadB

Actually, I think the phrase "No JVM found" means the JRE environment has not been setup properly. Most suspicious point is that Tomcat 4/5 doesn't recognise the location of JRE on some Windows platforms. Default location of JRE is C:\program files\java\... and you should notice that there is space in the path which may not be acceptable by some install wizards. You are recommended download a separated copy of JRE and install it on a recognised path, such as C:\J2RE\ . Remember, you should uninstall the previous copy of JRE cobundled with J2SE package before taking any action.

Similar Messages

  • HT1923 did anyone get the apple application support was not found when trying to instal?

    I am having trouble instaling itunes.  has anyone got the apple application support was not found when trying to instal itunes?  it looks like it is not installing all of files to my computer and it can not reach a certain folder

    With the Error 2, let's try a standalone Apple Application Support install. It still might not install, but fingers crossed any error messages will give us a better idea of the underlying cause of the issue.
    Download and save a copy of the iTunesSetup.exe (or iTunes64setup.exe) installer file to your hard drive:
    http://www.apple.com/itunes/download/
    Download and install the free trial version of WinRAR:
    http://www.rarlab.com/
    Right-click the iTunesSetup.exe (or iTunes64Setup.exe), and select "Extract to iTunesSetup" (or "Extract to iTunes64Setup"). WinRAR will expand the contents of the file into a folder called "iTunesSetup" (or "iTunes64Setup").
    Go into the folder and doubleclick the AppleApplicationSupport.msi to do a standalone AAS install.
    Does it install properly for you?
    If instead you get an error message during the install, let us know what it says. (Precise text, please.)

  • Installed itunes update 10.5.0.142 and now get the error message "Disc Burner or Software Not Found" when trying to burn playlist to disc.

    Installed itunes update 10.5.0.142 and now get the error message "Disc Burner or Software Not Found" when trying to burn playlist to disc.  Windows 7

    Hello queenabs,
    It sounds like you are trying to burn a playlist to a disc in iTunes, but you are getting the error, "disc burner or software not found."  I found a couple of resources that I think might help with an error like this.
    I recommend starting with the steps in this article:
    iTunes for Windows: Optical drive is no longer recognized, or "Disc burner or software not found" alert after install
    http://support.apple.com/kb/TS2308
    If you are still having trouble with burning a disc after following the steps in that article, I recommend following the steps in this article:
    iTunes for Windows: Additional troubleshooting tips for burning issues
    http://support.apple.com/kb/TS1374
    Thank you for using Apple Support Communities.
    Best,
    Sheila M.

  • Keep getting Disc Burner or software not found when trying to burn a CD

    I am not able to burn a playlist to a CD and get an error at the top of Itunes window "Disc Burner or Software Not Found". I have been able to burn CDs in the past with this same computer but had some issues with songs in itunes. Support had me uninstall Itunes and reinstall. I have also uninstalled the device in the device manager and re-installed it. I really don't know what to try except to ask for help here. I would appreciate any direction I can get. I have a Dell desktop XPS running on Windows 8.

    Hi daurel, 
    Thanks for participating in the Apple Support Communities. 
    It sounds like you receive the error "Disc Burner or Software Not Found" when trying to burn CDs. You mention that you've already tried removing and reinstalling iTunes, and other drivers, and these are good steps. 
    If the situation continues, be sure to try the tips in this article:
    iTunes for Windows: Optical drive is no longer recognized, or "Disc burner or software not found" alert after install - Apple Support
    Sincerely,
    Jeremy 

  • Why do I keep getting actionlist not found when trying to update to version 11.6.602.180?

    WHy do I keep getting actionlist not found when trying to update to update to version 11.6.602.180?

    This problem and others are outlined in this help document.  In addition, please try installing from the appropriate stand alone Windows installers located here:
    Installation Problems - Flash Player - Windows

  • It says "request resource not found" when trying to restore my iphone 4s

    it says "request resource not found" when trying to restore my iphone 4s

    This article is for iPhones that are unable to be restored.
    You may have to try recovery mode (as described below) more than once.
    http://support.apple.com/kb/HT1808

  • I keep getting result code -43 not found when trying to load certain instruments. Any idea why

    I keep getting error code -43 not found when trying to load certain instruments. Any ideas?

    Errors 3000-3999 (3004, 3013, 3014, 3018, 3164, 3194, and so on): Error codes in the 3000 range generally mean that iTunes cannot contact the update server (gs.apple.com) on ports 80 or 443.
    Update to the latest version of iTunes.
    Verify the computer's date and time are accurate.
    Check that your security or firewall software is not interfering with ports 80 or 443, or with the server gs.apple.com.
    Follow Troubleshooting security software. Often, uninstalling third-party security software will resolve these errors.
    An entry in your hosts file may be redirecting requests to gs.apple.com (see "Unable to contact the iOS software update server gs.apple.com" above).
    Internet proxy settings can cause this issue. If you are using a proxy, try without using one.
    Test restoring while connected to a known-good network.

  • "jvm not found" on tunes transfer install----PLEASE HELP

    hey all! very new to mac ownership (been using my new pro for only a few hours now!) and im trying to install tunes transfer to get all my jams from my pod to my new machine, but i keep getting the "jvm not found" error. how can i correct this?? im not very technical so if anybody could explain this to me in the simplest way possible i would greatly appreciate it! thanks in advance!
    -John

    The only Tunes Transfer I can find is a Windows app, but assuming you've found a Mac version somewhere...
    The error means it can't find your installation of Java. My first guess would be that TT is looking for an older version of Java than the one that's installed on MacOS X these days.
    Since moving music from iPods back to computers is not supported by Apple, I won't recommend any alternative applications by name. But you might try googling for iTunes spelled backwards

  • Adobe Captivate does not start when trying to install after download.

    Downloaded Adobe Captivate 7 but when trying to install it does not do anything.

    Hi dimitri2014,
    The downloaded Captivate files has 2 parts - One with .7z extension and the other with .exe extension.
    Please run the .exe file to initiate the installation.
    Alternatively can try re-downloading both the files from the direct download links available at : http://prodesigntools.com/adobe-captivate-7-free-trial-direct-download -links.html
    Please make sure you follow the important steps mentioned on the page before initiating the download.

  • Iphone will not backup, when trying to install latest software

    For some reason, it appears, that the phone will not backup, while trying to install latest software. PC, is running windows 7. Anyone out there have the same problem ?

    solved - repair disk permissions using disk utility...
    thanks.

  • Error message "The specified user or domain group was not found" when trying to access certain sites

    Hello.
    My setup is as such (this is a testing environment), spread over two virtual machines:
    -Windows Server 2012 with AD DS and MS SQL Server 2012
    -SharePoint Server 2013
    When trying to access a lot of site collections in different web applications, I am given this error message. The error message started suddenly appearing, and I do not know what caused it. It started happening after I turned on Request Management Service
    Application, though I can't see how that would cause this, and it was not fixed after I turned it off.
    I have the necessary permissions, as I have been able to log on to the sites before without any issue. I am using a domain administrator account who is a site collection administrator.
    At first I thought it was an issue related to User Profile Service Application, as I was having issues starting the Synchronisation instance. I deleted and re-installed UPS, got synchronisation to work, and it still does not work. I have made no changed
    to the AD schema. I have not moved any accounts recently, and I have not deleted any accounts.
    Here are the ULS log entries. It seems to have been truncated some.
    06/11/2014 10:17:31.94 w3wp.exe (0x1904) 0x0FAC SharePoint Foundation Authentication Authorization agb9s Medium Non-OAuth request. IsAuthenticated=True, UserIdentityName=0#.w|sp\administrator, ClaimsCount=26 dbc2999c-6f92-a0b4-a4e8-f7ed10437e35
    06/11/2014 10:17:32.02 w3wp.exe (0x1904) 0x0FAC SharePoint Foundation Database ahjqp High [Forced due to logging gap, cached @ 06/11/2014 10:17:31.95, Original Level: Verbose] SQL connection time: 0.0556 dbc2999c-6f92-a0b4-a4e8-f7ed10437e35
    06/11/2014 10:17:32.02 w3wp.exe (0x1904) 0x0FAC SharePoint Foundation Files 00000 High UserAgent not available, file operations may not be optimized. at Microsoft.SharePoint.SPFileStreamManager.CreateCobaltStreamContainer(SPFileStreamStore spfs, ILockBytes ilb, Boolean copyOnFirstWrite, Boolean disposeIlb) at Microsoft.SharePoint.SPFileStreamManager.SetInputLockBytes(SPFileInfo& fileInfo, SqlSession session, PrefetchResult prefetchResult) at Microsoft.SharePoint.CoordinatedStreamBuffer.SPCoordinatedStreamBufferFactory.CreateFromDocumentRowset(Guid databaseId, SqlSession session, SPFileStreamManager spfstm, Object[] metadataRow, SPRowset contentRowset, SPDocumentBindRequest& dbreq, SPDocumentBindResults& dbres) at Microsoft.SharePoint.SPSqlClient.GetDocumentContentRow(Int32 rowOrd, Object ospFileStmMgr, SPDocumentBindRequest& dbreq, SPDocumentBindResults& dbres... dbc2999c-6f92-a0b4-a4e8-f7ed10437e35
    06/11/2014 10:17:32.02* w3wp.exe (0x1904) 0x0FAC SharePoint Foundation Files 00000 High ...) at Microsoft.SharePoint.Library.SPRequestInternalClass.GetFileAndMetaInfo(String bstrUrl, Byte bPageView, Byte bPageMode, Byte bGetBuildDependencySet, String bstrCurrentFolderUrl, Int32 iRequestVersion, Byte bMainFileRequest, Boolean& pbCanCustomizePages, Boolean& pbCanPersonalizeWebParts, Boolean& pbCanAddDeleteWebParts, Boolean& pbGhostedDocument, Boolean& pbDefaultToPersonal, Boolean& pbIsWebWelcomePage, String& pbstrSiteRoot, Guid& pgSiteId, UInt32& pdwVersion, String& pbstrTimeLastModified, String& pbstrContent, UInt32& pdwPartCount, Object& pvarMetaData, Object& pvarMultipleMeetingDoclibRootFolders, String& pbstrRedirectUrl, Boolean& pbObjectIsList, Guid& pgListId, UInt32& pdwItemId, Int64& pllListFlags, Boolean& pbAccessDenied, Guid& pgDocid, Byte& piLevel, UInt64& ppermMask, ... dbc2999c-6f92-a0b4-a4e8-f7ed10437e35
    06/11/2014 10:17:32.02* w3wp.exe (0x1904) 0x0FAC SharePoint Foundation Files 00000 High ...Object& pvarBuildDependencySet, UInt32& pdwNumBuildDependencies, Object& pvarBuildDependencies, String& pbstrFolderUrl, String& pbstrContentTypeOrder, Guid& pgDocScopeId) at Microsoft.SharePoint.Library.SPRequestInternalClass.GetFileAndMetaInfo(String bstrUrl, Byte bPageView, Byte bPageMode, Byte bGetBuildDependencySet, String bstrCurrentFolderUrl, Int32 iRequestVersion, Byte bMainFileRequest, Boolean& pbCanCustomizePages, Boolean& pbCanPersonalizeWebParts, Boolean& pbCanAddDeleteWebParts, Boolean& pbGhostedDocument, Boolean& pbDefaultToPersonal, Boolean& pbIsWebWelcomePage, String& pbstrSiteRoot, Guid& pgSiteId, UInt32& pdwVersion, String& pbstrTimeLastModified, String& pbstrContent, UInt32& pdwPartCount, Object& pvarMetaData, Object& pvarMultipleMeetingDoclibRootFolders, String& pbst... dbc2999c-6f92-a0b4-a4e8-f7ed10437e35
    06/11/2014 10:17:32.02* w3wp.exe (0x1904) 0x0FAC SharePoint Foundation Files 00000 High ...rRedirectUrl, Boolean& pbObjectIsList, Guid& pgListId, UInt32& pdwItemId, Int64& pllListFlags, Boolean& pbAccessDenied, Guid& pgDocid, Byte& piLevel, UInt64& ppermMask, Object& pvarBuildDependencySet, UInt32& pdwNumBuildDependencies, Object& pvarBuildDependencies, String& pbstrFolderUrl, String& pbstrContentTypeOrder, Guid& pgDocScopeId) at Microsoft.SharePoint.Library.SPRequest.GetFileAndMetaInfo(String bstrUrl, Byte bPageView, Byte bPageMode, Byte bGetBuildDependencySet, String bstrCurrentFolderUrl, Int32 iRequestVersion, Byte bMainFileRequest, Boolean& pbCanCustomizePages, Boolean& pbCanPersonalizeWebParts, Boolean& pbCanAddDeleteWebParts, Boolean& pbGhostedDocument, Boolean& pbDefaultToPersonal, Boolean& pbIsWebWelcomePage, String& pbstrSiteRoot, Guid& pgSiteId, UInt32& pdwVersion,... dbc2999c-6f92-a0b4-a4e8-f7ed10437e35
    06/11/2014 10:17:32.02* w3wp.exe (0x1904) 0x0FAC SharePoint Foundation Files 00000 High ... String& pbstrTimeLastModified, String& pbstrContent, UInt32& pdwPartCount, Object& pvarMetaData, Object& pvarMultipleMeetingDoclibRootFolders, String& pbstrRedirectUrl, Boolean& pbObjectIsList, Guid& pgListId, UInt32& pdwItemId, Int64& pllListFlags, Boolean& pbAccessDenied, Guid& pgDocid, Byte& piLevel, UInt64& ppermMask, Object& pvarBuildDependencySet, UInt32& pdwNumBuildDependencies, Object& pvarBuildDependencies, String& pbstrFolderUrl, String& pbstrContentTypeOrder, Guid& pgDocScopeId) at Microsoft.SharePoint.SPWeb.GetWebPartPageContent(Uri pageUrl, Int32 pageVersion, PageView requestedView, HttpContext context, Boolean forRender, Boolean includeHidden, Boolean mainFileRequest, Boolean fetchDependencyInformation, Boolean& ghostedPage, String& siteRoot, Guid& siteId, Int64& bytes, ... dbc2999c-6f92-a0b4-a4e8-f7ed10437e35
    06/11/2014 10:17:32.02* w3wp.exe (0x1904) 0x0FAC SharePoint Foundation Files 00000 High ...Guid& docId, UInt32& docVersion, String& timeLastModified, Byte& level, Object& buildDependencySetData, UInt32& dependencyCount, Object& buildDependencies, SPWebPartCollectionInitialState& initialState, Object& oMultipleMeetingDoclibRootFolders, String& redirectUrl, Boolean& ObjectIsList, Guid& listId) at Microsoft.SharePoint.ApplicationRuntime.SPRequestModuleData.FetchWebPartPageInformationForInit(HttpContext context, SPWeb spweb, Boolean mainFileRequest, String path, Boolean impersonate, Boolean& isAppWeb, Boolean& fGhostedPage, Guid& docId, UInt32& docVersion, String& timeLastModified, SPFileLevel& spLevel, String& masterPageUrl, String& customMasterPageUrl, String& webUrl, String& siteUrl, Guid& siteId, Object& buildDependencySetData, SPWebPartCollectionInitialState& initialState, ... dbc2999c-6f92-a0b4-a4e8-f7ed10437e35
    06/11/2014 10:17:32.02* w3wp.exe (0x1904) 0x0FAC SharePoint Foundation Files 00000 High ...String& siteRoot, String& redirectUrl, Object& oMultipleMeetingDoclibRootFolders, Boolean& objectIsList, Guid& listId, Int64& bytes) at Microsoft.SharePoint.ApplicationRuntime.SPRequestModuleData.GetFileForRequest(HttpContext context, SPWeb web, Boolean exclusion, String virtualPath) at Microsoft.SharePoint.ApplicationRuntime.SPRequestModule.InitContextWeb(HttpContext context, SPWeb web) at Microsoft.SharePoint.WebControls.SPControl.SPWebEnsureSPControl(HttpContext context) at Microsoft.SharePoint.ApplicationRuntime.SPRequestModule.GetContextWeb(HttpContext context) at Microsoft.SharePoint.ApplicationRuntime.SPRequestModule.PostResolveRequestCacheHandler(Object oSender, EventArgs ea) at System.Web.HttpApplication.SyncEventExecutionStep.System.Web.HttpApplication.IEx... dbc2999c-6f92-a0b4-a4e8-f7ed10437e35
    06/11/2014 10:17:32.02* w3wp.exe (0x1904) 0x0FAC SharePoint Foundation Files 00000 High ...ecutionStep.Execute() at System.Web.HttpApplication.ExecuteStep(IExecutionStep step, Boolean& completedSynchronously) at System.Web.HttpApplication.PipelineStepManager.ResumeSteps(Exception error) at System.Web.HttpApplication.BeginProcessRequestNotification(HttpContext context, AsyncCallback cb) at System.Web.HttpRuntime.ProcessRequestNotificationPrivate(IIS7WorkerRequest wr, HttpContext context) at System.Web.Hosting.PipelineRuntime.ProcessRequestNotificationHelper(IntPtr rootedObjectsPointer, IntPtr nativeRequestContext, IntPtr moduleData, Int32 flags) at System.Web.Hosting.PipelineRuntime.ProcessRequestNotification(IntPtr rootedObjectsPointer, IntPtr nativeRequestContext, IntPtr moduleData, Int32 flags) at System.Web.Hosting.UnsafeIISMethods.MgdIndicateCompl... dbc2999c-6f92-a0b4-a4e8-f7ed10437e35
    06/11/2014 10:17:32.02* w3wp.exe (0x1904) 0x0FAC SharePoint Foundation Files 00000 High ...etion(IntPtr pHandler, RequestNotificationStatus& notificationStatus) at System.Web.Hosting.UnsafeIISMethods.MgdIndicateCompletion(IntPtr pHandler, RequestNotificationStatus& notificationStatus) at System.Web.Hosting.PipelineRuntime.ProcessRequestNotificationHelper(IntPtr rootedObjectsPointer, IntPtr nativeRequestContext, IntPtr moduleData, Int32 flags) at System.Web.Hosting.PipelineRuntime.ProcessRequestNotification(IntPtr rootedObjectsPointer, IntPtr nativeRequestContext, IntPtr moduleData, Int32 flags) dbc2999c-6f92-a0b4-a4e8-f7ed10437e35
    06/11/2014 10:17:32.02 w3wp.exe (0x1904) 0x0FAC SharePoint Foundation Files aiv4w Medium Spent 0 ms to bind 3356 byte file stream dbc2999c-6f92-a0b4-a4e8-f7ed10437e35
    06/11/2014 10:17:32.02 w3wp.exe (0x1904) 0x0FAC SharePoint Foundation Logging Correlation Data xmnv Medium Site=/ dbc2999c-6f92-a0b4-a4e8-f7ed10437e35
    06/11/2014 10:17:32.02 w3wp.exe (0x1904) 0x0FAC SharePoint Foundation Monitoring b4ly High Leaving Monitored Scope (PostResolveRequestCacheHandler). Execution Time=66.6457 dbc2999c-6f92-a0b4-a4e8-f7ed10437e35
    06/11/2014 10:17:32.02 w3wp.exe (0x1904) 0x1BC0 SharePoint Portal Server User Profiles ajk4d Medium UserProfileProperty_WCFLogging::Begin ProfilePropertyServiceClient.ExecuteOnChannel acc2999c-dfbc-a0b4-a4e8-f962e574ee66
    06/11/2014 10:17:32.02 w3wp.exe (0x1904) 0x1BC0 SharePoint Portal Server User Profiles ajk35 Medium MossClientBase_WCFLogging::Begin MossClientBase.ExecuteOnChannel acc2999c-dfbc-a0b4-a4e8-f962e574ee66
    06/11/2014 10:17:32.02 w3wp.exe (0x1904) 0x1BC0 SharePoint Portal Server User Profiles ajk36 Medium MossClientBase_WCFLogging:: MossClientBase.ExecuteOnChannel - Executing codeblock on channel acc2999c-dfbc-a0b4-a4e8-f962e574ee66
    06/11/2014 10:17:32.02 w3wp.exe (0x1904) 0x1BC0 SharePoint Foundation Topology e5mc Medium WcfSendRequest: RemoteAddress: 'http://sp13:32843/44fa09d6891d4d7bb9856a0da10f6a84/ProfilePropertyService.svc' Channel: 'Microsoft.Office.Server.UserProfiles.IProfilePropertyService' Action: 'http://Microsoft.Office.Server.UserProfiles/GetProfileProperties' MessageId: 'urn:uuid:ec3c0f34-3285-4771-a7a1-24039cb4ced8' acc2999c-dfbc-a0b4-a4e8-f962e574ee66
    06/11/2014 10:17:32.03 w3wp.exe (0x1904) 0x0FAC Web Content Management Publishing 7fz3 Medium Setting [Display] as the FormContext.FormMode for the current page dbc2999c-6f92-a0b4-a4e8-f7ed10437e35
    06/11/2014 10:17:32.03 w3wp.exe (0x1904) 0x0FAC SharePoint Foundation General 8sl1 High DelegateControl: Exception thrown while adding control 'Microsoft.SharePoint.Publishing.Navigation.PortalSiteMapDataSource': Microsoft.SharePoint.SPException: The specified user or domain group was not found. ---> System.Security.Principal.IdentityNotMappedException: Some or all identity references could not be translated. at System.Security.Principal.NTAccount.Translate(IdentityReferenceCollection sourceAccounts, Type targetType, Boolean forceSuccess) at System.Security.Principal.NTAccount.Translate(Type targetType) at Microsoft.SharePoint.Administration.Claims.SPClaimProviderManager.GetProviderUserKeyClaim(IClaimsIdentity claimsIdentity, SPClaim loginClaim) --- End of inner exception stack trace --- at Microsoft.SharePoint.Administration.Claims.SPClaimProviderManager.... dbc2999c-6f92-a0b4-a4e8-f7ed10437e35
    06/11/2014 10:17:32.03* w3wp.exe (0x1904) 0x0FAC SharePoint Foundation General 8sl1 High ...GetProviderUserKeyClaim(IClaimsIdentity claimsIdentity, SPClaim loginClaim) at Microsoft.SharePoint.Administration.Claims.SPClaimProviderManager.GetProviderUserKey(IClaimsIdentity claimsIdentity, String encodedIdentityClaimSuffix) at Microsoft.SharePoint.Administration.Claims.SPClaimProviderManager.GetProviderUserKey(String encodedIdentityClaimSuffix) at Microsoft.SharePoint.Utilities.SPUtility.GetFullUserKeyFromFullName(String fullName) at Microsoft.SharePoint.SPGlobal.CreateSPRequestAndSetIdentity(SPSite site, String name, Boolean bNotGlobalAdminCode, String strUrl, Boolean bNotAddToContext, Byte[] UserToken, SPAppPrincipalToken appPrincipalToken, String userName, Boolean bIgnoreTokenTimeout, Boolean bAsAnonymous) at Microsoft.SharePoint.SPSite.get_Request() at Mi... dbc2999c-6f92-a0b4-a4e8-f7ed10437e35
    06/11/2014 10:17:32.03* w3wp.exe (0x1904) 0x0FAC SharePoint Foundation General 8sl1 High ...crosoft.SharePoint.SPSite.OpenWeb(Guid gWebId, Int32 mondoHint) at Microsoft.SharePoint.Publishing.CachedObjectFactory.OpenWebFromSuperUserSite(Guid webId) at Microsoft.SharePoint.Publishing.CacheManager..ctor(SPSite site) at Microsoft.SharePoint.Publishing.CacheManager.GetManager(SPSite site, Boolean useContextSite, Boolean allowContextSiteOptimization, Boolean refreshIfNoContext) at Microsoft.SharePoint.Publishing.CachedAreaLookup.EnsureLookup(Boolean errorsAsExceptions) at Microsoft.SharePoint.Publishing.CachedAreaLookup.GetCachedAreaOrException() at Microsoft.SharePoint.Publishing.Navigation.TaxonomyNavigationCache.GetCachedWebInfo(CachedAreaLookup cachedAreaLookup) at Microsoft.SharePoint.Publishing.Navigation.TaxonomyNavigationCache.GetWebNavigationSetting... dbc2999c-6f92-a0b4-a4e8-f7ed10437e35
    06/11/2014 10:17:32.03* w3wp.exe (0x1904) 0x0FAC SharePoint Foundation General 8sl1 High ...s(CachedAreaLookup cachedArea, CachedAreaLookup& parentCachedArea, Exception& loadError) at Microsoft.SharePoint.Publishing.Navigation.TaxonomyNavigation.GetEffectiveProviderSettingsList(CachedAreaLookup cachedArea, Boolean includeInheritedSettings) at Microsoft.SharePoint.Publishing.Navigation.TaxonomyNavigation.GetEffectiveProviderSettings[T](CachedAreaLookup cachedArea, String siteMapProviderName, Boolean includeInheritedSettings, CachedAreaLookup& cachedAreaWithSettings) at Microsoft.SharePoint.Publishing.Navigation.TaxonomyNavigation.GetEffectiveProviderSettings[T](SPWeb web, String siteMapProviderName, Boolean includeInheritedSettings) at Microsoft.SharePoint.Publishing.Navigation.SwitchableSiteMapProvider.GetCurrentWrappedProvider() at Microsoft.SharePoint.Publis... dbc2999c-6f92-a0b4-a4e8-f7ed10437e35
    06/11/2014 10:17:32.03* w3wp.exe (0x1904) 0x0FAC SharePoint Foundation General 8sl1 High ...hing.Navigation.SwitchableSiteMapProvider.get_RootNode() at Microsoft.SharePoint.Publishing.Navigation.SwitchableDataSourceBehavior.AssignProperties(SiteMapProvider targetProvider) at Microsoft.SharePoint.Publishing.Navigation.PortalSiteMapDataSource.OnInit(EventArgs e) at System.Web.UI.Control.InitRecursive(Control namingContainer) at System.Web.UI.Control.AddedControl(Control control, Int32 index) at Microsoft.SharePoint.WebControls.DelegateControl.AddControlResilient(Control ctl) dbc2999c-6f92-a0b4-a4e8-f7ed10437e35
    06/11/2014 10:17:32.03 w3wp.exe (0x1904) 0x0FAC SharePoint Foundation General 8sl1 High DelegateControl: Exception thrown while adding control 'Microsoft.SharePoint.Publishing.Navigation.PortalSiteMapDataSource': Microsoft.SharePoint.SPException: The specified user or domain group was not found. ---> System.Security.Principal.IdentityNotMappedException: Some or all identity references could not be translated. at System.Security.Principal.NTAccount.Translate(IdentityReferenceCollection sourceAccounts, Type targetType, Boolean forceSuccess) at System.Security.Principal.NTAccount.Translate(Type targetType) at Microsoft.SharePoint.Administration.Claims.SPClaimProviderManager.GetProviderUserKeyClaim(IClaimsIdentity claimsIdentity, SPClaim loginClaim) --- End of inner exception stack trace --- at Microsoft.SharePoint.Administration.Claims.SPClaimProviderManager.... dbc2999c-6f92-a0b4-a4e8-f7ed10437e35
    06/11/2014 10:17:32.03* w3wp.exe (0x1904) 0x0FAC SharePoint Foundation General 8sl1 High ...GetProviderUserKeyClaim(IClaimsIdentity claimsIdentity, SPClaim loginClaim) at Microsoft.SharePoint.Administration.Claims.SPClaimProviderManager.GetProviderUserKey(IClaimsIdentity claimsIdentity, String encodedIdentityClaimSuffix) at Microsoft.SharePoint.Administration.Claims.SPClaimProviderManager.GetProviderUserKey(String encodedIdentityClaimSuffix) at Microsoft.SharePoint.Utilities.SPUtility.GetFullUserKeyFromFullName(String fullName) at Microsoft.SharePoint.SPGlobal.CreateSPRequestAndSetIdentity(SPSite site, String name, Boolean bNotGlobalAdminCode, String strUrl, Boolean bNotAddToContext, Byte[] UserToken, SPAppPrincipalToken appPrincipalToken, String userName, Boolean bIgnoreTokenTimeout, Boolean bAsAnonymous) at Microsoft.SharePoint.SPSite.get_Request() at Mi... dbc2999c-6f92-a0b4-a4e8-f7ed10437e35
    06/11/2014 10:17:32.03* w3wp.exe (0x1904) 0x0FAC SharePoint Foundation General 8sl1 High ...crosoft.SharePoint.SPSite.OpenWeb(Guid gWebId, Int32 mondoHint) at Microsoft.SharePoint.Publishing.CachedObjectFactory.OpenWebFromSuperUserSite(Guid webId) at Microsoft.SharePoint.Publishing.CacheManager..ctor(SPSite site) at Microsoft.SharePoint.Publishing.CacheManager.GetManager(SPSite site, Boolean useContextSite, Boolean allowContextSiteOptimization, Boolean refreshIfNoContext) at Microsoft.SharePoint.Publishing.CachedAreaLookup.EnsureLookup(Boolean errorsAsExceptions) at Microsoft.SharePoint.Publishing.CachedAreaLookup.GetCachedAreaOrException() at Microsoft.SharePoint.Publishing.Navigation.TaxonomyNavigationCache.GetCachedWebInfo(CachedAreaLookup cachedAreaLookup) at Microsoft.SharePoint.Publishing.Navigation.TaxonomyNavigationCache.GetWebNavigationSetting... dbc2999c-6f92-a0b4-a4e8-f7ed10437e35
    06/11/2014 10:17:32.03* w3wp.exe (0x1904) 0x0FAC SharePoint Foundation General 8sl1 High ...s(CachedAreaLookup cachedArea, CachedAreaLookup& parentCachedArea, Exception& loadError) at Microsoft.SharePoint.Publishing.Navigation.TaxonomyNavigation.GetEffectiveProviderSettingsList(CachedAreaLookup cachedArea, Boolean includeInheritedSettings) at Microsoft.SharePoint.Publishing.Navigation.TaxonomyNavigation.GetEffectiveProviderSettings[T](CachedAreaLookup cachedArea, String siteMapProviderName, Boolean includeInheritedSettings, CachedAreaLookup& cachedAreaWithSettings) at Microsoft.SharePoint.Publishing.Navigation.TaxonomyNavigation.GetEffectiveProviderSettings[T](SPWeb web, String siteMapProviderName, Boolean includeInheritedSettings) at Microsoft.SharePoint.Publishing.Navigation.SwitchableSiteMapProvider.GetCurrentWrappedProvider() at Microsoft.SharePoint.Publis... dbc2999c-6f92-a0b4-a4e8-f7ed10437e35
    06/11/2014 10:17:32.03* w3wp.exe (0x1904) 0x0FAC SharePoint Foundation General 8sl1 High ...hing.Navigation.SwitchableSiteMapProvider.get_RootNode() at Microsoft.SharePoint.Publishing.Navigation.SwitchableDataSourceBehavior.AssignProperties(SiteMapProvider targetProvider) at Microsoft.SharePoint.Publishing.Navigation.PortalSiteMapDataSource.OnInit(EventArgs e) at System.Web.UI.Control.InitRecursive(Control namingContainer) at System.Web.UI.Control.AddedControl(Control control, Int32 index) at Microsoft.SharePoint.WebControls.DelegateControl.AddControlResilient(Control ctl) dbc2999c-6f92-a0b4-a4e8-f7ed10437e35
    06/11/2014 10:17:32.03 w3wp.exe (0x1904) 0x0FAC SharePoint Foundation General 8sl1 High DelegateControl: Exception thrown while adding control 'ASP._controltemplates_15_metadatanavtree_ascx': Microsoft.SharePoint.SPException: The specified user or domain group was not found. ---> System.Security.Principal.IdentityNotMappedException: Some or all identity references could not be translated. at System.Security.Principal.NTAccount.Translate(IdentityReferenceCollection sourceAccounts, Type targetType, Boolean forceSuccess) at System.Security.Principal.NTAccount.Translate(Type targetType) at Microsoft.SharePoint.Administration.Claims.SPClaimProviderManager.GetProviderUserKeyClaim(IClaimsIdentity claimsIdentity, SPClaim loginClaim) --- End of inner exception stack trace --- at Microsoft.SharePoint.Administration.Claims.SPClaimProviderManager.GetProviderUserKeyCla... dbc2999c-6f92-a0b4-a4e8-f7ed10437e35
    06/11/2014 10:17:32.03* w3wp.exe (0x1904) 0x0FAC SharePoint Foundation General 8sl1 High ...im(IClaimsIdentity claimsIdentity, SPClaim loginClaim) at Microsoft.SharePoint.Administration.Claims.SPClaimProviderManager.GetProviderUserKey(IClaimsIdentity claimsIdentity, String encodedIdentityClaimSuffix) at Microsoft.SharePoint.Administration.Claims.SPClaimProviderManager.GetProviderUserKey(String encodedIdentityClaimSuffix) at Microsoft.SharePoint.Utilities.SPUtility.GetFullUserKeyFromFullName(String fullName) at Microsoft.SharePoint.SPGlobal.CreateSPRequestAndSetIdentity(SPSite site, String name, Boolean bNotGlobalAdminCode, String strUrl, Boolean bNotAddToContext, Byte[] UserToken, SPAppPrincipalToken appPrincipalToken, String userName, Boolean bIgnoreTokenTimeout, Boolean bAsAnonymous) at Microsoft.SharePoint.SPSite.get_Request() at Microsoft.SharePoint.SP... dbc2999c-6f92-a0b4-a4e8-f7ed10437e35
    06/11/2014 10:17:32.03* w3wp.exe (0x1904) 0x0FAC SharePoint Foundation General 8sl1 High ...Site.OpenWeb(Guid gWebId, Int32 mondoHint) at Microsoft.SharePoint.Publishing.CachedObjectFactory.OpenWebFromSuperUserSite(Guid webId) at Microsoft.SharePoint.Publishing.CacheManager..ctor(SPSite site) at Microsoft.SharePoint.Publishing.CacheManager.GetManager(SPSite site, Boolean useContextSite, Boolean allowContextSiteOptimization, Boolean refreshIfNoContext) at Microsoft.Office.DocumentManagement.MetadataNavigation.MetadataNavigationSettings.GetCachedArea(SPWeb web) at Microsoft.Office.DocumentManagement.MetadataNavigation.MetadataNavigationContext.GetMetadataNavigationHintsForList(SPWeb web, Guid listGuid) at Microsoft.Office.DocumentManagement.MetadataNavigation.MetadataNavigationSettings.GetMetadataNavigationSettings(SPWeb web, Guid sourceListId, Boolean check... dbc2999c-6f92-a0b4-a4e8-f7ed10437e35
    06/11/2014 10:17:32.03* w3wp.exe (0x1904) 0x0FAC SharePoint Foundation General 8sl1 High ...WebPropHint) at Microsoft.Office.DocumentManagement.MetadataNavigation.MetadataNavigationContext.get_NavigationSettings() at Microsoft.Office.DocumentManagement.MetadataNavigation.MetadataNavigationContext.EnsurePageInitEventHandling(Control controlOnPage) at Microsoft.Office.Server.WebControls.MetadataHierarchyDataSourceControl.OnInit(EventArgs e) at System.Web.UI.Control.InitRecursive(Control namingContainer) at System.Web.UI.Control.InitRecursive(Control namingContainer) at System.Web.UI.Control.InitRecursive(Control namingContainer) at System.Web.UI.Control.AddedControl(Control control, Int32 index) at Microsoft.SharePoint.WebControls.DelegateControl.AddControlResilient(Control ctl) dbc2999c-6f92-a0b4-a4e8-f7ed10437e35
    06/11/2014 10:17:32.03 w3wp.exe (0x1904) 0x0FAC SharePoint Foundation General 8nca Medium Application error when access /SitePages/Home.aspx, Error=Some or all identity references could not be translated. at System.Security.Principal.NTAccount.Translate(IdentityReferenceCollection sourceAccounts, Type targetType, Boolean forceSuccess) at System.Security.Principal.NTAccount.Translate(Type targetType) at Microsoft.SharePoint.Administration.Claims.SPClaimProviderManager.GetProviderUserKeyClaim(IClaimsIdentity claimsIdentity, SPClaim loginClaim) dbc2999c-6f92-a0b4-a4e8-f7ed10437e35
    06/11/2014 10:17:32.03 w3wp.exe (0x1904) 0x0FAC SharePoint Foundation Runtime tkau Unexpected System.Security.Principal.IdentityNotMappedException: Some or all identity references could not be translated. at System.Security.Principal.NTAccount.Translate(IdentityReferenceCollection sourceAccounts, Type targetType, Boolean forceSuccess) at System.Security.Principal.NTAccount.Translate(Type targetType) at Microsoft.SharePoint.Administration.Claims.SPClaimProviderManager.GetProviderUserKeyClaim(IClaimsIdentity claimsIdentity, SPClaim loginClaim) dbc2999c-6f92-a0b4-a4e8-f7ed10437e35
    06/11/2014 10:17:32.03 w3wp.exe (0x1904) 0x0FAC SharePoint Foundation General ajlz0 High Getting Error Message for Exception System.Web.HttpUnhandledException (0x80004005): Exception of type 'System.Web.HttpUnhandledException' was thrown. ---> Microsoft.SharePoint.SPException: The specified user or domain group was not found. ---> System.Security.Principal.IdentityNotMappedException: Some or all identity references could not be translated. at System.Security.Principal.NTAccount.Translate(IdentityReferenceCollection sourceAccounts, Type targetType, Boolean forceSuccess) at System.Security.Principal.NTAccount.Translate(Type targetType) at Microsoft.SharePoint.Administration.Claims.SPClaimProviderManager.GetProviderUserKeyClaim(IClaimsIdentity claimsIdentity, SPClaim loginClaim) --- End of inner exception stack trace --- at Microsoft.SharePoint.Administration.... dbc2999c-6f92-a0b4-a4e8-f7ed10437e35
    06/11/2014 10:17:32.03* w3wp.exe (0x1904) 0x0FAC SharePoint Foundation General ajlz0 High ...Claims.SPClaimProviderManager.GetProviderUserKeyClaim(IClaimsIdentity claimsIdentity, SPClaim loginClaim) at Microsoft.SharePoint.Administration.Claims.SPClaimProviderManager.GetProviderUserKey(IClaimsIdentity claimsIdentity, String encodedIdentityClaimSuffix) at Microsoft.SharePoint.Administration.Claims.SPClaimProviderManager.GetProviderUserKey(String encodedIdentityClaimSuffix) at Microsoft.SharePoint.Utilities.SPUtility.GetFullUserKeyFromFullName(String fullName) at Microsoft.SharePoint.SPGlobal.CreateSPRequestAndSetIdentity(SPSite site, String name, Boolean bNotGlobalAdminCode, String strUrl, Boolean bNotAddToContext, Byte[] UserToken, SPAppPrincipalToken appPrincipalToken, String userName, Boolean bIgnoreTokenTimeout, Boolean bAsAnonymous) at Microsoft.SharePoint.... dbc2999c-6f92-a0b4-a4e8-f7ed10437e35
    06/11/2014 10:17:32.03* w3wp.exe (0x1904) 0x0FAC SharePoint Foundation General ajlz0 High ...SPSite.get_Request() at Microsoft.SharePoint.SPSite.OpenWeb(Guid gWebId, Int32 mondoHint) at Microsoft.SharePoint.Publishing.CachedObjectFactory.OpenWebFromSuperUserSite(Guid webId) at Microsoft.SharePoint.Publishing.CacheManager..ctor(SPSite site) at Microsoft.SharePoint.Publishing.CacheManager.GetManager(SPSite site, Boolean useContextSite, Boolean allowContextSiteOptimization, Boolean refreshIfNoContext) at Microsoft.SharePoint.Publishing.Internal.WebControls.PublishingRibbon.OnLoad(EventArgs e) at System.Web.UI.Control.LoadRecursive() at System.Web.UI.Control.LoadRecursive() at System.Web.UI.Control.LoadRecursive() at System.Web.UI.Control.LoadRecursive() at System.Web.UI.Control.LoadRecursive() at System.Web.UI.Control.LoadRecursive() at... dbc2999c-6f92-a0b4-a4e8-f7ed10437e35
    06/11/2014 10:17:32.03* w3wp.exe (0x1904) 0x0FAC SharePoint Foundation General ajlz0 High ... System.Web.UI.Control.LoadRecursive() at System.Web.UI.Control.LoadRecursive() at System.Web.UI.Control.LoadRecursive() at System.Web.UI.Page.ProcessRequestMain(Boolean includeStagesBeforeAsyncPoint, Boolean includeStagesAfterAsyncPoint) at System.Web.UI.Page.HandleError(Exception e) at System.Web.UI.Page.ProcessRequestMain(Boolean includeStagesBeforeAsyncPoint, Boolean includeStagesAfterAsyncPoint) at System.Web.UI.Page.ProcessRequest(Boolean includeStagesBeforeAsyncPoint, Boolean includeStagesAfterAsyncPoint) at System.Web.UI.Page.ProcessRequest() at System.Web.UI.Page.ProcessRequest(HttpContext context) at System.Web.HttpApplication.CallHandlerExecutionStep.System.Web.HttpApplication.IExecutionStep.Execute() at System.Web.HttpApplication.ExecuteS... dbc2999c-6f92-a0b4-a4e8-f7ed10437e35
    06/11/2014 10:17:32.03* w3wp.exe (0x1904) 0x0FAC SharePoint Foundation General ajlz0 High ...tep(IExecutionStep step, Boolean& completedSynchronously) dbc2999c-6f92-a0b4-a4e8-f7ed10437e35
    06/11/2014 10:17:32.03 w3wp.exe (0x1904) 0x0FAC SharePoint Foundation General aat87 Monitorable dbc2999c-6f92-a0b4-a4e8-f7ed10437e35
    06/11/2014 10:17:32.05 w3wp.exe (0x1904) 0x0FAC SharePoint Foundation Monitoring b4ly Medium Leaving Monitored Scope (Request (GET:http://sp13:80/SitePages/Home.aspx)). Execution Time=97.7205 dbc2999c-6f92-a0b4-a4e8-f7ed10437e35

    This is a very generic error message. 
    What user you are trying to search. Are you using username, display name or email address when searching
    Was any domain related changed done
    What if that users tried to logon to sharepoint site. 
    Does this error occur with all the account when you click edit? If not, based on the error,
    the user account which might be removed from Active Directory or renamed accidentally. Please have a check.
    Try to follow below:
    http://architectevangelist.wordpress.com/2010/12/07/sharepoint-2010-the-specified-user-or-domain-group-was-not-found/

  • File not found when trying to call a dll on LabVIEW Real Time machine

    I have a dll called "DLLRTTEST" that I've written, and have succesfully called on my host machine.  I'm now attempting to call this dll from a vi that is located on my real time computer.  Currently I get an "Error 7 occurred at Call Library Function Node in DLLRTTEST.vi." message upon execution
    In the attached screenshot I'm trying to ensure that the vi I'm running is in fact located on the real time system.  I then use a "Check if File or Folder Exists.vi" to confirm that the dll that I'm about to call does exist on the real time system as well.  However, I still receive an "error 7 file not found" error from the Call Library Function Node.
    Any help is appreciated.
    Solved!
    Go to Solution.
    Attachments:
    DLL_Call_Screenshot.png ‏61 KB
    DLL_Call_Screenshot.png ‏61 KB

    As nathand already mentioned, depending on your C toolchain your DLL will depend on other DLLs. Usually the according msvcrtXX.dll that matches your Visual C version, if you use Visual C, other runtime DLLs if you use a different C environment. These runtime DLLs are even necessary if you do not call anything in any of your functions, since the DLL makes various initialization steps when it gets loaded and that references some C runtime functions nevertheless. Compiling and linking the DLL with static C runtime is usually also not a clean solution since the linked in C runtime will then reference Windows APIs that are not available on LabVIEW RT.
    Depending on your version of LabVIEW RT you will have some mscvrtxx.dll files in your system directory but it will be an older one than from the latest Visual Studio version. If you can compile your DLL with that Visual Studio version then you should be fine, but could possibly run into new problems if you later upgrade to a newer LabVIEW RT version. Installing the C runtime distributables from newer Visual Studio versions is unfortunately also not a solution, since it references many (undocumented) Windows API functions that are not available in LabVIEW RT.
    Rolf Kalbermatter
    CIT Engineering Netherlands
    a division of Test & Measurement Solutions

  • Get message that serial number is valid but product not found when trying to activate CS6.

    Hi,
    I need help with installing CS6 to a new computer. I have owned PS since CS and have upgraded through all of the versions. Do I have to download the old versions too now? I don't remember doing that on my new desktop last year. When I try to activate with the serial number it says the number is valid but the product is not found. I have tried my previous version numbers but they are invalid. There is a drop down to choose what product I am trying to activate but CS6 is not even listed. CS6 Extended is but that is not what I have. Can anyone help me with this?

    you purchased cs6, not as an upgrade. 
    if that's correct, you do not need any previous versions installed and you should not be prompted for any previous version's serial number.
    what exact product did you purchase and what product did you download?

  • WRT54G3G – "Router not found" when trying to configure broadband cable network

    Hi,
    I have a WRT54G3G, v.1.1 router. I have used it successfully for ~3 years with mobile Internet (Huawei E800 card). Recently I installed broadband cable network in my place, tried to configure WRT54G3G to work with it and failed…
    I tried manual configuration, and I was not able to set it up. I downloaded „Setup Wizard”, and tried all three options:
    a) 3G/UMTS or GPRS
    b) Broadband WAN Only
    c) Broadband WAN and 3G/UMTS or GPRS
    Only option a) can be completed successfully. When I try b) or c), I get following message from „Setup Wizard”: „Router not found, Please make sure the router is properly connected and try again.” I am sure I connected all cables as instructed.
    When I plug cable network directly to my PC’s Ethernet slot, it is automatically configured, and all is working fine.
    Can anyone advise please what to do? Thank you!
    Best regards,
    Jakub
    Solved!
    Go to Solution.

    What is the ip address of your router? It seems like the WRT54G3G is already talking to your modem and is getting the connection properly. Make sure that the WRT is not on the 192.168.1.x segment. 

  • "application descriptor not found" when trying to create .ane file

    I have been trying to create a very simple native extention for the better part of a week now and I just can't seem to figure it out.
    Using tutorials and guides from the following sources:
    http://www.adobe.com/devnet/air/articles/extending-air.html
    http://www.adobe.com/content/dam/Adobe/en/devnet/devices/pdfs/DevelopingActionScriptExtens ionsForAdobeAIR.pdf
    http://custardbelly.com/blog/2011/09/21/air-native-extension-example-ibattery-for-ios/
    I managed to get up to the point where I need to create the ane file, but I am getting "application descriptor not found".
    So, here is the detailed explanation of everything I have done to date. Can someone tell me where I have gone wrong?
    1. On the mac, I created an xcode project, using the iBattery example code from the link above, I managed to create static library .a file. I am not going to discount the possiblity that there are many errors still in this file, but I am going to assume for the moment that my current problem is not related to any issues in this static library.
    2. Copied the static library "DaveExtention.a" to my PC where I have flash CS5.5 installed (yes, I know there is a typo in the name)
    3. In my app folder, I created a lib folder that now contains the following files:
    D:\GoldSun\Source Code\Flash\ExtentionTest\lib\DaveExtension.fla
    D:\GoldSun\Source Code\Flash\ExtentionTest\lib\DaveExtension-app.xml
    D:\GoldSun\Source Code\Flash\ExtentionTest\lib\com\extensions\DaveExtension\DaveExtension.as
    D:\GoldSun\Source Code\Flash\ExtentionTest\lib\com\extensions\DaveExtension\BatteryStateEnum.as
    I set my project to compile an swc into the build folder and simply put the following code into my project:
    import com.extensions.DaveExtension.BatteryStateEnum;
    import com.extensions.DaveExtension.DaveExtension;
    var ext:DaveExtension = new DaveExtension;
    var batterystate:BatteryStateEnum;
    stop();
    I then publish the swc.
    4. Once the swc is created in the build folder, I copy the libDaveExtention.a to the build folder and create the extension.xml file, which looks like this:
    <extension xmlns="http://ns.adobe.com/air/extension/2.5">
      <id>com.extensions.DaveExtension</id>
      <versionNumber>1</versionNumber>
      <platforms>
        <platform name="iPhone-ARM">
            <applicationDeployment>
                <nativeLibrary>libDaveExtention.a</nativeLibrary>
                <initializer>ExtInitializer</initializer>
                <finalizer>ExtFinalizer</finalizer>
            </applicationDeployment>
        </platform>
      </platforms>
    </extension>
    5. I make a copy of the swc file and rename it to .zip... I then extract library.swf from it and delete the zip. My build folder now looks like this:
    D:\GoldSun\Source Code\Flash\ExtentionTest\lib\Build\DaveExtension.swc
    D:\GoldSun\Source Code\Flash\ExtentionTest\lib\Build\extension.xml
    D:\GoldSun\Source Code\Flash\ExtentionTest\lib\Build\libDaveExtention.a
    D:\GoldSun\Source Code\Flash\ExtentionTest\lib\Build\library.swf
    6. I downloaded the flex 4.5.1.21328 sdk and the Air 3.0 sdk, which I copied into the flex sdk folder (which is located in "D:\SDKs\flex_sdk_4.5.1.21328")
    7. In my build folder, I create a simple batch file called buildane.bat with the following command:
    D:\SDKs\flex_sdk_4.5.1.21328\bin\adl -package -target ane DaveExtension.ane extension.xml -swc DaveExtension.swc -platform iPhone-ARM library.swf libDaveExtention.a
    8. I then open a command prompt to my build folder and run buildane.bat and this is my output:
    D:\GoldSun\Source Code\Flash\ExtentionTest\lib\Build>buildane.bat
    D:\GoldSun\Source Code\Flash\ExtentionTest\lib\Build>D:\SDKs\flex_sdk_4.5.1.21328\bin\adl -package -target ane DaveExtension.ane extension.xml -swc DaveExtension.swc -platform iPhone-ARM library.swf libDaveExtention.a
    application descriptor not found
    No matter what I try, I can't get passed this.
    Can anyone tell me what I am doing wrong?

    >>D:\GoldSun\Source Code\Flash\ExtentionTest\lib\Build>D:\SDKs\flex_sdk_4.5.1.21328\bin\adl -package -target ane DaveExtension.ane extension.xml -swc DaveExtension.swc -platform iPhone-ARM library.swf libDaveExtention.a
    Either its a typo or by mistake you wrote adl in yout bat file. Change it to adt since that is the file that will package your ane. adl is just used for debugging/running on Desktop.
    Hope this helps. let me know how it goes.
    Thanks,
    Meet

Maybe you are looking for

  • Can't open Pages files from iPad in Word 2010 on PC

    I have not been able to open any files created on my iPad (iOS 6.0.1) with Apple Pages in Microsoft Word 2010 on Windows XP Pro and hope someone can suggest a solution. I am emailing the files as attachments (.docx files)  When I try to open the file

  • Calendar not showing events in spesific views

    Some of the iOS users in my organization reported back to me that calender events that covers more than 1 Day only shows the event on the first day. (except on whole day events) while using the Month or Year view. This bug is verifed on serveral iPad

  • ((  BLOB IMAGE  *NOT*  being saved !  ))

    Hello, I am new to APEX. I am working with the SAMPLE APPLICATION that comes with the free APEX.ORACLE.COM account. I am creating 2 pages similar to the PRODUCTS report and the PRODUCTS form. (Page 3 and PAGE 6) I am creating my own table and my own

  • Create guides in Illustrator CS4 JS

    Hi, I need to create 4 guides in Illustrator page 3/16 inch from each edge of the artboard using javascript. Could someone help me. Thank you very much. Yulia

  • Stored Proc after Allocation

    Is there a way to run a stored procedure (using *RUN_STORED_PROCEDURE) only after a certain allocation has run? // Default base level logic - applies to all base members in all dimensions //Contract Allocation *IGNORE_STATUS *XDIM_MAXMEMBERS ENTITYDI