New MBP 15", Windows installation fails with error 0x80070570 or 0x80070570D

Hey guys!
I finally got a new MBP a few weeks ago, and I wanted to install a Windows partition for some games. I have tried this with several different windows copies (both legal and illegal, and both of windows 7 and windows 8), but to none avail. The exact error message I keep getting is:
Windows 7:
"Windows cannot install required files. The file may be corrupt or mossing. Make sure all files required for installation are available, and restart the application. Error code: 0x80070570"
Windows 8:
"Windows cannot install required files. Make sure all files required for installation are available, and restart the application. Error code: 0x80070570D"
Any help will be greatly appreciated!

I've let the bootcamp utility put the disk images on the USB. As I mentioned before, I got the Windows installation images through various legal and illegal sources and made several attempts with each and evere disk image, so that should not be the cause.

Similar Messages

  • Windows Server 2008 R2 Service Pack 1 installation failed with error code 0x800f0a12

    Hello,
    I'm facing problem to install windows server 2008 R2 SP1. I cannot install SP1. In this server have running Exchange 2010 server. to update Win2008 R2 SP1 facing the following error:
    1. Service Pack installation failed with error code 0x800f0a12.
    2. Installation Failure: Windows failed to install the following update with error 0x80070643: Windows Server 2008 R2 Service Pack 1 for x64-based Systems (KB976932).
    Please suggest

    Please run the system update readiness tool.
    http://windows.microsoft.com/en-us/windows7/What-is-the-System-Update-Readiness-Tool?SignedIn=1
    Then post the complete contents of;
    %SYSTEMROOT%\Logs\CBS\CheckSUR.log
    Regards, Dave Patrick ....
    Microsoft Certified Professional
    Microsoft MVP [Windows]
    Disclaimer: This posting is provided "AS IS" with no warranties or guarantees , and confers no rights.

  • Client installation fails with error: The client version 4.00.6487.2000 does not match the MP version 2.50.4253.3000. The client wil not be installed.

    Hello World,
    I have this remote server that used to be a sms 2003 secondary site server. We uninstalled the SMS role. And used the server as an SCCM remote distribution point. We also want to install an client agent on that server machine. But no mather how i try
    to install the client i always see the same error in ccmsetup.log:
    File download 100% complete (17847296 of 17847296 bytes). ccmsetup 8/18/2010 9:17:18 AM 9916 (0x26BC)
    Download complete. ccmsetup 8/18/2010 9:17:18 AM 9916 (0x26BC)
    Successfully downloaded client files. ccmsetup 8/18/2010 9:17:18 AM 9916 (0x26BC)
    Searching for available transform ccmsetup 8/18/2010 9:17:18 AM 9916 (0x26BC)
    Failed to find resource file 'client.mst' ccmsetup 8/18/2010 9:17:18 AM 9916 (0x26BC)
    No transform available for this locale. Installation will proceed with no transformation. ccmsetup 8/18/2010 9:17:18 AM 9916 (0x26BC)
    Updated security on object C:\WINDOWS\system32\ccmsetup\. ccmsetup 8/18/2010 9:17:18 AM 9916 (0x26BC)
    An MP exists on this machine. ccmsetup 8/18/2010 9:17:18 AM 9916 (0x26BC)
    The client version 4.00.6487.2000 does not match the MP version 2.50.4253.3000.  The client will not be installed. ccmsetup 8/18/2010 9:17:18 AM 9916 (0x26BC)
    A Fallback Status Point has not been specified.  Message with STATEID='318' will not be sent. ccmsetup 8/18/2010 9:17:18 AM 9916 (0x26BC)
    Deleted file C:\WINDOWS\system32\ccmsetup\WindowsServer2003-KB923845-x86-ENU.exe.download ccmsetup 8/18/2010 9:17:18 AM 9916 (0x26BC)
    I think the installer finds some remenance of the old SMS_MP. When looking i found some remains in IIS . I tried to remove the remains but still have the same error when installing the client. I uninstalled IIS completly. Can someone tell me where the client
    installer looks for the MP version? Would it help if i installed an SCCM MP on that server and the uninstalled it (Upgrade the MP)?

    Hello Kent, i ran the ccmclean.exe from the SMS2003 Toolkit. It informed me that my system was cleaned. I ran the sccm client setup manualy and found this in the ccmsetup.log
    MSI PROPERTIES are SMSSITECODE=AUTO CCMHTTPPORT="80" CCMHTTPSPORT="443" INSTALL=ALL ccmsetup 8/18/2010 10:48:21 AM 3140 (0x0C44)
    IsFileMicrosoftTrusted Verified file 'C:\WINDOWS\system32\ccmsetup\{4CD82FBB-0AFC-4864-A089-15364DF5F14B}\client.msi' is MS signed. ccmsetup 8/18/2010 10:48:21 AM 3140 (0x0C44)
    Running installation package
      Package:     C:\WINDOWS\system32\ccmsetup\{4CD82FBB-0AFC-4864-A089-15364DF5F14B}\client.msi
      Log:         C:\WINDOWS\system32\ccmsetup\client.msi.log
      Properties:  SMSSITECODE=AUTO CCMHTTPPORT="80" CCMHTTPSPORT="443" INSTALL=ALL ccmsetup 8/18/2010 10:48:21 AM 3140 (0x0C44)
    MSI: Action 10:48:21: INSTALL.  ccmsetup 8/18/2010 10:48:21 AM 3140 (0x0C44)
    MSI: Action 10:48:21: SystemFolder.  ccmsetup 8/18/2010 10:48:21 AM 3140 (0x0C44)
    MSI: Action 10:48:21: SystemFolder.12C909B6_5F69_4C4D_8EC3_C225C1607933.  ccmsetup 8/18/2010 10:48:21 AM 3140 (0x0C44)
    MSI: Action 10:48:21: SystemFolder.A6940213_CD40_4753_8BA2_E803376DECC3.  ccmsetup 8/18/2010 10:48:21 AM 3140 (0x0C44)
    MSI: Action 10:48:21: SystemFolder.F65FD590_5BEA_48BE_8408_26F7244E8B61.  ccmsetup 8/18/2010 10:48:21 AM 3140 (0x0C44)
    MSI: Action 10:48:21: WindowsFolder.8AE6A59B_5597_4D75_9BFD_7F566BF56500.  ccmsetup 8/18/2010 10:48:21 AM 3140 (0x0C44)
    MSI: Action 10:48:21: SystemFolder.98C5B086_7EB0_422A_B0A8_674010F525CD.  ccmsetup 8/18/2010 10:48:21 AM 3140 (0x0C44)
    MSI: Action 10:48:21: SystemFolder.4C5E03E8_F8E5_47CB_8FF4_E46FE34D35A6.  ccmsetup 8/18/2010 10:48:21 AM 3140 (0x0C44)
    MSI: Action 10:48:21: System64Folder.597B26B2_B5D6_40FF_90DA_B8E672626B1D.  ccmsetup 8/18/2010 10:48:21 AM 3140 (0x0C44)
    MSI: Action 10:48:21: System64Folder.541D9CA5_CE53_4DCE_903A_9B9E5A6EF2C6.  ccmsetup 8/18/2010 10:48:21 AM 3140 (0x0C44)
    MSI: Action 10:48:21: SmsCheckConfig.  ccmsetup 8/18/2010 10:48:21 AM 3140 (0x0C44)
    MSI: Action 10:48:22: SMSValidateClientInstallStamp.  ccmsetup 8/18/2010 10:48:22 AM 3140 (0x0C44)
    MSI: Action 10:48:22: LaunchConditions. Evaluating launch conditions ccmsetup 8/18/2010 10:48:22 AM 3140 (0x0C44)
    MSI: Action 10:48:22: SmsDetectWindowsEmbeddedFBWF.  ccmsetup 8/18/2010 10:48:22 AM 3140 (0x0C44)
    MSI: Action 10:48:22: SmsCheckNewRemoteTools.  ccmsetup 8/18/2010 10:48:22 AM 3140 (0x0C44)
    MSI: Action 10:48:22: AppSearch. Searching for installed applications ccmsetup 8/18/2010 10:48:22 AM 3140 (0x0C44)
    MSI: Action 10:48:22: CCPSearch. Searching for qualifying products ccmsetup 8/18/2010 10:48:22 AM 3140 (0x0C44)
    MSI: Action 10:48:22: RMCCPSearch. Searching for qualifying products ccmsetup 8/18/2010 10:48:22 AM 3140 (0x0C44)
    MSI: Action 10:48:22: ValidateProductID.  ccmsetup 8/18/2010 10:48:22 AM 3140 (0x0C44)
    MSI: Action 10:48:22: CcmSetInstallDir.  ccmsetup 8/18/2010 10:48:22 AM 3140 (0x0C44)
    MSI: Action 10:48:22: BCDSetX64Dir.  ccmsetup 8/18/2010 10:48:22 AM 3140 (0x0C44)
    MSI: Action 10:48:22: CcmSetInstallDirFromCmdLine.  ccmsetup 8/18/2010 10:48:22 AM 3140 (0x0C44)
    MSI: Action 10:48:22: CcmSetPrimaryFolder.  ccmsetup 8/18/2010 10:48:22 AM 3140 (0x0C44)
    MSI: Action 10:48:22: FindRelatedProducts. Searching for related applications ccmsetup 8/18/2010 10:48:22 AM 3140 (0x0C44)
    MSI: Action 10:48:22: SmsDetectInvalidOrderColocUpgrade.  ccmsetup 8/18/2010 10:48:22 AM 3140 (0x0C44)
    MSI: An older version of the SMS Management Point is installed. Please upgrade the Management Point before attempting to upgrade the client. ccmsetup 8/18/2010 10:48:22 AM 3140 (0x0C44)
    Installation failed with error code 1603 ccmsetup 8/18/2010 10:48:23 AM 3140 (0x0C44)
    Next retry in 120 minute(s)... ccmsetup 8/18/2010 10:48:23 AM 3140 (0x0C44)
    Their must be something remaining that ccmclean can't find or can' access so i ran ccmclean /mp. This did some stuff and told me the system was clean again. I reran the client setup.
    Guess what
    It worked !
    Thanxs Kent

  • App installation fails with error 0xE8000004

    hello,
    i have purchased a navigation (GPS) application for iphone and ipad but installation fails with error 0xE8000004, even if the application is the only one (i have removed all other apps). I have tried on iphone and ipad and using different OS: Windows 7 professional 64 and Windows XP 32.
    Has anyone an idea of the problem ?

    Already done and this was the reply:
    Response (Frederick) - 03/01/2011 12.59 PM
    Dear Ettore,
    Thank you for contacting CoPilot Technical Support.
    If you are experiencing download issues between two Apple platforms (here between the iPhone and iTunes), I advise you contact Apple directly from your purchase history in iTunes then 'Report a problem' as ALK is not in charge of the installation on this device.
    Then i contacted Apple and the reply was:
    Ettore, please call up to the iPhone technical support. To find the appropriate phone number, please visit:
    http://www.apple.com/support/contact/phone_contacts.html
    I am a little bit disappointed.

  • Installing InDesign CC 2014 on Windows 7 fails with error EX11 (error extracting to temporary folder).

    @

    Hi Jeff,
    I finally resolved the problem. I was trying to install CC 2014 on a 32 Bit system not being aware that CC 2014 is 64 bit only!
    Thanks for your help
    Jo
    Am 24.07.2014 um 19:13 schrieb Jeff A Wright <[email protected]>:
    Installing InDesign CC 2014 on Windows 7 fails with error EX11 (error extracting to temporary folder).
    created by Jeff A Wright in Creative Cloud Download & Install - View the full discussion
    Jolauterbach the error indicates that your User account is not able to properly write to the temporary directory.  Please make sure you have sufficient disk space and proper rights to modify the temporary directory.
    Please note that the Adobe Forums do not accept email attachments. If you want to embed a screen image in your message please visit the thread in the forum to embed the image at https://forums.adobe.com/message/6580278#6580278
    Replies to this message go to everyone subscribed to this thread, not directly to the person who posted the message. To post a reply, either reply to this email or visit the message page:
    To unsubscribe from this thread, please visit the message page at . In the Actions box on the right, click the Stop Email Notifications link.
    Start a new discussion in Creative Cloud Download & Install by email or at Adobe Community
    For more information about maintaining your forum email notifications please go to http://forums.adobe.com/thread/416458?tstart=0.

  • Installation failed with error code 1603

    Hi all,
    while installing the configuration manager clients on a system manually, we came across this ERROR:
    installation failed with error code 1603
    Do anyone has any idea how can this be resolved. Several posts suggest its a problem related to client push installation method, but since I am installing the configuration manager clients manually, so I mush not be affected by anything related to Client Push Installation. However, be noted that client push installation is well configured on the server, there are certain computers where the client is not getting installed so we are installing the clients MANUALLY to those systems,
    Any help and suggestions would be higly appreciated.
    Regards,
    Naveed

    I have encountered the Error 1603/1602 while installing the HCKInstall\Client\Setup.exe on several machines. It appears to be generic at first, but it's not. The error code is being passed from the Service back to the MSI. It means that a service failed
    to start. The key is that it happens at the very end of the installation and then does the rollback. The solution is to figure out which service failed and then remove it and the directories.
    Here is what I did.
    I created batch to kick off before I install the client now. It basically checks for installed HCK products and if there uninstalls them. Then checks for the state of each service and if running stops the service before attempting to remove the HCK/WLK leftovers.
    Then it removes the sticky directory.
    @ECHO OFF
    :: Defaults...
    :: Default:_HCK_Services_="DTMService,FtsSvc,WLKSvc,WTTNotification,WTTResultsRelayAgent" services.
    SET _HCK_Services_=
    :: Default:_Directories_="C:^\Program Files ^(x86^)^\Microsoft Driver Test Manager"
    SET _Directories_=
    :: Default:_DEBUG_=off, use debug_on to change
    SET _DEBUG_=
    :: Examples: Comma delimited lists param1=Services param2=directory param3=debug_on
    :: ^<command.bat^> "DTMService,FtsSvc","C^:^\Program Files ^(x86^)^\Microsoft Driver Test Manager",c^:^\test, "debug_on"
    ::SetVars:
    SET _HCK_Services_=%1
    IF /I "%2" NEQ "" SET _Directories_=%2
    :: SetDefaults:
    IF /I "%3" GEQ "debug_on" SET _DEBUG_=True
    IF NOT DEFINED _HCK_Services_ (
    SET _HCK_Services_=DTMService,FtsSvc,WLKSvc,WTTNotification,WTTResultsRelayAgent
    IF NOT DEFINED _Directories_ SET _Directories_=C:\Program Files (x86)\Microsoft Driver Test Manager
    :: Clear Parans on directories
    set _Directories_=%_Directories_:(x86)=replace_x86%
    :: CallMainFunctions:
    CALL:UninstallHCK
    CALL:CheckVersion
    CALL:Main "%_HCK_Services_%"
    :Main
    FOR %%A IN (%~1) DO (
    REM Checking for Active Services ant attempting
    IF DEFINED _DEBUG_ (
    ECHO Checking %%A...
    FOR /F "tokens=3 delims=: " %%H IN ('sc query "%%A" ^| findstr "STATE"') DO (
    IF DEFINED _DEBUG_ (
    ECHO Service:"%%A" Status:"%%H"
    IF /I "%%H" NEQ "" (
    IF DEFINED _DEBUG_ (
    ECHO Service "%%A" is installed but not %%H.
    ) ELSE IF /I "%%H" GEQ "RUNNING" (
    IF DEFINED _DEBUG_ (
    ECHO. %%A %%H
    ECHO Attempting to Stop %%A
    SC STOP "%%A" >NUL
    ) ELSE IF /I "%%H" GEQ "START_PENDING" (
    IF DEFINED _DEBUG_ (
    ECHO. %%A %%H
    REM Need to wait for it to fail before we can stop the service.
    IF DEFINED _DEBUG_ (
    ECHO Attempting to Stop %%A in 60 seconds...
    PING.EXE 1.1.1.1 -n 1 -w 60000 >NUL
    SC STOP "%%A" >NUL
    ) ELSE (
    CALL:print Service, "%%A", Error, "Unexpected Results"
    FOR /F "tokens=3 delims=: " %%H IN ('sc query "%%A" ^| findstr "STATE"') DO (
    IF /I "%%H" NEQ "STOPPED" (
    CALL:print Service, %%A, Failure_To_STOP, %%H
    ) ELSE (
    CALL:print Service, %%A, State, %%H
    CALL:delete_Service %%A
    FOR /F "tokens=* delims=: " %%H IN ('sc query "%%A" ^| findstr "FAILED"') DO (
    IF DEFINED _DEBUG_ (
    ECHO Service:"%%A" is not installed.
    ECHO. State:%%H
    CALL:print Service, %%A, FinalState, "Not Installed"
    CALL:RemoveDirectories "%_Directories_%"
    GOTO:EOF
    :UninstallHCK
    CALL:CheckInstallation "{3BEE5E5E-8BEE-F691-4349-7B2B41FF3A59}", UninstallString
    IF DEFINED _REGKEYFOUND_ MsiExec.exe /X{3BEE5E5E-8BEE-F691-4349-7B2B41FF3A59} /qb+
    CALL:CheckInstallation "{6F8333B4-7DB1-E6D3-52ED-5641F8F38B76}", UninstallString
    IF DEFINED _REGKEYFOUND_ MsiExec.exe /X{6F8333B4-7DB1-E6D3-52ED-5641F8F38B76} /qb+
    CALL:CheckInstallation "{A329307E-3CCD-57BF-47EF-1B857D1AF08E}", UninstallString
    IF DEFINED _REGKEYFOUND_ MsiExec.exe /X{A329307E-3CCD-57BF-47EF-1B857D1AF08E} /qb+
    CALL:CheckInstallation "{F1213F53-D794-2021-E14E-F4BEED1BBF3B}", UninstallString
    IF DEFINED _REGKEYFOUND_ MsiExec.exe /X{F1213F53-D794-2021-E14E-F4BEED1BBF3B} /qb+
    GOTO:EOF
    :RemoveDirectories
    SET _RemoveDirectories_1_=%~1
    SET _RemoveDirectories_1_=%_RemoveDirectories_1_:"=%
    SET _RemoveDirectories_1_=%_RemoveDirectories_1_:'=%
    FOR /f "tokens=1-8 delims=," %%A IN ("%_RemoveDirectories_1_%") DO (
    IF "%%A" GEQ ":" (
    CALL:RMDIR "%%A"
    IF "%%B" GEQ ":" (
    CALL:RMDIR "%%B"
    IF "%%C" GEQ ":" (
    CALL:RMDIR "%%C"
    IF "%%D" GEQ ":" (
    CALL:RMDIR "%%D"
    IF "%%E" GEQ ":" (
    CALL:RMDIR "%%F"
    IF "%%G" GEQ ":" (
    CALL:RMDIR "%%H"
    IF "%%I" GEQ ":" (
    CALL:RMDIR "%%I"
    IF "%%J" GEQ ":" (
    CALL:RMDIR "%%J"
    exit /b 0
    FOR %%A IN ('%_RemoveDirectories_1_%') DO (
    ECHO.Dir=%%A
    REM CALL:RMDIR '%%A'
    GOTO:EOF
    :RMDIR
    :: GET Parans back
    SET _THEDIR_=%~1
    SET _DirStatus_=
    set _THEDIR_=%_THEDIR_:replace_x86=(x86)%
    set _THEDIR_=%_THEDIR_:"=%
    set _THEDIR_=%_THEDIR_:'=%
    IF NOT EXIST "%_THEDIR_%" goto endof
    RMDIR "%_THEDIR_%" /S /Q
    IF NOT EXIST "%_THEDIR_%" (
    SET _DirStatus_=Removed
    ) ELSE (
    SET _DirStatus_=Failed To Remove Directory
    CALL:print RemoveDirectory, "%_THEDIR_%", Results, "%_DirStatus_%"
    :endof
    GOTO:EOF
    :print
    SET var_3=%~3
    IF DEFINED var_3 (
    ECHO ^{^[^'%~1^'^]='%~2', ^[^'%~3^'^]='%~4'^}
    ) ELSE (
    ECHO ^{^[^'%~1^'^]='%~2'^}
    GOTO:EOF
    :delete_Service
    sc.exe delete "%~1" >Nul
    IF %ERRORLEVEL% NEQ 0 (
    CALL:print Service, %~1, FinalState, "Failed To Uninstall"
    ) ELSE (
    CALL:print Service, %~1, Current_State, Uninstalled
    GOTO:EOF
    :TestStr
    SET _ORIGINAL_=%~2
    SET STR2=%~2
    SET STR3=%~3
    SET STR4=%~4
    REM ECHO.Str2="!STR2!"
    SET STR2=!STR2:%~1=!
    REM echo.STR2="!STR2!"
    IF /I NOT "!STR2!" EQU "!_ORIGINAL_!" (
    SET %STR3%=%STR4%
    GOTO:EOF
    :CheckVersion
    REM Check Windows Version and sets variable for _Version_ and _OSType_
    REM Enhancement will be to install dependencies required for HCK
    SET _VERSION_=
    SET _OSType_=
    SETLOCAL ENABLEEXTENSIONS ENABLEDELAYEDEXPANSION
    FOR /F "usebackq delims=" %%i IN (`VER`) DO (
    SET _VERSION_=%%i
    SET _VERSION_=!_VERSION_:[=!
    SET _VERSION_=!_VERSION_:]=!
    REM CALL:TestStr "6.1", "!_VERSION_!", _OSType_, Windows_7_2008R2
    CALL:TestStr "5.0", "!_VERSION_!", _OSType_, Windows_2000
    CALL:TestStr "5.1", "!_VERSION_!", _OSType_, Windows_XP
    CALL:TestStr "5.2", "!_VERSION_!", _OSType_, Windows_2003
    CALL:TestStr "6.0", "!_VERSION_!", _OSType_, Windows_Vista_2008R1
    CALL:TestStr "6.1", "!_VERSION_!", _OSType_, Windows_7_2008R2
    CALL:TestStr "6.2", "!_VERSION_!", _OSType_, Windows_2012
    CALL:print OSType, !_OSType_!
    CALL:print !_Version_!
    ENDLOCAL && SET _OSType_=%_OSType_% && SET _VERSION_=%_VERSION_%
    GOTO:EOF
    :CheckInstallation
    SET _REGKEYFOUND_=
    SET KEY_NAME="HKEY_LOCAL_MACHINE\SOFTWARE\Microsoft\Windows\CurrentVersion\Uninstall\%~1"
    SET VALUE_NAME=%~2
    FOR /F "usebackq skip=4 tokens=1-3" %%A IN (`REG QUERY %KEY_NAME% /v %VALUE_NAME% 2^>nul`) DO (
    SET ValueName=%%A
    SET ValueType=%%B
    SET ValueValue=%%C
    IF DEFINED ValueName (
    SET _REGKEYFOUND_=True
    CALL:print "REGKEY", "%~2", Name, "%ValueName%"
    CALL:print "REGKEY", "%~2", Value_Type, "%ValueType%"
    CALL:print "REGKEY", "%~2", Value_Value, "%ValueValue%"
    ) else (
    CALL:print "REGKEY", "%~2", "%KEY_NAME%\%VALUE_NAME%", "not found."
    GOTO:EOF
    :Done

  • Windows 8 Windows Update fails with error 80244FFF

    Windows 8 Windows Update fails with error 80244FFF

    Hi @SURAJITsaha ,
    Thank you for visiting the HP Support Forums and Welcome. I have looked into your issue about your HP Pavilion 14-b049tu Sleekbook and issues with a Windows update.
    Here is a link to the HP Support Assistant if you need it. Just download and run the application and it will help with the software and drivers on your system at the time of purchase.
    Please note remove any and all USB devices. Disconnect all non-essential devices, as these could cause some issues.
    Plug the power adapter directly into a functioning wall outlet. Do not plug it into a power strip, surge protector, or secondary power source as this could cause and issue.
    You might have to temporarily disable your virus protection.
    Hope this helps.
    Thanks.
    Please click “Accept as Solution ” if you feel my post solved your issue, it will help others find the solution.
    Click the “Kudos, Thumbs Up" on the bottom to say “Thanks” for helping!

  • VS 2013 Build tools installation fails with error "Signature or catalog could not be verified"

    VS 2013 ultimate - Build tools installation fails with error "Signature or catalog could not be verified" for MSBuild assemblies. Any idea what could be the problem?
    Thanks
    NM

    Hello,
    Do you mean you are trying to use this tool:
    https://www.microsoft.com/en-us/download/details.aspx?id=40760
    Can you navigate to your %temp% folder and filter by date to see the log of the Build tool?
    I want to know which assemblies failed to be verified.
    By the way, since MSBuild is embed in Visual Studio why you want to install this again? Do you have any error about this Build Tool when you install Visual Studio 2013 Ultimate?
    “Signature or catalog could not be verified” is always related to corrupt source
    , please double check you have a healthy network and then try the web installer again.
    Best regards,
    Barry
    We are trying to better understand customer views on social support experience, so your participation in this interview project would be greatly appreciated if you have time. Thanks for helping make community forums a great place.
    Click
    HERE to participate the survey.

  • JDK7 INSTALLATION FAILS WITH ERROR CANNOT FIND REQUIRED JAVA RUNTIME ENVIRONMENT

    Hi
    I am trying to install jdk7 on windows7 through command line with command java_ee_sdk-6u4-jdk7-windows-x64 -j "C:\Program Files\Java\jre7\bin". But it fails with error cannot find required java runtime environment in C:\Program Files\Java\jre7\bin. I have set the java_home and path environment variables to above path. Also I tried instaling through installer but it gave same error with null in path. Can anyone help?

    Hi
    I am trying to install jdk7 on windows7 through command line with command java_ee_sdk-6u4-jdk7-windows-x64 -j "C:\Program Files\Java\jre7\bin". But it fails with error cannot find required java runtime environment in C:\Program Files\Java\jre7\bin. I have set the java_home and path environment variables to above path. Also I tried instaling through installer but it gave same error with null in path. Can anyone help?

  • RoboHelp 10.0.1 Update installation fails with error code: U44M2P7

    After installing RoboHelp 10, I ran the 10.0.1 Update's installer.  It failed with the following error log:
    Adobe RoboHelp 10.0.1 Update
    Installation failed. Error Code: U44M2P2
    I tried re-installing RoboHelp 10, followed by a reboot of the machine.  Several attempts to run the 10.0.1 updater gave me exactly the same error.  No applications were running when the installation was attempted.
    Any help is greatly appreciated!
    Layne

    Only Adobe can tell the meaning of the error codes.
    Are you downloading the update or running it from Adobe's site.
    Try downloading from here. http://www.adobe.com/support/robohelp/downloads.html
    Otherwise this is an installation problem that is supported free. Contact Adobe.
    See www.grainge.org for RoboHelp and Authoring tips
    @petergrainge

  • Elements 12 installation fails with error DF 037

    During installation of Elements 12under Windows 7, while installing Shared Technologies installation stops with error DF 037, and then reverses the entire process. I found the corresponding errors in the installation log: Unable to delete a number of directories under:
         c:\Program Data\Adobe\Camera Raw\Lens profiles\1.0\Tokina\
    I deleted these directories manually, but the problem persists and the deleted directories are back.
    Any suggestions are greatly appreciated.

    See if this troubleshooting link helps. There is a section on shared technologies and rolling back:
    http://helpx.adobe.com/photoshop-elements/kb/troubleshoot-installation-photoshop-elements- premiere.html

  • Client installation fails with error GetSSLCertificateContext failed with error 0x87d00281

    Hi
    Site is SCCM 2012 R2
    I am pushing SCCM client manually to a Windows Server 2012 client and it is failing with below errors
    GetSSLCertificateContext failed with error 0x87d00281
    ccmsetup 02/05/2015 12:04:11 AM
    6428 (0x191C)
    GetHttpRequestObjects failed for verb: 'GET', url: 'HTTPS://SCCMserver.GROUP.COM/CCM_Client/ccmsetup.cab'
    ccmsetup 02/05/2015 12:04:11 AM
    6428 (0x191C)
    DownloadFileByWinHTTP failed with error 0x87d00281
    ccmsetup 02/05/2015 12:04:11 AM
    6428 (0x191C)
    CcmSetup failed with error code 0x87d00281 ccmsetup
    02/05/2015 12:04:11 AM 6476 (0x194C)
    Please advice..

    0x87d00281 = "No certificate matching criteria specified"
    Have you deployed proper client auth certs to the client?
    Can you please post the entire relevant snippet of the log file? Starting with the first error code encountered is meaningless because now we can't see what happened before which is often the root cause of the issue culminating in the error message.
    Have you deployed the proper server auth certs to the MP and DP?
    Jason | http://blog.configmgrftw.com | @jasonsandys

  • SCCM software installation failed with error for 1603

    Dear all
    I was trying to deploy Open Office 4.1.0 using SCCM.
    As per many threads the issue might be with the MSI. but I could not figure  out.
    Please help me.
    install fails with error code 1603
    -sumeet

    is this application failure or client installation failure ? with just one error code,difficult to find the exact issue. 1603 is generic error that refers to Fatal error during installation. Are you sure that the command line what you have used is correct
    and is working manually ?
    Check the logs for additional information that might help to trace the problem.
    Eswar Koneti | Configmgr blog:
    www.eskonr.com | Linkedin: Eswar Koneti
    | Twitter: Eskonr

  • Installation Failed with ERROR: Media DB Error : 12 Please help

    Hello,
    Adobe received my payment, I've downloaded Creative Cloud, click on Try button next to product, always on 43% installation failed with- 0 fatal error(s), 1 error(s)
    ERROR: Media DB Error : 12
    What does it mean? I used Cleaner Tool, it says some of the files could not me removed.
    Please help me, I am desperate
    Michaela

    Hello,
    Adobe received my payment, I've downloaded Creative Cloud, click on Try button next to product, always on 43% installation failed with- 0 fatal error(s), 1 error(s)
    ERROR: Media DB Error : 12
    What does it mean? I used Cleaner Tool, it says some of the files could not me removed.
    Please help me, I am desperate
    Michaela

  • Upgrade to Windows 10 failed with error 80070714. Please Help!!!

    Hi. I hope someone out there can help me!! I have tried numerous times to upgrade my HP Envy 15-K204NA from Windows 8.1 64-bit to Windows 10 Home, but it continues to fail with error code 80070714. I am using Bullguard Premium Protection and have Acronis True Image installed. I have disabled SQL services as suggested by other posts on the internet, but nothing seems to work. When I run the upgrade from a DVD burned from the ISO, it gets to 37% and then fails. Hope you can help. (fingers crossed!!) Chris The Setup Error log file shows: 2015-08-05 16:48:34, Error                        CallPidGenX: PidGenX function failed on this product key. (hr = 0x8a010001)
    2015-08-05 16:48:37, Error                        CallPidGenX: PidGenX function failed on this product key. (hr = 0x8a010001)
    2015-08-05 16:48:49, Error                 CONX   Failed to initialize net class data 800700052015-08-05 16:48:50, Error                 CONX   Failed to get class data from printer 800700572015-08-05 16:49:21, Error                 CONX   Failed to open INF file [tib_mounter.x64.inf] with 0x800700022015-08-05 16:49:21, Error                 CONX   Failed to initialize driver package [tib_mounter.x64.inf]2015-08-05 16:49:21, Error                 CONX   Failed to open INF file [oem46.inf] with 0x800700022015-08-05 16:49:21, Error                 CONX   Failed to initialize driver package [oem46.inf]2015-08-05 16:49:23, Error                 CONX   Failed to open INF file [tib_mounter.x64.inf] with 0x800700022015-08-05 16:49:23, Error                 CONX   Failed to initialize driver package [tib_mounter.x64.inf]2015-08-05 16:49:23, Error                 CONX   Failed to open INF file [oem46.inf] with 0x800700022015-08-05 16:49:23, Error                 CONX   Failed to initialize driver package [oem46.inf]2015-08-05 17:06:14, Error                 SP     RegLoadKeyW failed to mount C:\$WINDOWS.~BT\Sources\SafeOS\SafeOS.Mount\WINDOWS\system32\config\SYSTEM at SP_HIVE_LOAD_ALIAS_SYSTEM[gle=0x801f0005]
    2015-08-05 17:06:14, Error                 SP     SPMountOfflineHive: Can't mount offline hive: C:\$WINDOWS.~BT\Sources\SafeOS\SafeOS.Mount\WINDOWS\system32\config\SYSTEM. Error: 0x801F0005[gle=0x801f0005]
    2015-08-05 17:06:14, Error                 SP     CEnableTelemetryForImage:oExecute: Cannot load the system hive for the offline OS C:\$WINDOWS.~BT\Sources\SafeOS\SafeOS.Mount\WINDOWS. Error: 0x801F0005[gle=0x801f0005]
    2015-08-05 17:06:14, Error                        [SetupHost.exe] ReAgentXMLParser:arseConfigFile (xml file: C:\$WINDOWS.~BT\Sources\SafeOS\ReAgent.xml) returning 0X2
    2015-08-05 17:06:19, Error                 SP     Using current time as Recovery Timestamp.
    2015-08-05 17:06:22, Error                 SP     Failed to open WinPE DISM session. Error: 0x80070714[gle=0x0000007a]
    2015-08-05 17:06:22, Error                 SP     Operation failed: Process Drivers for Migration. Error: 0x80070714[gle=0x000000b7]
    2015-08-05 17:06:22, Error                 MOUPG  MoSetupPlatform: ExecuteCurrentOperations reported failure!
    2015-08-05 17:06:22, Error                 MOUPG  MoSetupPlatform: Using action error code: [0x80070714]
    2015-08-05 17:06:22, Error                 MOUPG  CDlpActionDriverMigrate::ExecuteRoutine(544): Result = 0x80070714
    2015-08-05 17:06:24, Error                 MOUPG  CDlpActionImpl<class CDlpErrorImpl<class CDlpObjectInternalImpl<class CUnknownImpl<class IMoSetupDlpAction> > > >::Execute(441): Result = 0x80070714
    2015-08-05 17:06:24, Error                 MOUPG  CDlpTask::ExecuteAction(3243): Result = 0x80070714
    2015-08-05 17:06:24, Error                 MOUPG  CDlpTask::ExecuteActions(3397): Result = 0x80070714
    2015-08-05 17:06:24, Error                 MOUPG  CDlpTask::Execute(1631): Result = 0x80070714
    2015-08-05 17:06:24, Error                 MOUPG  CSetupManager::ExecuteTask(1953): Result = 0x80070714
    2015-08-05 17:06:24, Error                 MOUPG  CSetupManager::ExecuteTask(1916): Result = 0x80070714
    2015-08-05 17:06:24, Error                 MOUPG  CSetupManager::ExecuteInstallMode(736): Result = 0x80070714
    2015-08-05 17:06:24, Error                 MOUPG  CSetupManager::ExecuteDownlevelMode(376): Result = 0x80070714
    2015-08-05 17:07:09, Error                 MOUPG  CSetupManager::Execute(222): Result = 0x80070714
    2015-08-05 17:07:09, Error                 MOUPG  CSetupHost::Execute(370): Result = 0x80070714
    2015-08-05 17:07:12, Error                 MOUPG  CDlpManager::AsyncSerializeDisable(471): Result = 0x80070216

    Hi Mumbodog  and thanks for your reply. I have uninstalled Bullguard and tried the upgrade again, but it failed at the same point. I have also removed Acronis True Image and again it failed!! The log file has fewer lines now, so it has helped, but still no upgrade: 2015-08-06 09:16:30, Error                        CallPidGenX: PidGenX function failed on this product key. (hr = 0x8a010001)
    2015-08-06 09:16:33, Error                        CallPidGenX: PidGenX function failed on this product key. (hr = 0x8a010001)
    2015-08-06 09:17:14, Error                 CONX   Failed to initialize net class data 80070005
    2015-08-06 09:17:15, Error                 CONX   Failed to get class data from printer 80070057
    2015-08-06 09:23:52, Error                 SP     RegLoadKeyW failed to mount C:\$WINDOWS.~BT\Sources\SafeOS\SafeOS.Mount\WINDOWS\system32\config\SYSTEM at SP_HIVE_LOAD_ALIAS_SYSTEM[gle=0x801f0005]
    2015-08-06 09:23:52, Error                 SP     SPMountOfflineHive: Can't mount offline hive: C:\$WINDOWS.~BT\Sources\SafeOS\SafeOS.Mount\WINDOWS\system32\config\SYSTEM. Error: 0x801F0005[gle=0x801f0005]
    2015-08-06 09:23:52, Error                 SP     CEnableTelemetryForImage:oExecute: Cannot load the system hive for the offline OS C:\$WINDOWS.~BT\Sources\SafeOS\SafeOS.Mount\WINDOWS. Error: 0x801F0005[gle=0x801f0005]
    2015-08-06 09:23:52, Error                        [SetupHost.exe] ReAgentXMLParser:arseConfigFile (xml file: C:\$WINDOWS.~BT\Sources\SafeOS\ReAgent.xml) returning 0X2
    2015-08-06 09:23:56, Error                 SP     Using current time as Recovery Timestamp.
    2015-08-06 09:23:59, Error                 SP     Failed to open WinPE DISM session. Error: 0x80070714[gle=0x0000007a]
    2015-08-06 09:23:59, Error                 SP     Operation failed: Process Drivers for Migration. Error: 0x80070714[gle=0x000000b7]
    2015-08-06 09:23:59, Error                 MOUPG  MoSetupPlatform: ExecuteCurrentOperations reported failure!
    2015-08-06 09:23:59, Error                 MOUPG  MoSetupPlatform: Using action error code: [0x80070714]
    2015-08-06 09:23:59, Error                 MOUPG  CDlpActionDriverMigrate::ExecuteRoutine(544): Result = 0x80070714
    2015-08-06 09:24:01, Error                 MOUPG  CDlpActionImpl<class CDlpErrorImpl<class CDlpObjectInternalImpl<class CUnknownImpl<class IMoSetupDlpAction> > > >::Execute(441): Result = 0x80070714
    2015-08-06 09:24:01, Error                 MOUPG  CDlpTask::ExecuteAction(3243): Result = 0x80070714
    2015-08-06 09:24:01, Error                 MOUPG  CDlpTask::ExecuteActions(3397): Result = 0x80070714
    2015-08-06 09:24:01, Error                 MOUPG  CDlpTask::Execute(1631): Result = 0x80070714
    2015-08-06 09:24:01, Error                 MOUPG  CSetupManager::ExecuteTask(1953): Result = 0x80070714
    2015-08-06 09:24:01, Error                 MOUPG  CSetupManager::ExecuteTask(1916): Result = 0x80070714
    2015-08-06 09:24:01, Error                 MOUPG  CSetupManager::ExecuteInstallMode(736): Result = 0x80070714
    2015-08-06 09:24:01, Error                 MOUPG  CSetupManager::ExecuteDownlevelMode(376): Result = 0x80070714
    2015-08-06 09:24:39, Error                 MOUPG  CSetupManager::Execute(222): Result = 0x80070714
    2015-08-06 09:24:39, Error                 MOUPG  CSetupHost::Execute(370): Result = 0x80070714
    2015-08-06 09:27:41, Error                 MOUPG  CDlpManager::AsyncSerializeDisable(471): Result = 0x80070216

Maybe you are looking for

  • When opening Firefox many windows open.

    When I open firefox, many windows open--up to 70. I stopped this behavior once by having Firefox not open my last session and opening a default window session a few times. I then set Firefox to open the last session again. After a few starts the prob

  • Problems with receiving

    hello again! : ( I have problems with receiving mails, my installation is local, therefore I am using telnet but it marks errors to me you have some idea? bash-2.03# telnet pegaso.qoslabs.com 25 Trying 192.168.20.20... Connected to hostname.com. Esca

  • Streaming server 3.5.1 no script works except main.far (VOD)

    we own multiple FMS servers, interactive and now we installed a few Streaming servers. during the install process we provide the license key for the Stream server's we got from the adobe representatives in our country, and all seems well until we try

  • Error FRM-92050 when using Java Plug-in in Forms SSO

    Hi All, I have the following error with trying to use Java 1.6.0_22 instead of JInitiator: FRM92050 failed to connect to the server /forms/lservlet:-1 Java Exception: Java.io.IOException: User does not have proper credentials configured in OID In the

  • Tiles and UIX

    Hi All, Have a possibility to use Tiles with UIX pages? If not, what the better alternative to Tiles facilities with UIX? Thanks