Open Dataset in Append -- Error: No such file or directory

Good day Everyone
I am opening 3 files in append:
1 )/usr/sap/SAPBP/interface/XIU/batch/CUSTUPDT72_061011123801680.E3.SUCCESS
2) /usr/sap/SAPBP/interface/XIU/batch/CUSTUPDT72_061011123801680.SUCCESS
3) /usr/sap/SAPBP/interface/XIU/batch/CUSTUPDT72_061011123801680.E3.SUCCESS
OPEN DATASET IV_FILENAME FOR APPENDING IN TEXT MODE ENCODING DEFAULT MESSAGE LV_MSG.
When i do this, 1 one the files is created and the other 2 return message: No such file or directory.
Since 1 of the files is being created, the directory cannot be invalid.
Can anyone please provide me with sugestions on how i can get the other 2 open as well.
Sincerely,
Marc

Hi Marc!
Did you create your iv_filename as char70? Because then name 2) would fit and names 1,3) would be too long...
As long as your coding is identical, here nothing further should go wrong.
Also your names look quite OK, you wouldn't have a typo in the other names?
Still an authority problem on OS-level can happen, but that's quite unlikely for files of same type.
Regards,
Christian

Similar Messages

  • Fatal error: No such file or directory: Unable to open VLDC instance

    Hi,
    Been researching this one for a few days and seems no one has an answer that works. I've been through over 200 pages and couldn't find the answer.
    Environment:
    Server: Blade 6000 -- T6300 blade module
    OS: Solaris 10 05/08
    T6300 ALOM version:
    System Firmware 6.3.6 Sun Blade[TM] T6300 2007/03/23 12:45
    Host flash versions:
    Hypervisor 1.3.3 2007/03/23 12:28
    OBP 4.25.3 2007/03/02 20:24
    Sun Blade T6300 Server Module POST 4.25.3 2007/03/02 20:53
    LDOMs Manager: 1.0.3
    The following entry shows up in my log file:
    [ Sep  5 16:29:26 Method "start" exited with status 1 ]
    [ Sep  5 16:29:26 Executing start method ("/opt/SUNWldm/bin/ldmd_start") ]
    Added to channel ds, service dr-cpu, versions 1.0
    Added to channel ds, service fma-cpu-service, versions 1.0
    Added to channel fmactl, service fma-phys-cpu-service, versions 1.0
    Added to channel ds, service fma-mem-service, versions 1.0
    Added to channel fmactl, service fma-phys-mem-service, versions 1.0
    Added to channel fmactl, service fma-pri-service, versions 1.0
    Added to channel spds, service mdstore, versions 1.0
    Added to channel ds, service md-update, versions 1.0
    Added to channel ds, service domain-shutdown, versions 1.0
    Added to channel ds, service domain-panic, versions 1.0
    Added to channel spds, service pri, versions 1.0
    Added to channel ds, service var-config, versions 1.0
    fatal error: No such file or directory: Unable to open VLDC instance /devices/virtual-devices@100/channel-devices@200/virtual-channel@0:hvctl fo
    contacting hypervisor
    [ Sep  5 16:29:27 Method "start" exited with status 1 ]
    Any help would be greatly appreciated!!!

    Hi Every one,
    I after installing Ldom , when I try to start ldom
    I am getting same error ..any fix or any suggestion ?
    ./ldmd_start
    Added to channel ds, service dr-cpu, versions 1.1 1.0
    Added to channel ds, service dr-crypto-mau, versions 1.0
    Added to channel ds, service dr-crypto-cwq, versions 1.0
    Added to channel ds, service dr-vio, versions 1.0
    Added to channel ds, service fma-cpu-service, versions 1.0
    Added to channel fmactl, service fma-phys-cpu-service, versions 1.0
    Added to channel ds, service fma-mem-service, versions 1.0
    Added to channel fmactl, service fma-phys-mem-service, versions 1.0
    Added to channel fmactl, service fma-pri-service, versions 1.0
    Added to channel ds, service keystore, versions 1.0
    Added to channel spds, service mdstore, versions 1.0
    Added to channel ds, service md-update, versions 1.0
    Added to channel ds, service domain-shutdown, versions 1.0
    Added to channel ds, service domain-panic, versions 1.0
    Added to channel spds, service pri, versions 1.0
    Added to channel ds, service var-config, versions 1.0
    fatal error: No such file or directory: Unable to open VLDC instance /devices/vi rtual-devices@100/channel-devices@200/virtual-channel@0:hvctl for contacting hyp ervisor

  • Can't open perl script "/opatch.pl": No such file or directory

    After installed Oracle 9.2.04 and applied patch p3006854, p3948480 and p4188455 on Linux AS4, I found that I can not start agent. If I execute "agentctl start", oracle will through our error like:
    Starting Oracle Intelligent Agent.../u01/app/oracle/product/9.2.0/bin/dbsnmpwd: line 156: 1855 Segmentation fault nohup $ORACLE_HOME/bin/dbsnmp $*
    $DBSNMP_WDLOGFILE 2>&1/u01/app/oracle/product/9.2.0/bin/dbsnmpwd: line 156: 1868 Segmentation fault nohup $ORACLE_HOME/bin/dbsnmp $* >>$DBSNMP_WDLOGFILE 2>&1
    /u01/app/oracle/product/9.2.0/bin/dbsnmpwd: line 156: 1880 Segmentation fault nohup $ORACLE_HOME/bin/dbsnmp $* >>$DBSNMP_WDLOGFILE 2>&1
    /u01/app/oracle/product/9.2.0/bin/dbsnmpwd: line 156: 1892 Segmentation fault nohup $ORACLE_HOME/bin/dbsnmp $* >>$DBSNMP_WDLOGFILE 2>&1
    I searched Internet and some article said p3238244 is needed. So I started to install it. At the very beginning, the error is "Can not find ../oui/OraInstall.jar". I found this file in "../oui/jlib" and copy it to "../oui". Then I run "opatch apply" and the error is "Can't open perl script "/opatch.pl": No such file or directory". This time I can not find much similiar information from google.
    Any idea?
    PS: I changed path of inventory during the installation to "/henry/cwdata" ($ORACLE_HOME=/henry/app/oracle/product/9.2). Will this action cause the error below? What is the usage of inventory path exactly?
    Much appreciated!
    Henry

    Below is my env and .bash_profile.
    [oracle@henrylinux lib]$ env
    SSH_AGENT_PID=2814
    HOSTNAME=henrylinux
    SHELL=/bin/bash
    TERM=xterm
    HISTSIZE=1000
    NLS_LANG=AMERICAN_AMERICA.ZHS16GBK
    GTK_RC_FILES=/etc/gtk/gtkrc:/home/oracle/.gtkrc-1.2-gnome2
    WINDOWID=39880874
    OLDPWD=/home/oracle
    ORACLE_OWNER=oracle
    USER=oracle
    LS_COLORS=no=00:fi=00:di=00;34:ln=00;36:pi=40;33:so=00;35:bd=40;33;01:cd=40;33;0 1:or=01;05;37;41:mi=01;05;37;41:ex=00;32:*.cmd=00;32:*.exe=00;32:*.com=00;32:*.b tm=00;32:*.bat=00;32:*.sh=00;32:*.csh=00;32:*.tar=00;31:*.tgz=00;31:*.arj=00;31: *.taz=00;31:*.lzh=00;31:*.zip=00;31:*.z=00;31:*.Z=00;31:*.gz=00;31:*.bz2=00;31:* .bz=00;31:*.tz=00;31:*.rpm=00;31:*.cpio=00;31:*.jpg=00;35:*.gif=00;35:*.bmp=00;3 5:*.xbm=00;35:*.xpm=00;35:*.png=00;35:*.tif=00;35:
    ORACLE_SID=ora92
    GNOME_KEYRING_SOCKET=/tmp/keyring-BckaCh/socket
    ORACLE_BASE=/henry/app/oracle
    SSH_AUTH_SOCK=/tmp/ssh-nsWlKX2762/agent.2762
    KDEDIR=/usr
    SESSION_MANAGER=local/henrylinux:/tmp/.ICE-unix/2762
    GDN_LANG=en_US
    MAIL=/var/spool/mail/oracle
    DESKTOP_SESSION=default
    PATH=/usr/kerberos/bin:/usr/local/bin:/usr/bin:/bin:/usr/X11R6/bin:/home/oracle/ bin:/henry/app/oracle/product/9.2/bin:/henry/app/oracle/product/9.2/Apache/Apach e/bin:
    INPUTRC=/etc/inputrc
    PWD=/henry/app/oracle/product/9.2/ctx/lib
    THREADS_FLAG=native
    LANG=en_US.UTF-8
    LC=en_US
    ORACLE_TERM=xterm
    GDMSESSION=default
    SSH_ASKPASS=/usr/libexec/openssh/gnome-ssh-askpass
    HOME=/home/oracle
    SHLVL=2
    LD_ASSUME_KERNEL=2.4.19
    GNOME_DESKTOP_SESSION_ID=Default
    LOGNAME=oracle
    LC_CTYPE=zh_CN.GB2312
    CLASSPATH=/henry/app/oracle/product/9.2/JRE:/henry/app/oracle/product/9.2/jlib:/ henry/app/oracle/product/9.2/rdbms/jlib:/henry/app/oracle/product/9.2/network/jl ib
    DBUS_SESSION_BUS_ADDRESS=unix:abstract=/tmp/dbus-Z7HVMAC8Dh
    LESSOPEN=|/usr/bin/lesspipe.sh %s
    ORA_NLS33=/henry/app/oracle/product/9.2/ocommon/nls/admin/data
    DISPLAY=:0.0
    ORACLE_HOME=/henry/app/oracle/product/9.2
    G_BROKEN_FILENAMES=1
    COLORTERM=gnome-terminal
    XAUTHORITY=/home/oracle/.Xauthority
    _=/usr/bin/env
    # .bash_profile
    # Get the aliases and functions
    if [ -f ~/.bashrc ]; then
    . ~/.bashrc
    fi
    # User specific environment and startup programs
    PATH=$PATH:$HOME/bin
    export ORACLE_BASE=/henry/app/oracle
    export ORACLE_HOME=$ORACLE_BASE/product/9.2
    export PATH=$PATH:$ORACLE_HOME/bin:$ORACLE_HOME/Apache/Apache/bin:/sbin
    export ORACLE_OWNER=oracle
    export ORACLE_SID=ora92
    export ORACLE_TERM=xterm
    export LD_ASSUME_KERNEL=2.4.19
    export THREADS_FLAG=native
    export LD_LIBRARY_PATH=$LD_LIBRARY_PATH:$ORACLE_HOME/lib
    export NLS_LANG="AMERICAN_AMERICA.ZHS16GBK"
    export ORA_NLS33=$ORACLE_HOME/ocommon/nls/admin/data
    export DISPLAY=:0
    export LANG=en_US
    export GDN_LANG=en_US
    export LC=en_US
    export CLASSPATH=$ORACLE_HOME/JRE:$ORACLE_HOME/jlib:$ORACLE_HOME/rdbms/jlib:$ORACLE_HOME/network/jlib
    export LC_CTYPE=zh_CN.GB2312
    export PATH
    unset USERNAME

  • Oracle Secure Backup error: 'No such file or directory'

    Hi,
    could you help me to fix the following issue?
    RMAN> run {   ALLOCATE CHANNEL c1 DEVICE TYPE sbt PARMS='SBT_LIBRARY=C:\windows\
    system32\orasbt.dll' ; backup database format 'CF_%d_%T_s%sp%pt%t'; }
    using target database control file instead of recovery catalog
    allocated channel: c1
    channel c1: SID=8 device type=SBT_TAPE
    channel c1: Oracle Secure BackupStarting backup at 26-OCT-09
    channel c1: starting full datafile backup set
    channel c1: specifying datafile(s) in backup set
    input datafile file number=00001 name=C:\APP\AIME\ORADATA\ORCL\SYSTEM01.DBF
    input datafile file number=00002 name=C:\APP\AIME\ORADATA\ORCL\SYSAUX01.DBF
    input datafile file number=00003 name=C:\APP\AIME\ORADATA\ORCL\UNDOTBS01.DBF
    input datafile file number=00004 name=C:\APP\AIME\ORADATA\ORCL\USERS01.DBF
    input datafile file number=00005 name=C:\APP\AIME\PRODUCT\11.2.0\DBHOME_1\DATABA
    SE\TBS_5.F
    channel c1: starting piece 1 at 26-OCT-09
    released channel: c1
    RMAN-00571: ===========================================================
    RMAN-00569: =============== ERROR MESSAGE STACK FOLLOWS ===============
    RMAN-00571: ===========================================================
    RMAN-03009: failure of backup command on c1 channel at 10/26/2009 00:20:54
    ORA-19506: failed to create sequential file, name="CF_ORCL_20091026_s10p1t701223
    652", parms=""
    ORA-27028: skgfqcre: sbtbackup returned error
    ORA-19511: Error received from media manager layer, error text:
    sbt__rpc_cat_query: Query for piece CF_ORCL_20091026_s10p1t701223652 failed.
    (Oracle Secure Backup error: 'No such file or directory').
    Thanks,
    jun

    You can work entirely in Xcode by using the command-line tool template in C. Xcode > File > New > Project > Command-Line Tool > Next > Language: C > Next > Create.
    If you do want to work on the command line, you may as well just use the "clang" program instead. The "gcc" tool is just a compatibility tool for existing scripts that are expecting the actual "gcc" program. Apple hasn't used the real "gcc" for years. (Read up on the GPLv3 for more information.)
    The gcc/clang arguments are the same. The "-c" flag instructs the compiler to only compile a single .c file into a .o object file. It won't create an executable. If you are only compiling a single source file, just omit the "-c" flag and the compiler will create an executable named "a.out" that you can run by typing "./a.out". You can specify "-o <executable name>" if you want to specify a name. Once you get more than a handful of source files, using the terminal starts to become a hassle. At that point, you definitely want to start using Xcode.
    I'm not sure why you would try to compile "helloworlddot1.c" and then get an error message about "filename.c". Something else is wrong.
    If you are working in the Terminal, it is easiest to use the "cd" command to move into the same directory as your source files. Then you don't have to keep typing the full path.
    It is hard to say what the "best" community is. There are many to choose from.

  • There is error 'No such file or directory' during loading custom authentica

    Hi,
    I am working on OBIEE authentication using Hyperion shared services. I did the necessary changes in config file, like modifying config.xml to enable HSSauthenticator and enabling external authentication to instanceconfig.xml. However BI Server is unable to load the driver file for the Hyperion custom authenticator. Here is the error message.
    There is error 'No such file or directory' during loading custom authentication module '/opt/local/usr/home/Oracle/OracleBI/web/bin64/libsawobisauthenticatorproxy643r.so'.
    2011-06-26 21:04:05
    [nQSError: 13011] Query for Initialization Block 'Hyperion EPM' has failed.
    I have set the env variable LD_LIBRARY_PATH to this path but still I am getting the same error msg. I also have full previleges on this file. Would be really great if anyone can tell me why I am unable to load this driver file on to server. Thanks in advance

    I think I figured out. Instead of giving path thru bin64 , I gave it thru bin folder, which is a 32bit file. I think they installled a 32bit OBIEE.

  • Clang: Error: No Such File or Directory

    Hello Mac Communities,
    I have recently installed Xcode 6.1.1, but currently just want to compile C files. I would like some help with a rather irritating error.
    Here are the commands I try and their results.
    command: gcc -c /Users/(my username)/Documents/C/helloworlddot1.c
    result: error: no such file or directory: filename.c
    or, after filename is changed to helloworld00.c;
    command: ]gcc -c /Users/(my username)/Documents/c/helloworld00.c
    result: (no text is displayed) The file helloworld00.o is created
    That seemed to work for the moment, until I tried to compile/convert the machine code into a program:
    command: gcc -c /Users/(my username)/Documents/c/helloworld00.o
    result: clang: error: no input files
    ...which is weird.
    Can anyone help with this?
    P.S. Is this the best community to post this type of thing to?

    You can work entirely in Xcode by using the command-line tool template in C. Xcode > File > New > Project > Command-Line Tool > Next > Language: C > Next > Create.
    If you do want to work on the command line, you may as well just use the "clang" program instead. The "gcc" tool is just a compatibility tool for existing scripts that are expecting the actual "gcc" program. Apple hasn't used the real "gcc" for years. (Read up on the GPLv3 for more information.)
    The gcc/clang arguments are the same. The "-c" flag instructs the compiler to only compile a single .c file into a .o object file. It won't create an executable. If you are only compiling a single source file, just omit the "-c" flag and the compiler will create an executable named "a.out" that you can run by typing "./a.out". You can specify "-o <executable name>" if you want to specify a name. Once you get more than a handful of source files, using the terminal starts to become a hassle. At that point, you definitely want to start using Xcode.
    I'm not sure why you would try to compile "helloworlddot1.c" and then get an error message about "filename.c". Something else is wrong.
    If you are working in the Terminal, it is easiest to use the "cd" command to move into the same directory as your source files. Then you don't have to keep typing the full path.
    It is hard to say what the "best" community is. There are many to choose from.

  • DB- open: /var/imap/deliver.db: No such file or directory

    Hi folks,
    yesterday the mail went to ****. I was running 10.3.5. I tried reconstruct several times, even recreating imap environment using mkimap but still no luck.
    I decided it's time to upgrade to 10.3.9 so I did it. I made a reconstruct again, the mail worked for 10 minutes and stopped again. I Installed mailbfr, did
    mailbfr -f
    mailbfr -q
    still doesn't work.
    mailbfr -d says:
    DB->open: /var/imap/deliver.db: No such file or directory
    system.log when starting mail service:
    Apr 27 08:47:15 xserve saslauthd[14413]: detach_tty : could not lock pid file /var/state/saslauthd/saslauthd.pid: Resource temporarily unavailable
    Apr 27 08:47:15 xserve saslauthd[14412]: detach_tty : Cannot start saslauthd
    Apr 27 08:47:15 xserve saslauthd[14412]: detach_tty : could not read from startup_pipe
    Apr 27 08:47:16 xserve master[14417]: process started
    Apr 27 08:47:18 xserve ctl_cyrusdb[14418]: verifying cyrus databases
    Apr 27 08:47:18 xserve ctl_cyrusdb[14418]: skiplist: recovered /var/imap/annotations.db (0 records, 144 bytes) in 0 seconds
    Apr 27 08:47:18 xserve ctl_cyrusdb[14418]: done verifying cyrus databases
    Apr 27 08:47:18 xserve master[14417]: ready for work
    Apr 27 08:47:18 xserve ctl_cyrusdb[14419]: checkpointing cyrus databases
    Apr 27 08:47:18 xserve ctl_cyrusdb[14419]: done checkpointing cyrus databases

    If the update didn’t complete, then you should try to properly reinstall it. The reason it didn’t complete was probably some filesystem corruption that starting up in Safe Mode may have already fixed, but you should look into it anyway, just in case.
    Verify/repair the startup disk (not just permissions), as described here:
    The Repair functions of Disk Utility: what's it all about?
    After having fixed all filesystem issues, if any, reinstall the update using the combo installer:
    About the Mac OS X 10.4.9 Combo Update
    Mac OS X 10.4.9 Combo Update for PPC
    Mac OS X 10.4.9 Combo Update for Intel
    Take a look at the following articles for guidelines on how to properly install system updates:
    Troubleshooting installation and software updates
    Installing software updates
    Note that Apple doesn’t mention anywhere the need to repair permissions either before or after installing a system update, not even for troubleshooting system update issues. It’s the disk itself (i.e. the filesystem) that should be verified/repaired before installing anything. Note also that no applications should be running while installing the update and that you may experience unexpected results if you have third-party system software modifications (not normal applications) installed.

  • Disk Utility error: "No such file or directory."

    I'm trying to copy a DVD I made in iDVD. What I've always done in the past is to open Disk Utility, put the DVD in the optical drive, select "Images...New...Image From [optical drive]". But today when I do this I get an error message that says "No such file or directory."
    I've tried selecting the drive ("2.0 GB PIONEER DVD-R...") and selecting the DVD ("CFTPRODUCTDEMO").
    The DVD plays in DVD Player no problems. I have 11 GB free on my hard drive. I'm using a new Pioneer DVR-111D external optical drive (the internal 106D won't read DVDs it makes).
    What's wrong?

    Hey,
    Im having the same exact problem.
    Toast even says it has a medium error with this drive.
    I cant burn with toast and it wont play other DVD-R movies
    that I have burnt on other systems.
    What is the fix?

  • ./startserver.sh error - No such file or directory - server.properties

    Hi,
    Can someone help please.
    I have just installed power center 8.1.1. and DAC server - software downloaded from OTN.
    I am not able to start DAC server. I am new to OBIEE
    $ ./startserver.sh
    OS detected: Linux
    Dec 25, 2008 1:54:41 PM com.siebel.etl.engine.core.ETLUtils logException
    SEVERE:
    ANOMALY INFO:::
    An exception occurred. Shutting down server...
    EXCEPTION CLASS::: java.lang.ExceptionInInitializerError
    com.siebel.etl.net.QServer.setSpill(QServer.java:159)
    com.siebel.etl.net.QServer.<init>(QServer.java:84)
    com.siebel.etl.net.QServer.main(QServer.java:420)
    ::: CAUSE :::
    MESSAGE:::Application Manager Failed Initialization
    EXCEPTION CLASS::: com.siebel.etl.bootup.ApplicationManagerInitializationExcepti on
    com.siebel.etl.bootup.ApplicationManager.initFileSource(ApplicationManager.java: 157)
    com.siebel.etl.bootup.ApplicationManager.initSysProps(ApplicationManager.java:79 )
    com.siebel.etl.bootup.ApplicationManager.<clinit>(ApplicationManager.java:62)
    com.siebel.etl.net.QServer.setSpill(QServer.java:159)
    com.siebel.etl.net.QServer.<init>(QServer.java:84)
    com.siebel.etl.net.QServer.main(QServer.java:420)
    ::: CAUSE :::
    MESSAGE:::/u01/oracle/product/10.2.0/DAC/bifoundation/dac/conf/server.properties (No such file or directory)
    EXCEPTION CLASS::: java.io.FileNotFoundException
    java.io.FileInputStream.open(Native Method)
    java.io.FileInputStream.<init>(FileInputStream.java:106)
    java.io.FileInputStream.<init>(FileInputStream.java:66)
    com.siebel.etl.bootup.ApplicationManager.initFileSource(ApplicationManager.java: 151)
    com.siebel.etl.bootup.ApplicationManager.initSysProps(ApplicationManager.java:79 )
    com.siebel.etl.bootup.ApplicationManager.<clinit>(ApplicationManager.java:62)
    com.siebel.etl.net.QServer.setSpill(QServer.java:159)
    com.siebel.etl.net.QServer.<init>(QServer.java:84)
    com.siebel.etl.net.QServer.main(QServer.java:420)
    Dec 25, 2008 1:54:41 PM com.siebel.etl.net.QServer <init>
    SEVERE:
    Shutting down server...
    $

    Hi Chris
    Could you refer the SAP KBA for the error message
    1845424 - Web Dispatcher : SCSA and SysLog not found messages appear during startup
    BR
    SS

  • Btrfs send error - No such file or directory

    Hello,
    I have the following setup in my UX31A laptop.
    # /etc/fstab: static file system information
    # <file system> <dir> <type> <options> <dump> <pass>
    # /dev/sda7
    UUID=617b35f9-b0a9-4562-b6b6-ab4eea3eff99 / btrfs rw,noatime,compress=lzo,ssd,discard,space_cache,autodefrag,inode_cache,subvol=root 0 0
    # /dev/sda7
    UUID=617b35f9-b0a9-4562-b6b6-ab4eea3eff99 /home btrfs rw,noatime,compress=lzo,ssd,discard,space_cache,autodefrag,inode_cache,subvol=home 0 0
    # /dev/sda5
    UUID=5D37-A7ED /boot vfat rw,relatime,fmask=0022,dmask=0022,codepage=437,iocharset=iso8859-1,shortname=mixed,errors=remount-ro 0 2
    UUID=e08eaf4d-f932-4cce-8086-8d4913e3dfab none swap defaults 0 0
    btrfs filesystem show
    Label: none uuid: 617b35f9-b0a9-4562-b6b6-ab4eea3eff99
    Total devices 1 FS bytes used 19.74GiB
    devid 1 size 66.82GiB used 39.04GiB path /dev/sda7
    Label: btrfs uuid: 3b31413b-081e-458f-87c2-b16276ceea94
    Total devices 1 FS bytes used 12.42GiB
    devid 1 size 638.53GiB used 15.04GiB path /dev/sdc2
    Btrfs v3.12
    btrfs sub list /
    ID 257 gen 20039 top level 5 path root
    ID 258 gen 20039 top level 5 path home
    ID 273 gen 19987 top level 5 path home/cesar/Downloads
    ID 281 gen 19997 top level 5 path home/.snapshot
    ID 282 gen 1391 top level 5 path home/.snapshot/back_clean_system
    ID 283 gen 7169 top level 5 path home/.snapshot/back_home
    ID 284 gen 7243 top level 5 path home/.snapshot/back_system_gnome
    ID 310 gen 19996 top level 5 path home/.snapshot/back_system_23-03-14
    ID 311 gen 19998 top level 5 path home/.snapshot/back_home_23-03-14
    btrfs sub list /run/media/cesar/btrfs/
    ID 257 gen 69 top level 5 path backup
    ID 258 gen 40 top level 5 path backup/back_clean_system
    ID 260 gen 45 top level 5 path backup/back_home
    ID 263 gen 59 top level 5 path backup/back_system_gnome
    Here's the deal, when I try to send a backup from my system to the external disk with the the following command
    btrfs send -v /home/.snapshot/back_home_23-03-14/ | btrfs receive -v /run/media/cesar/btrfs/backup
    this error appears even though the folder clearly exists 
    At subvol /home/.snapshot/back_home_23-03-14/
    ERROR: open home/.snapshot/back_home_23-03-14 failed. No such file or directory
    If I boot the computer from the arch live image, I can send snapshots from one filesystem to another without a problem.
    What might be my error?
    Last edited by cfsc (2014-03-23 23:09:13)

    When posting configs, code or command output, please use [ code ] tags https://bbs.archlinux.org/help.php#bbcode
    like this
    It makes the code more readable and - in case of longer listings - more convenient to scroll through.

  • Banshee - error: No such file or directory

    When i try to run banshee i received this message:
    No such file or directory
    System.IO.FileNotFoundException: No such file or directory ---> Mono.Unix.UnixIOException: No such file or directory [ENOENT].
    at Mono.Unix.UnixMarshal.ThrowExceptionForLastError () [0x00000]
    at Mono.Unix.UnixMarshal.ThrowExceptionForLastErrorIf (Int32 retval) [0x00000]
    at NDesk.DBus.Transports.UnixSocket.Connect (System.Byte[] remote_end) [0x00000]
    at NDesk.DBus.Transports.UnixNativeTransport.OpenUnix (System.String path) [0x00000]
    at NDesk.DBus.Transports.UnixNativeTransport..ctor (System.String path, Boolean abstract) [0x00000]
    at NDesk.DBus.Connection.Open (System.String path, Boolean abstr) [0x00000]
    at NDesk.DBus.Connection.OpenPrivate (System.String address) [0x00000]
    at NDesk.DBus.Connection..ctor (System.String address) [0x00000]
    at NDesk.DBus.Bus..ctor (System.String address) [0x00000]
    at NDesk.DBus.Bus.Open (System.String address) [0x00000]
    at NDesk.DBus.Bus.get_System () [0x00000]
    at NDesk.DBus.BusG.Init () [0x00000]
    at Banshee.BansheeEntry.Startup (System.String[] args) [0x00000]
    at (wrapper delegate-invoke) System.MulticastDelegate:invoke_void_string[] (string[])
    at Banshee.Gui.CleanRoomStartup.Startup (Banshee.Gui.StartupInvocationHandler startup, System.String[] args) [0x00000]
    Unhandled Exception: System.NullReferenceException: Object reference not set to an instance of an object
    at Banshee.Base.Branding.get_ApplicationIconName () [0x00000]
    at Banshee.Base.IconThemeUtils.SetWindowIcon (Gtk.Window window) [0x00000]
    at Banshee.Gui.Dialogs.ExceptionDialog..ctor (System.Exception e) [0x00000]
    at Banshee.Gui.CleanRoomStartup.Startup (Banshee.Gui.StartupInvocationHandler startup, System.String[] args) [0x00000]
    at Banshee.BansheeEntry.Main (System.String[] args) [0x00000]
    [tomas@a02-0709b ~]$ banshee
    No such file or directory
    System.IO.FileNotFoundException: No such file or directory ---> Mono.Unix.UnixIOException: No such file or directory [ENOENT].
    at Mono.Unix.UnixMarshal.ThrowExceptionForLastError () [0x00000]
    at Mono.Unix.UnixMarshal.ThrowExceptionForLastErrorIf (Int32 retval) [0x00000]
    at NDesk.DBus.Transports.UnixSocket.Connect (System.Byte[] remote_end) [0x00000]
    at NDesk.DBus.Transports.UnixNativeTransport.OpenUnix (System.String path) [0x00000]
    at NDesk.DBus.Transports.UnixNativeTransport..ctor (System.String path, Boolean abstract) [0x00000]
    at NDesk.DBus.Connection.Open (System.String path, Boolean abstr) [0x00000]
    at NDesk.DBus.Connection.OpenPrivate (System.String address) [0x00000]
    at NDesk.DBus.Connection..ctor (System.String address) [0x00000]
    at NDesk.DBus.Bus..ctor (System.String address) [0x00000]
    at NDesk.DBus.Bus.Open (System.String address) [0x00000]
    at NDesk.DBus.Bus.get_System () [0x00000]
    at NDesk.DBus.BusG.Init () [0x00000]
    at Banshee.BansheeEntry.Startup (System.String[] args) [0x00000]
    at (wrapper delegate-invoke) System.MulticastDelegate:invoke_void_string[] (string[])
    at Banshee.Gui.CleanRoomStartup.Startup (Banshee.Gui.StartupInvocationHandler startup, System.String[] args) [0x00000]
    Unhandled Exception: System.NullReferenceException: Object reference not set to an instance of an object
    at Banshee.Base.Branding.get_ApplicationIconName () [0x00000]
    at Banshee.Base.IconThemeUtils.SetWindowIcon (Gtk.Window window) [0x00000]
    at Banshee.Gui.Dialogs.ExceptionDialog..ctor (System.Exception e) [0x00000]
    at Banshee.Gui.CleanRoomStartup.Startup (Banshee.Gui.StartupInvocationHandler startup, System.String[] args) [0x00000]
    at Banshee.BansheeEntry.Main (System.String[] args) [0x00000]
    anyone who knows where is problem?

    byte wrote:Do you run the system dbus (dbus in rc.conf DAEMONS)? If yes, try 'dbus-launch banshee'.
    thanks 'dbus-launch banshee' works  :oops:

  • Compressor Error- No Such File Or Directory         Help!

    I was trying to export something from final cut pro in compressor when compressor gave me the following error- Failed: HOST [Avi-Zephyras-iMac.local] error reading source file /Users/Avi/Movies/Final Cut Events/2012 Event/Original Media/Photo125: No such file or directory
    I really would appreciate some help! Needs to be exported this weekend.

    I got the same error message, and found a similarity in our two cases that led me to the solution
    Both of our filenames had an "&" in them. Notice that your original filename was photo125&126, but the error message only said photo125? My file had an ampersand, but the error message similarly only listed the name up until the ampersand.
    So I duplicated the file in Finder, removed the original from my project and replaced it with the new one, sans &, and it worked just fine! And it's my first distributed encode with Compressor and Qmaster, so double win!

  • Pacman Error: No such file or directory, please help

    This morning I decided to make a package using the ABS and I noticed this error when executing Pacman.
    error: /var/lib/pacman/local/pacman-2.9.8-1/desc: No such file or directory
    Consequently, the custom package (Gaim Beta 4) kept complaining about dependancies, when I knew those packages were installed in the system. I did some searching around and it appeared that my local database may be currupted? At any rate, one of the posters suggested to forcefully reinstall the offending package, which I did. Upon doing so, it appeared that I had found a solution. However, after installing another package, the error appeared again. Repeating the process resolves the error, but only once before it occurs again.
    Upon further searching, another poster suggested that I should remove the offending directory, and then reinstall the package. When I attempt to remove the directory, I get a kernel panic and my entire system freezes. Since there is so much output, I've take a photo of the error (X just freezes).
    I apologise for the dodgy flash, but you can see the output. If anyone could offer any suggestions/assistance, I'd appreciate it.
    Cheers,
    Tate
    EDIT: If it helps, I'm using the latest 2.6.18 stock Arch Kernel and LVM2 with ReiserFS.

    try this:
    cd /var/lib/pacman/local
    mv pacman-2.9.8-1 pacman-2.9.8-1.old
    pacman -Sf pacman
    verify /var/lib/pacman/local/pacman-2.9.8-1 folder exists
    verify that following files are in folder:  depends, desc, files, install
    verify pacman -Syu works
    rm -rf /var/lib/pacman/local/pacman-2.9.8-1.old

  • FastCGI error "no such file or directory"

    I am trying to get a public face on django with my Mac OS X server 10.4.9 using mod_fastcgi. Django is installed and everything works fine in my shell (bash + python 2.4).
    I noticed these lines in the error log:
    [error] (2)No such file or directory: FastCGI: doesn't exist and can't be created: No such file or directory
    [error] (2)No such file or directory: FastCGI: can't create dynamic directory "/usr/logs/fastcgi/dynamic": doesn't exist and can't be created: No such file or directory
    [notice] FastCGI: process manager initialized (pid 1477)
    [notice] Apache/1.3.33 (Darwin) mod_fastcgi/2.4.2 mod_jk/1.2.6 DAV/1.0.3 mod_ssl/2.8.24 OpenSSL/0.9.7l PHP/4.4.4 configured -- resuming normal operations
    It appears the first two lines are errors that are followed by a positive indication.
    I am confused as to what this means and how to resolve it. Links to info, suggestions, etc. would be gratefully received.

    I abandoned use of fastcgi; see similar posts I made about the same date as this one.

  • Txn_checkpoint error: no such file or directory

    hi:
    I am using berkeley db with the python binding. But my program always through a exception like this:
    environment.txn_checkpoint()
    bsddb._db.DBNoSuchFileError: (2, 'No such file or directory -- txn_checkpoint: failed to flush the buffer cache No such file or directory')
    There are several processes are using berkeley db, any body can give me a hint of why this happen? Which file does buffer cache stores?
    Thank you.
    -qiao

    Hi qiao,
    What Berkeley DB version are you using?
    How do you use set_data_dir?
    Maybe you don't have DB_CREATE set, or maybe the path names are wrong, or maybe you are reordering directories.... there are many scenarios that may lead to this error.
    Can you please send me an example program that fails in the way you describe? I'll see if I can duplicate and debug the failure locally.
    txn_checkpoint method may fail if no environment is specified.
    Can you tell me the: Berkeley DB path, source code path, DB_HOME path? Also, be sure that you have write permissions on database disk directory, in order for checkpoint to flush the data.
    Regards,
    Bogdan Coman

Maybe you are looking for

  • On Line Galleries In PSE9

    I been using the on line photo galleries feature in PSE in the previos versions and looked forward to doing the same in PSE9. The old galleries were just what I needed for webmastering. I installed PSE9 and the older style galleries (PSE5-PSE7) are n

  • Using HDMI projector to grade

    Hi I have a projector as a second screen connected thru HDMI, I was wondering if I could use it to place the monitor there, and how. Thanks in advance.

  • Using Multiple OS's

    I am about to receive my new MacBook Pro C2D. I am planning to run WindowsXP on it. I am mainly going to be using OSX though, so I was thinking, the best option for me, is to probably partition my HDD so that it's approx: 30Gb Windows NTFS 70Gb MacOS

  • Interactive forms upload/download data

    Hi! i want to upload and download the data that it is in pdf to sap crm web application server like this [https://www.sdn.sap.com/irj/scn/go/portal/prtroot/docs/library/uuid/d05bc7e9-0183-2a10-17ab-cf77195fcdec] thanks, Raul Natu Edited by: Raul Natu

  • SAP TAO F-65 transaction error while replaying

    Hi and here goes another problem. Just don;t know what to think about the TAO and its stability I was using TAO 2.04 and 2.03. I was trying to record and replay the f-65 transaction. It loks like TAO is recording all steps/screens - first filling up