ORA-29855: error occurred in the execution of ODCIINDEXCREATE routine

I am receiving the following error from FME(safe software) when creating a spatial index. I have ruled out several of the common causes as reported in this forum because the procedure works for dataset with 300,000 rows of less but fails with the full dataset of 455,412 rows.
I am using 10G 10.2.0.2.0 - 64bi
Any hints/tips would be much appreciated.
Thanks
Richard
-----Error text follows ----------------------------------------------------------------------------------------
Executing SQL statement `CREATE INDEX CARTO_TEXT_LL_IXS ON CARTO_TEXT_LL(GEOM) INDEXTYPE IS MDSYS.SPATIAL_INDEX' to create spatial index on Oracle table
Executing SQL statement `DROP INDEX CARTO_TEXT_LL_IXS FORCE' to clean up failed spatial index creation
Database Writer: Translation aborted -- rerun specifing "ORACLE8I_2_START_TRANSACTION 227"
Execution of statement `CREATE INDEX CARTO_TEXT_LL_IXS ON CARTO_TEXT_LL(GEOM) INDEXTYPE IS MDSYS.SPATIAL_INDEX' did not succeed; error was `ORA-29855: error occurred in the execution of ODCIINDEXCREATE routine
ORA-13249: internal error in Spatial index: [mdidxrbd]
ORA-13249: Error in Spatial index: index build failed
ORA-29400: data cartridge error
Error - OCI_NODATA
ORA-06512: at "MDSYS.SDO_INDEX_METHOD_10I", line 10

Thank you both for replies.
The error does ocurr when I try to create the index from SQL, see message text below.
With the spatial index creation disabled in FME the run completes sucessfully, so the data is ok, well thats a maybe.
So I omitted the first 200,000 input rows and ran the last 255,413 rows and the index was sucessfully created (in FME) so now I conclude that the data IS ok (I had previously done a successful run with the first 300,000 rows)
Therefore I am thinking that my database has a problem when it is asked to create a spatial index with the full 455,412 rows. Could this be configuration, a space problem . . . .
Any more suggestions?
Thanks
Richard
=Error when running from SQL =====================================
SQL> CREATE INDEX CARTO_TEXT_LL_IXS ON CARTO_TEXT_LL(GEOM) INDEXTYPE IS MDSYS.SPATIAL_INDEX;
CREATE INDEX CARTO_TEXT_LL_IXS ON CARTO_TEXT_LL(GEOM) INDEXTYPE IS MDSYS.SPATIAL_INDEX
ERROR at line 1:
ORA-29855: error occurred in the execution of ODCIINDEXCREATE routine
ORA-13249: internal error in Spatial index: [mdidxrbd]
ORA-13249: Error in Spatial index: index build failed
ORA-29400: data cartridge error
Error - OCI_NODATA
ORA-06512: at "MDSYS.SDO_INDEX_METHOD_10I", line 10
SQL>
=End error message=============================================

Similar Messages

  • ERROR at line 1: ORA-29855: error occurred in the execution of ODCIINDEXCREATE routine ORA-20000: Oracle Text error: DRG-10700: preference does not exist: global_lexer ORA-06512: at "CTXSYS.DRUE", line 160 ORA-06512: at "CTXSYS.TEXTINDEXMETHODS", line 366

    database version 11.2.0.4
    rac two node
    CREATE INDEX MAXIMO.ACTCI_NDX3 ON MAXIMO.ACTCI
    (DESCRIPTION)
    INDEXTYPE IS CTXSYS.CONTEXT
    PARAMETERS('lexer global_lexer language column LANGCODE')
    ERROR at line 1:
    ORA-29855: error occurred in the execution of ODCIINDEXCREATE routine
    ORA-20000: Oracle Text error:
    DRG-10700: preference does not exist: global_lexer
    ORA-06512: at "CTXSYS.DRUE", line 160
    ORA-06512: at "CTXSYS.TEXTINDEXMETHODS", line 366

    Like the error message says, you don't have a global_lexer.  So, you need to create a global_lexer and that lexer must have at least a default sub_lexer, then you can use that global_lexer in your index parameters.  Please see the demonstration below, including reproduction of the error and solution.
    SCOTT@orcl12c> -- reproduction of problem:
    SCOTT@orcl12c> CREATE TABLE actci
      2    (description  VARCHAR2(60),
      3      langcode     VARCHAR2(30))
      4  /
    Table created.
    SCOTT@orcl12c> CREATE INDEX ACTCI_NDX3 ON ACTCI (DESCRIPTION)
      2  INDEXTYPE IS CTXSYS.CONTEXT
      3  PARAMETERS('lexer global_lexer language column LANGCODE')
      4  /
    CREATE INDEX ACTCI_NDX3 ON ACTCI (DESCRIPTION)
    ERROR at line 1:
    ORA-29855: error occurred in the execution of ODCIINDEXCREATE routine
    ORA-20000: Oracle Text error:
    DRG-10700: preference does not exist: global_lexer
    ORA-06512: at "CTXSYS.DRUE", line 160
    ORA-06512: at "CTXSYS.TEXTINDEXMETHODS", line 366
    SCOTT@orcl12c> -- solution:
    SCOTT@orcl12c> DROP INDEX actci_ndx3
      2  /
    Index dropped.
    SCOTT@orcl12c> BEGIN
      2    CTX_DDL.CREATE_PREFERENCE ('global_lexer', 'multi_lexer');
      3    CTX_DDL.CREATE_PREFERENCE ('english_lexer', 'basic_lexer');
      4    CTX_DDL.ADD_SUB_LEXER ('global_lexer', 'default', 'english_lexer');
      5  END;
      6  /
    PL/SQL procedure successfully completed.
    SCOTT@orcl12c> CREATE INDEX ACTCI_NDX3 ON ACTCI (DESCRIPTION)
      2  INDEXTYPE IS CTXSYS.CONTEXT
      3  PARAMETERS('lexer global_lexer language column LANGCODE')
      4  /
    Index created.

  • Locator Error ORA-29855: error occurred in the execution of ODCIINDEXCREATE routine

    I am trying to setup Intermedia Locator and am trying to create the Locator index per the code below. Any ideas why I am getting the below error, and what I can do about it.
    Oracle8i Enterprise Edition Release 8.1.6.0.0 - Production
    With the Partitioning option
    JServer Release 8.1.6.0.0 - Production
    SQL> desc zip_codes
    Name Null? Type
    ZIPC_ZIP5 NOT NULL VARCHAR2(5)
    ZIPC_SDO_GEOMETRY MDSYS.SDO_GEOMETRY
    ZIPC_GEOCODE_RESULT MDSYS.GEOCODE_RESULT
    SQL> execute geocoder_http.setup_locator_index('zip_codes','zipc_sdo_geometry');
    BEGIN geocoder_http.setup_locator_index('zip_codes','zipc_sdo_geometry'); END;
    ERROR at line 1:
    ORA-29855: error occurred in the execution of ODCIINDEXCREATE routine
    ORA-13224: specified index name is too long for a spatial index
    ORA-06512: at "MDSYS.SDO_INDEX_METHOD", line 7
    ORA-06512: at line 1
    ORA-06512: at "MDSYS.GEOCODER_HTTP", line 168
    ORA-06512: at line 1
    Thanks,
    Bob Mann

    Hi Raju,
    There are a few things I would change below.
    The first is that optimized rectangles (which you are using) need to be specified as lower left then upper right, assuming the lowest values are in the lower left corner of the coordinate system.
    The way you've specified them is upper left, lower right which will not work.
    The second thing I would change is your create index statement. You shouldn't be using locater to create the index - locator is a separate product should be used only with point geometries.
    Your create index statement should look something like this:
    create index zonetemp_sidx on zonetemp(shape)
    indextype is mdsys.spatial_index
    parameters ('sdo_level=NN');
    where NN above is an integer number representing the tiling level you are going to use for the index. This is workload dependent, but I will give you a range of 8-12 to start with - you can protype using real data and figure out what gives you the best performance - if it is 12 you may want to go higher.
    Also, you will have had to preload user_sdo_geom_metadata.
    Finally, your query looks good, although I would change it slightly to set the third ordinate to NULL rather than 0, i.e.:
    SELECT NAME
    FROM ZONETEMP A
    WHERE SDO_FILTER (A.SHAPE,
    MDSYS.SDO_GEOMETRY(2001,null,
    MDSYS.SDO_POINT_TYPE(20,20,NULL),
    NULL, NULL)),'QUERYTYPE='WINDOW')
    ='TRUE'
    Hope this helps,
    dan

  • Job failed,ORA-29855: error occurred in the execution of ODCIINDEXCREATE

    Hi All,
    In my 10gR2 Linux Box,
    One of the job is failing,Part of this job is dropping a particular table and recreating it,then creating the Index.But I am getting the error like
    ORA-29855: error occurred in the execution of ODCIINDEXCREATE routine
    But the same job is succesfully dropping ,recreating another table with same structure but different name, and creating Index also.
    Can anybody tell Why it is happening?
    Thanks in Advance,
    saf

    Please provide the metadata of your objects with dbms_metadata, are you using the National Characterset on the column being indexed? This maybe related to Metalink Note:233180.1 "DRG-10509 Trying to Create Text Index on NCLOB Column"

  • Error occurred in the execution of ODCIINDEXCREATE routine

    Hi,
    We're using oracle 9.2.0.1. I've created a table with a spatial data column. Then inserted some rows and then created a spatial index on that column. What is peculiar is; depending on the number of the rows inserted I receive below error;
    ORA-29855: error occurred in the execution of ODCIINDEXCREATE routine
    ORA-13249: internal error in Spatial index: [mdidxrbd]
    ORA-13249: Error in Spatial index: index build failed
    ORA-13236: internal error in R-tree processing: [failed to cluster in memory]
    ORA-13249: Internal error in Spatial index: [mdrcrclmem]
    ORA-06512: at "MDSYS.SDO_INDEX_METHOD_9I", line 7
    ORA-06512: at line 1
    for 2500 records, I can successfully create the index. However, for 3000 records above error happens. What can be the reason and how can I fix it?
    Thanks in advance ;-))

    Hi,
    I've seen this a few times, and it seems to be related to some memory config issues in the database.
    Can you try adding this to your create index statement (after dropping the existing index using the FORCE option [drop index <spatial_index_name> force;]):
    parameters ('sdo_max_memory=2000000')
    We've found it to be helpful, but we haven't been able to isolate the database or OS parameters that lead to the problem.

  • ORA-29855: error occured in ODCIINDEXCREATE routine

    I'm trying to create a spatial index using Microstation Geographics, but I got error messages.
    The first error msg was ORA-29855: error occurred in ODCIINDEXCREATE routine. I think the other messages were also related to that routine.
    I tried to create a spatial index (using the same method) in another database. It worked.
    I wonder what went wrong. Do I need records in the table to create index?
    Thanks!

    In the patch readme, I found this:
    =======================================================
    If you are using an Oracle9i (9.2) preconfigured Standard Edition database, then the database contains the following components that are not supported by the Standard Edition:
    Oracle Data Mining
    Oracle OLAP Catalog
    Oracle OLAP Analytic Workspace
    Oracle OLAP API
    Spatial
    The catpatch.sql script does not run the patch scripts for these components. It sets the component STATUS to "OPTION OFF" in the DBA_REGISTRY view. The original versions of the dictionary objects for the components remain in the database but the catpatch.sql script does not apply the patch to them.
    =========================================================
    Does it mean it doesn't support Spatial? I'm not sure mine is preconfigured Standard Edition database though.

  • Error occured during the execution of the JSPM_main phase

    Hi,
    When ever I try to Start JSPM i get the following error saying that Cannot detect system kernel under the directory c:\usr\sap\EPD\sys directory and also error occured during the execution of the JSPM_main phase.
    Can any one help me in this regard.
    Thanks in advance.
    Thanks
    Venu

    Hi Anand,
    Please find the log file below.
    <!LOGHEADER[START]/>
    <!HELP[Manual modification of the header may cause parsing problem!]/>
    <!LOGGINGVERSION[1.5.3.7185 - 630]/>
    <!NAME[C:\usr\sap\EPD\JC20\j2ee\JSPM\log\log_2007_04_03_16_57_45\JSPM_MAIN_1_01.LOG]/>
    <!PATTERN[JSPM_MAIN_1_01.LOG]/>
    <!FORMATTER[com.sap.tc.logging.ListFormatter]/>
    <!ENCODING[Cp1252]/>
    <!LOGHEADER[END]/>
    #1.5#C000AC190C09000000000016019B539300042D33A14D91C0#1175599679640#/System/Server/Upgrade/Phases/JSPM/JSPMPhases/JSPM_MAIN##com.sap.sdt.ucp.phases.AbstractPhaseType.initialize(AbstractPhaseType.java:720)#######Thread[main,5,main]##0#0#Info#1#com.sap.sdt.ucp.phases.AbstractPhaseType.initialize(AbstractPhaseType.java:720)#Java###Phase has been started.#1#JSPM/JSPMPhases/JSPM_MAIN#
    #1.5#C000AC190C09000000000017019B539300042D33A14DD040#1175599679656#/System/Server/Upgrade/Phases/JSPM/JSPMPhases/JSPM_MAIN##com.sap.sdt.ucp.phases.AbstractPhaseType.initialize(AbstractPhaseType.java:721)#######Thread[main,5,main]##0#0#Info#1#com.sap.sdt.ucp.phases.AbstractPhaseType.initialize(AbstractPhaseType.java:721)#Java###Phase type is .#1#com.sap.sdt.jspm.phases.PhaseTypeJSPM#
    #1.5#C000AC190C09000000000018019B539300042D33A1531000#1175599680000#/System/Server/Upgrade/Phases/JSPM/JSPMPhases/JSPM_MAIN##com.sap.sdt.jspm.gui.DialogController.showInitDialog(DialogController.java:560)#######Thread[main,5,main]##0#0#Info#1#com.sap.sdt.jspm.gui.DialogController.showInitDialog(DialogController.java:560)#Java###Starting Initialize dialog...##
    #1.5#C000AC190C0900000000001E019B539300042D33A15C5AE8#1175599680609#/System/Server/Upgrade/Phases/JSPM/JSPMPhases/JSPM_MAIN##com.sap.sdt.jspm.gui.SystemInitializer.initializeDataModelAndLogging(SystemInitializer.java:462)#######Thread[main,5,main]##0#0#Info#1#com.sap.sdt.jspm.gui.SystemInitializer.initializeDataModelAndLogging(SystemInitializer.java:462)#Java###Detecting system parameters...##
    #1.5#C000AC190C0900000000001F019B539300042D33A15C5AE8#1175599680609#/System/Server/Upgrade/Phases/JSPM/JSPMPhases/JSPM_MAIN##com.sap.sdt.jspm.trace.JspmExtLoggingManager.logReferenceToExtLog(JspmExtLoggingManager.java:167)#######Thread[main,5,main]##0#0#Info#1#com.sap.sdt.jspm.trace.JspmExtLoggingManager.logReferenceToExtLog(JspmExtLoggingManager.java:167)#Java###You can find additional information in log file .#1#C:
    usr
    sap
    EPD
    JC20
    j2ee
    JSPM
    log
    log_2007_04_03_16_57_45
    DETECT_SYSTEM_PARAMETERS_01.LOG#
    #1.5#C000AC190C0900000000002D019B539300042D33A1AA1558#1175599685703#/System/Server/Upgrade/Phases/JSPM/JSPMPhases/JSPM_MAIN##com.sap.sdt.jspm.gui.SystemInitializer.initializeDataModelAndLogging(SystemInitializer.java:483)#######Thread[main,5,main]##0#0#Info#1#com.sap.sdt.jspm.gui.SystemInitializer.initializeDataModelAndLogging(SystemInitializer.java:483)#Java###Detection of system parameters has finished.##
    #1.5#C000AC190C0900000000002E019B539300042D33A1AA4FF0#1175599685718#/System/Server/Upgrade/Phases/JSPM/JSPMPhases/JSPM_MAIN##com.sap.sdt.jspm.gui.DialogController.execute(DialogController.java:470)#######Thread[main,5,main]##0#0#Info#1#com.sap.sdt.jspm.gui.DialogController.execute(DialogController.java:470)#Java###Initialize dialog has been processed.##
    #1.5#C000AC190C0900000000002F019B539300042D33A1AA4FF0#1175599685718#/System/Server/Upgrade/Phases/JSPM/JSPMPhases/JSPM_MAIN##com.sap.sdt.jspm.gui.DialogController.loginDialog(DialogController.java:1043)#######Thread[main,5,main]##0#0#Info#1#com.sap.sdt.jspm.gui.DialogController.loginDialog(DialogController.java:1043)#Java###Starting dialog...#1#LogIn#
    #1.5#C000AC190C09000000000039019B539300042D33AA43E180#1175599830000#/System/Server/Upgrade/Phases/JSPM/JSPMPhases/JSPM_MAIN##com.sap.sdt.jspm.gui.DialogController.loginDialog(DialogController.java:1048)#######Thread[main,5,main]##0#0#Info#1#com.sap.sdt.jspm.gui.DialogController.loginDialog(DialogController.java:1048)#Java###Dialog has been confirmed by the user.#1#LogIn#
    #1.5#C000AC190C0900000000003A019B539300042D33AA467D78#1175599830171#/System/Server/Upgrade/Phases/JSPM/JSPMPhases/JSPM_MAIN##com.sap.sdt.j700.deploymentmgr.DeploymentManagerImpl#######Thread[main,5,main]##0#0#Info#1#com.sap.sdt.j700.deploymentmgr.DeploymentManagerImpl#Java###Checking connectivity for SDM server on host , port ...#2#aprins02#52018#
    #1.5#C000AC190C0900000000003B019B539300042D33AA539CD8#1175599831031#/System/Server/Upgrade/Phases/JSPM/JSPMPhases/JSPM_MAIN##com.sap.sdt.j700.deploymentmgr.DeploymentManagerImpl#######Thread[main,5,main]##0#0#Info#1#com.sap.sdt.j700.deploymentmgr.DeploymentManagerImpl#Java###Connection to SDM server on host , port is valid.#2#aprins02#52018#
    #1.5#C000AC190C0900000000003C019B539300042D33AA65F810#1175599832234#/System/Server/Upgrade/Phases/JSPM/JSPMPhases/JSPM_MAIN##com.sap.sdt.jspm.deployedsdu.DeployedComponentsProvider.refresh(DeployedComponentsProvider.java:192)#######Thread[main,5,main]##0#0#Info#1#com.sap.sdt.jspm.deployedsdu.DeployedComponentsProvider.refresh(DeployedComponentsProvider.java:192)#Java###Detecting components of the J2EE engine...##
    #1.5#C000AC190C0900000000003D019B539300042D33AA65F810#1175599832234#/System/Server/Upgrade/Phases/JSPM/JSPMPhases/JSPM_MAIN##com.sap.sdt.jspm.trace.JspmExtLoggingManager.logReferenceToExtLog(JspmExtLoggingManager.java:167)#######Thread[main,5,main]##0#0#Info#1#com.sap.sdt.jspm.trace.JspmExtLoggingManager.logReferenceToExtLog(JspmExtLoggingManager.java:167)#Java###You can find additional information in log file .#1#C:
    usr
    sap
    EPD
    JC20
    j2ee
    JSPM
    log
    log_2007_04_03_16_57_45
    DETECT_SYSTEM_COMPONENTS_01.LOG#
    #1.5#C000AC190C09000000000052019B539300042D33B5C8DEE8#1175600023265#/System/Server/Upgrade/Phases/JSPM/JSPMPhases/JSPM_MAIN##com.sap.sdt.jspm.trace.JspmExtLoggingManager.logError(JspmExtLoggingManager.java:275)#######Thread[main,5,main]##0#0#Error#1#com.sap.sdt.jspm.trace.JspmExtLoggingManager.logError(JspmExtLoggingManager.java:275)#Java###Error during operation. For more information about the operation, see the previous message. For more information about the error, see the next messages.##
    #1.5#C000AC190C09000000000053019B539300042D33B5C91D68#1175600023281#/System/Server/Upgrade/Phases/JSPM/JSPMPhases/JSPM_MAIN##com.sap.sdt.jspm.trace.JspmExtLoggingManager.logMaximumLogSeverity(JspmExtLoggingManager.java:258)#######Thread[main,5,main]##0#0#Warning#1#com.sap.sdt.jspm.trace.JspmExtLoggingManager.logMaximumLogSeverity(JspmExtLoggingManager.java:258)#Java###There are some WARNING messages in the child log .#1#C:
    usr
    sap
    EPD
    JC20
    j2ee
    JSPM
    log
    log_2007_04_03_16_57_45
    DETECT_SYSTEM_COMPONENTS_01.LOG#
    #1.5#C000AC190C09000000000054019B539300042D33B5C95800#1175600023296#/System/Server/Upgrade/Phases/JSPM/JSPMPhases/JSPM_MAIN##com.sap.sdt.ucp.phases.AbstractPhaseType.doExecute(AbstractPhaseType.java:748)#######Thread[main,5,main]##0#0#Error#1#com.sap.sdt.ucp.phases.AbstractPhaseType.doExecute(AbstractPhaseType.java:748)#Java###Exception has occurred during the execution of the phase.##
    #1.5#C000AC190C09000000000055019B539300042D33B5C95800#1175600023296#/System/Server/Upgrade/Phases/JSPM/JSPMPhases/JSPM_MAIN##com.sap.sdt.tools.proc.OsProcessController.startProcess(OsProcessController.java:285)#######Thread[main,5,main]##0#0#Error#1#com.sap.sdt.tools.proc.OsProcessController.startProcess(OsProcessController.java:285)#Java###java.io.IOException: CreateProcess: C:/usr/sap/EPD/JC20/exe/disp+work -V error=2##
    #1.5#C000AC190C09000000000056019B539300042D33B5C95800#1175600023296#/System/Server/Upgrade/Phases/JSPM/JSPMPhases/JSPM_MAIN##com.sap.sdt.tools.proc.OsProcessController.startProcess(OsProcessController.java:284)#######Thread[main,5,main]##0#0#Error#1#com.sap.sdt.tools.proc.OsProcessController.startProcess(OsProcessController.java:284)#Java###Error while executing process C:/usr/sap/EPD/JC20/exe/disp+work.##
    #1.5#C000AC190C09000000000057019B539300042D33B5C95800#1175600023296#/System/Server/Upgrade/Phases/JSPM/JSPMPhases/JSPM_MAIN##com.sap.sdt.tools.proc.OsProcessController.launch(OsProcessController.java:130)#######Thread[main,5,main]##0#0#Error#1#com.sap.sdt.tools.proc.OsProcessController.launch(OsProcessController.java:130)#Java###Could not start process C:/usr/sap/EPD/JC20/exe/disp+work.##
    #1.5#C000AC190C09000000000058019B539300042D33B5C95800#1175600023296#/System/Server/Upgrade/Phases/JSPM/JSPMPhases/JSPM_MAIN##com.sap.sdt.j2ee.tools.kernel.KernelRetriever.getCommandOutput(KernelRetriever.java:240)#######Thread[main,5,main]##0#0#Error#1#com.sap.sdt.j2ee.tools.kernel.KernelRetriever.getCommandOutput(KernelRetriever.java:240)#Java###disp+work executable file cannot be run.##
    #1.5#C000AC190C09000000000059019B539300042D33B5C95800#1175600023296#/System/Server/Upgrade/Phases/JSPM/JSPMPhases/JSPM_MAIN##com.sap.sdt.j2ee.tools.kernel.detect.DetectKernelComponent.detectKernelComponentFromExeDirectory(DetectKernelComponent.java:767)#######Thread[main,5,main]##0#0#Error#1#com.sap.sdt.j2ee.tools.kernel.detect.DetectKernelComponent.detectKernelComponentFromExeDirectory(DetectKernelComponent.java:767)#Java###Could not detect current system kernel in the C:
    usr
    sap
    EPD
    JC20
    exe directory.##
    #1.5#C000AC190C0900000000005A019B539300042D33B5C95800#1175600023296#/System/Server/Upgrade/Phases/JSPM/JSPMPhases/JSPM_MAIN##com.sap.sdt.j630.sysinfo.ExeDirLocator.determineMultipleKernels(ExeDirLocator.java:435)#######Thread[main,5,main]##0#0#Error#1#com.sap.sdt.j630.sysinfo.ExeDirLocator.determineMultipleKernels(ExeDirLocator.java:435)#Java###Could not detect central instance kernel in directory C:
    usr
    sap
    EPD
    JC20
    exe.##
    #1.5#C000AC190C0900000000005B019B539300042D33B5C95800#1175600023296#/System/Server/Upgrade/Phases/JSPM/JSPMPhases/JSPM_MAIN##com.sap.sdt.j2ee.tools.kernel.detect.DetectKernelComponent.detectKernelComponentsFromSystem(DetectKernelComponent.java:464)#######Thread[main,5,main]##0#0#Error#1#com.sap.sdt.j2ee.tools.kernel.detect.DetectKernelComponent.detectKernelComponentsFromSystem(DetectKernelComponent.java:464)#Java###Could not detect system kernel under the C:
    usr
    sap
    EPD
    SYS directory.##
    #1.5#C000AC190C0900000000005C019B539300042D33B5C95800#1175600023296#/System/Server/Upgrade/Phases/JSPM/JSPMPhases/JSPM_MAIN##com.sap.sdt.j2ee.tools.kernel.detect.DetectKernelComponent.detectComponentsFromSystem(DetectKernelComponent.java:554)#######Thread[main,5,main]##0#0#Error#1#com.sap.sdt.j2ee.tools.kernel.detect.DetectKernelComponent.detectComponentsFromSystem(DetectKernelComponent.java:554)#Java###Could not detect version information of the current system kernel.##
    #1.5#C000AC190C0900000000005D019B539300042D33B5C95800#1175600023296#/System/Server/Upgrade/Phases/JSPM/JSPMPhases/JSPM_MAIN##com.sap.sdt.jspm.deployedsdu.DeployedComponentsProvider.refresh(DeployedComponentsProvider.java:220)#######Thread[main,5,main]##0#0#Error#1#com.sap.sdt.jspm.deployedsdu.DeployedComponentsProvider.refresh(DeployedComponentsProvider.java:220)#Java###Could not detect deployed components.##
    #1.5#C000AC190C0900000000005E019B539300042D33B5C95800#1175600023296#/System/Server/Upgrade/Phases/JSPM/JSPMPhases/JSPM_MAIN##com.sap.sdt.jspm.gui.SystemInitializer.initializeBusinessObjects(SystemInitializer.java:676)#######Thread[main,5,main]##0#0#Error#1#com.sap.sdt.jspm.gui.SystemInitializer.initializeBusinessObjects(SystemInitializer.java:676)#Java###Cannot initialize application data.##
    #1.5#C000AC190C0900000000005F019B539300042D33B5C95800#1175600023296#/System/Server/Upgrade/Phases/JSPM/JSPMPhases/JSPM_MAIN##com.sap.sdt.ucp.phases.AbstractPhaseType.cleanup(AbstractPhaseType.java:792)#######Thread[main,5,main]##0#0#Info#1#com.sap.sdt.ucp.phases.AbstractPhaseType.cleanup(AbstractPhaseType.java:792)#Java###Phase has been completed.#1#JSPM/JSPMPhases/JSPM_MAIN#
    #1.5#C000AC190C09000000000060019B539300042D33B5C95800#1175600023296#/System/Server/Upgrade/Phases/JSPM/JSPMPhases/JSPM_MAIN##com.sap.sdt.ucp.phases.AbstractPhaseType.cleanup(AbstractPhaseType.java:793)#######Thread[main,5,main]##0#0#Info#1#com.sap.sdt.ucp.phases.AbstractPhaseType.cleanup(AbstractPhaseType.java:793)#Java###Start time: .#1#2007/04/03 16:57:59#
    #1.5#C000AC190C09000000000061019B539300042D33B5C95800#1175600023296#/System/Server/Upgrade/Phases/JSPM/JSPMPhases/JSPM_MAIN##com.sap.sdt.ucp.phases.AbstractPhaseType.cleanup(AbstractPhaseType.java:794)#######Thread[main,5,main]##0#0#Info#1#com.sap.sdt.ucp.phases.AbstractPhaseType.cleanup(AbstractPhaseType.java:794)#Java###End time: .#1#2007/04/03 17:03:43#
    #1.5#C000AC190C09000000000062019B539300042D33B5C95800#1175600023296#/System/Server/Upgrade/Phases/JSPM/JSPMPhases/JSPM_MAIN##com.sap.sdt.ucp.phases.AbstractPhaseType.cleanup(AbstractPhaseType.java:795)#######Thread[main,5,main]##0#0#Info#1#com.sap.sdt.ucp.phases.AbstractPhaseType.cleanup(AbstractPhaseType.java:795)#Java###Duration: .#1#0:05:43.640#
    #1.5#C000AC190C09000000000063019B539300042D33B5C95800#1175600023296#/System/Server/Upgrade/Phases/JSPM/JSPMPhases/JSPM_MAIN##com.sap.sdt.ucp.phases.AbstractPhaseType.cleanup(AbstractPhaseType.java:796)#######Thread[main,5,main]##0#0#Info#1#com.sap.sdt.ucp.phases.AbstractPhaseType.cleanup(AbstractPhaseType.java:796)#Java###Phase status is .#1#error#
    Thanks
    Venu

  • ORA-29855 - Error creating Spatial Index using a Stored Procedure

    Hi
    I am using Oracle 10gR2 database and I have written a stored procedure to create spatial index. But when i execute this function i get the following error message.
    ORA-29855: error occurred in the execution of ODCIINDEXCREATE routine
    ORA-13249: internal error in Spatial index: [mdidxrbd]
    ORA-13249: Error in Spatial index: index build failed
    ORA-13249: Error in R-tree: [mdrcrtscrt]
    ORA-13231: failed to create index table [MDRT_217C1$] during R-tree creation
    ORA-13249: Stmt-Execute Failure: CREATE TABLE FGDABZ40.MDRT_217C1$ (NODE_ID NUMBER, NODE_LEVEL NUMBER, INFO BLOB) LOB (INFO) STORE AS (CACHE) NOLOGGING PCTFREE 2
    ORA-29400: data cartridge error
    ORA-01031: insufficient privileges
    ORA-06512: at "MDSYS.SDO_INDEX_METHOD_10I", line 10
    ORA-06512: at line 1
    ORA-06512: at "FGDABZ40.PKG_PSSDBE_APPLICATION", line 298
    ORA-06512: at line 17
    The tables that i am passing are registered in metadata and I am able to create indexes directly in sql plus. But when i try to create using this stored procedure, it fails.
    it should be possible to create indexes using a generic function. Has any faced a similar problem?
    regards
    sam

    Hi,
    I am having a same error on Oracle 10gR2 database. When I execute the same statement in sqlplus, it works. But it gives this error when I call the procedure which has this create spatial index statement.
    ORA-29855: error occurred in the execution of ODCIINDEXCREATE routine
    ORA-13249: internal error in Spatial index: [mdidxrbd]
    ORA-13249: Error in Spatial index: index build failed
    ORA-13249: Error in R-tree: [mdrcrtscrt]
    ORA-13231: failed to create index table [MDRT_20CDA$] during R-tree creation
    ORA-13249: Stmt-Execute Failure: CREATE TABLE "SDOMGR".MDRT_20CDA$ (NODE_ID NUMBER, NODE_LEVEL NUMBER, INFO BLOB) LOB (INFO) STORE AS (CACHE) NOLOGGING PCTFREE 2
    ORA-29400: data cartridge error
    ORA-01031: i
    Any help will be appreciated.
    Thanks,
    Sri

  • ORA-01461 error occurs

    Hi All.
    I'm using WLS6.1 on Soralis8.
    I try to use jdbc to store persistance
    sessions,but An ORA-01461 error occurs
    while the server is trying to write the
    session data in the JDBC managed
    persistence when using the Oracle thin
    Driver.
    How should I fix the problem?

    You should open a support case and request patch CR083912_610sp1.jar if you are
    seeing the exception below
    ORA-01461 error occurs while the server try to write the session data in the JDBC
    managed persistence (using Oracle thin Dricer).
    Configuration:
    WLS 6.1 SP1
    Oracle Server: 8.1.7.3
    Oracle thin driver and JDK come with WLS
    Error : This error comes to the server command line window when I first hit
    the jsp page.
    Error Details :
    java.sql.SQLException: ORA-01461: can bind a LONG value only for insert into
    a LONG column
    at oracle.jdbc.dbaccess.DBError.throwSqlException(DBError.java:168)
    at oracle.jdbc.ttc7.TTIoer.processError(TTIoer.java:208)
    at oracle.jdbc.ttc7.Oall7.receive(Oall7.java:543)

  • ORA-04052: error occurred when looking up remote obj in mapping execution

    Hi,
    While executing an OWB mapping, I am getting the following error:
    ============
    Starting Execution UII_D_MAP_SPC_INSTALLATION_SIT
    Starting Task UII_D_MAP_SPC_INSTALLATION_SIT
    ORA-04052: error occurred when looking up remote object [email protected]
    ORA-00604: error occurred at recursive SQL level 1
    ORA-02019: connection description for remote database not found
    ORA-02063: preceding 3 lines from BIP2S@BIPDRACONN
    ORA-06512: at "UII_ODS_OWNER.UII_D_MAP_SPC_INSTALLATION_SIT", line 73
    ORA-06512: at "UII_ODS_OWNER.UII_D_MAP_SPC_INSTALLATION_SIT", line 1672
    ORA-06512: at "UII_ODS_OWNER.UII_D_MAP_SPC_INSTALLATION_SIT", line 2353
    ORA-06512: at "UII_ODS_OWNER.UII_D_MAP_SPC_INSTALLATION_SIT", line 6838
    ORA-06512: at line 1
    Completing Task UII_D_MAP_SPC_INSTALLATION_SIT
    Completing Execution UII_D_MAP_SPC_INSTALLATION_SIT
    ============
    Actually, here UII_ODS_OWNER itself is the target schema and <<UIIVS.DEVENV1.BT.CO.UK>> is the database in which this schema exists. And the mapping "UII_D_MAP_SPC_INSTALLATION_SIT" is being executed in the same target schema UII_ODS_OWNER.
    I am not sure why this above error is coming because such a dblink 'UIIVS.DEVENV1.BT.CO.UK' does not exist in the OWB generated package code. And the 2nd dblink 'BIP2S@BIPDRACONN' does not exist in the code, intead it exists as "BIP2S.DEVENV1.BT.CO.UK@BIPDRACONN" in the package code which is correct (as per OWB configuration & database).
    Same error also comes when I try to execute the same mapping from the OWB DEPLOYMENT MANAGER.
    Thanks & Regards,
    lenin

    Good morning Lenin,
    Have you checked the implementation of the connectors and are your locations well registered?
    Has a similar setup ever worked well?
    Can you access the source table using SQL (e.g. with SQL*Plus or TOAD)?
    Regards, Patrick

  • Autoconfig Error- jtfictx.sh (INSTE8_PRF 1) ORA-29874: warning in the execution of ODCIINDEXALTER routine

    Gurus,
    EBS : R12.1.2 (OS Linux)
    Database: 11.2.0.3 (OS HP UX Itanium)
    I am getting error in autoconfig with jtfictx.sh.  I am cloning PROD to QA. Usually I use RMAN duplicate to clone the database and then Application file system are copied. I have performed this method for many times( say 25 times).
    This iteration after the database recovery, I ran the RDBMS autoconfig which completed successfully. Then I ran the autoconfig on the concurrent manager server  first and received the below error. There are no change of steps from my usual.
    Executing script in InstantiateFile:
    /ebs02/oracle/inst/apps/SID_servername/admin/install/jtfictx.sh
    script returned:
    jtfictx.sh started at Sun Sep  8 01:04:11 CDT 2013
    SQL*Plus: Release 10.1.0.5.0 - Production on Sun Sep 8 01:04:11 2013
    Copyright (c) 1982, 2005, Oracle.  All rights reserved.
    Enter value for 1: Enter value for 2: Enter value for 3: Connected.
    DECLARE
    ERROR at line 1:
    ORA-29874: warning in the execution of ODCIINDEXALTER routine
    ORA-29960: line 1,
    DRG-10595: ALTER INDEX JTF_AMV_ITEMS_URL_CTX failed
    DRG-11422: linguistic initialization failed
    DRG-11446: supplied knowledge base file
    /u01/oracle/orahome/11.2.0/ctx/data/enlx/droldUS.dat not installed
    ORA-06512: at "SYS.DBMS_SQL", line 1199
    ORA-06512: at line 96
    Disconnected from Oracle Database 11g Enterprise Edition Release 11.2.0.3.0 - 64bit Production
    With the Partitioning, OLAP, Data Mining and Real Application Testing options
    jtfictx.sh exiting with status 1
    ERRORCODE = 1 ERRORCODE_END
    .end std out.
    .end err out.
    I usually backup the autoconfig/ context file before the refresh of EBS files from PROD. The previous refresh was performed 2 months ago and it was successful. There is no changes on database ORACLE_HOME as depicted in the error.
    I see that someone have had asked similar error in forums and Hussein did recommend some Metalink Note. I did refer that but so far no success. Please do let me know if anyone faced similar issue and how did you solve it?
    Notes Referred:
    "Jtfictx.sh" Failed During Autoconfig On Application Tier, ORA-29874, DRG-10595 (Doc ID 1271186.1)
    Autoconfig Failed On Apps Tier "jtfictx.sh INSTE8_PRF" . Running manually "jtfictx.sh " Failed on "DRG-10758: index owner does not have the privilege" (Doc ID 1357760.1)
    Several Scripts Failing With A ORA-29855 Executing ODCIINDEXCREATE Routine During Upgrade To 12.1.1 (u6678700.drv) (Doc ID 1286033.1)
    11i : Autoconfig Fails On The Application Tier in running jtfictx.sh (Doc ID 396174.1)
    Thanks
    Cherrish Vaidiyan

    Yes I did and below are the DB components from dba_registry:
    Oracle Application Express    APEX_030200    3.2.1.00.12    VALID
    OLAP Catalog    OLAPSYS    11.2.0.3.0    VALID
    Oracle Data Mining    DMSYS    11.2.0.3.0    VALID
    Oracle XML Database    XDB    11.2.0.3.0    VALID
    Oracle Text    CTXSYS    11.2.0.3.0    VALID
    Spatial    MDSYS    11.2.0.3.0    VALID
    Oracle Multimedia    ORDSYS    11.2.0.3.0    VALID
    Oracle Database Catalog Views    SYS    11.2.0.3.0    VALID
    Oracle Database Packages and Types    SYS    11.2.0.3.0    VALID
    JServer JAVA Virtual Machine    SYS    11.2.0.3.0    VALID
    Oracle Database Java Packages    SYS    11.2.0.3.0    VALID
    Oracle XDK    SYS    11.2.0.3.0    VALID
    Oracle Real Application Clusters    SYS    11.2.0.3.0    INVALID
    OLAP Analytic Workspace    SYS    11.2.0.3.0    VALID
    Oracle OLAP API    SYS    11.2.0.3.0    VALID
    Only component invalid is RAC and I dont have RAC for this database.
    Thanks
    Cherrish Vaidiyan

  • A database error occured. The database error text is: ORA-29275: partial multibyte character . (WIS 10901)

    Hi,
    My Webi report is geeting failed with the error
    "A database error occured. The database error text is: ORA-29275: partial multibyte character . (WIS 10901)"
    may i know the root cause of the above error and how to resolve it. I am using BO 3.1.
    Its very important to provide the report. Please help urgently.
    Thanks in advance.
    Abid

    Hi Abid,
    Please see SAP Note 1556127.
    Symptom
    A database error occurs after refreshing a web intelligence report in java report panel or web intelligence in interactive mode
    The database error text is: ORA 29275 with partial multibyte character (WIS 10901)
    Environment
    windows 2003 Server
    Cause
    Environment variables are not set with value UTF-8:LC_ALL,LANG, and NLS_LANG
    Resolution
    Set following system environment variables: LC_ALL,LANG, and NLS_LANG with value UTF-8. For example, LC_ALL=EN_US.UTF-8

  • An error has occurred during the execution of the JSPM_MAIN phase.

    Hi,
    When I run the go.bat for running SLD, I am getting the following exception.
    An error has occurred during the execution of the JSPM_MAIN phase.
    Cannot initialize application data. Could not determine profile parameters. Error while retrieving value j2ee/dbhost,j2ee/dbname,j2ee/dbtype, with retriever com.sap.sdt.tools.sysinfo.ProfileDataRetriever. Could not extract value with key j2ee/dbhost,j2ee/dbname,j2ee/dbtype, from file D:/usr/sap/CE1/SYS/profile/DEFAULT.PFL. A possible reason could be that the path to the directory containing the sappfpar executable is not included in the PATH environment variable. Could not start process sappfpar. Error while executing process sappfpar. java.io.IOException: CreateProcess: sappfpar all pf=D:/usr/sap/CE1/SYS/profile/DEFAULT.PFL error=2
    You can find more information in the log file D:\usr\sap\CE1\J01\j2ee\JSPM\log\log_2007_07_11_18_49_45\JSPM_MAIN_1_01.LOG.
    Use the information provided to troubleshoot the problem. An SAP Note may provide a solution to this problem. Search for SAP Notes with the following key words:
    com.sap.sdt.jspm.phases.PhaseTypeJSPM
    com.sap.sdt.jspm.gui.JspmUiException
    Cannot initialize application data.
    JSPM_MAIN
    JSPMPhases
    NetWeaver Upgrade
    SAPJup
    Java Upgrade
    Any inputs regarding this highly appreciated.
    Thanks
    Siva

    You can look at the following link, it may help
    https://www.sdn.sap.com/irj/sdn/directforumsearch?userid=3474257&rankby=10001&start=90

  • N unhandled exception occurred during the execution of the current web request. Please review the stack trace for more information about the error and where it originated in the code.

    some one can help me please
    i have no idea what i must to do.
    an unhandled exception occurred during the execution of the current web request. Please review the stack trace for more information about the error and where it originated in the code.

    The Exception Handler gave all the info that you need. No need to print the whole stack trace.
    The exception handler says
    Exception Details: java.lang.IllegalArgumentException
    TABLE1.NAME
    Look in the session bean (assuming that is where your underlying rowset is). Look in the _init() method for statements similar to the following:
    personRowSet.setCommand("SELECT * FROM TRAVEL.PERSON");
    personRowSet.setTableName("PERSON");
    What do you have?

  • ORA-04052: Error occurs when execute the block

    I'm trying to run one block and his query definition uses an active public database link. When I ran the script to block I get the following message:
    ERROR in line 1:
    ORA-04052: error occurred when looking up remote object
    SQ_DSV.temp_tipo_contr@SQ_DSV tc
    ORA-00604: error occurred at recursive SQL level 1
    But when I execute his definition query all is ok, the query works fine.
    I mean, I'm using the following sentence to block:
    declare
    Cursor Tipo_Contr is
    Select tc.rec_id, tc.tipo_contr from SQ_DSV.temp_tipo_contr@SQ_DSV tc;
    begin
    For Reg_Tipo_Contr in Tipo_Contr Loop
    Begin
    Update recursos Set tpcontr_id = Reg_Tipo_Contr.tipo_contr
    where rec_id = Reg_Tipo_Contr.rec_id;
    exception when others then
    dbms_output.put_line(Reg_Tipo_Contr.rec_id || ' Not find');
    end;
    end loop;
    -- Commit;
    end;
    I checked for the GLOBAL_NAMES parameter and it is set to FALSE. Please help me, How can I fix this problem ?
    I'm using Oracle8i Enterprise Edition Release 8.1.7.0.0 - Production running over Win XP for run block.
    Thanks you, Paulo.

    ORA-04052 error occurred when looking up remote object stringstringstringstringstring
    Cause: An error has occurred when trying to look up a remote object.
    Action: Fix the error. Make sure the remote database system has run KGLR.SQL to create necessary views used for querying/looking up objects stored in the database.
    Regards
    Marcio Paiva

Maybe you are looking for