Pre-requisite check for client deletion.

Dear Experts,
We need to delete a client(Customizing client) from our Production system, this client is an additional one apart from our Productive client.
Could anybody please enumerate the pre-requisite checks necessary to carry out before going ahead with deleting the client using SCC5. Any Rfc's to be taken care off, logical systems etc.
Thanks in advance

Hi,
  In addition to what Sunny said, Please check the below links as well in case if you would have not gone through them:.
http://help.sap.com/printdocu/core/Print46c/en/data/pdf/BCCTS/BCCTS.pdf
http://help.sap.com/saphelp_46c/helpdata/en/2e/d9530294f911d283d40000e829fbbd/content.htm
http://help.sap.com/printdocu/core/Print46c/en/data/pdf/BCRRR/BCRRRSAA.pdf
Thanks

Similar Messages

  • Failing all pre-requisite checks for 11.2.0.2.0 RAC on HP-UX Itanium 64

    Hi Guys,
    For Typical OR Advanced Grid Installation (GUI), all pre-requisites are failing on both nodes, like memory, swap, node reachability, groups, user & lot more.....
    But when I try to check Pre-requisite from command line, everything seems to be ok.
    This is what the output...
    $ ./runcluvfy.sh stage -pre crsinst -n sph1erp,sph2erp -fixup -verbose
    Performing pre-checks for cluster services setup
    Checking node reachability...
    Check: Node reachability from node "sph1erp"
    Destination Node Reachable?
    sph1erp yes
    sph2erp yes
    Result: Node reachability check passed from node "sph1erp"
    Checking user equivalence...
    Check: User equivalence for user "oracle"
    Node Name Comment
    sph2erp passed
    sph1erp passed
    Result: User equivalence check passed for user "oracle"
    Checking node connectivity...
    Checking hosts config file...
    Node Name Status Comment
    sph2erp passed
    sph1erp passed
    Verification of the hosts config file successful
    Interface information for node "sph2erp"
    Name IP Address Subnet Gateway Def. Gateway HW Address MTU
    lan2 10.10.16.51 10.10.16.48 10.10.16.51 10.10.1.12 78:AC:C0:8A:07:76 1500
    lan900 10.10.1.174 10.10.0.0 10.10.1.174 10.10.1.12 78:AC:C0:8A:07:6E 1500
    Interface information for node "sph1erp"
    Name IP Address Subnet Gateway Def. Gateway HW Address MTU
    lan2 10.10.16.50 10.10.16.48 10.10.16.50 10.10.1.12 3C:4A:92:48:71:BE 1500
    lan900 10.10.1.173 10.10.0.0 10.10.1.173 10.10.1.12 3C:4A:92:48:71:B6 1500
    Check: Node connectivity of subnet "10.10.16.48"
    Source Destination Connected?
    sph2erp[10.10.16.51] sph1erp[10.10.16.50] yes
    Result: Node connectivity passed for subnet "10.10.16.48" with node(s) sph2erp,sph1erp
    Check: TCP connectivity of subnet "10.10.16.48"
    Source Destination Connected?
    sph1erp:10.10.16.50 sph2erp:10.10.16.51 passed
    Result: TCP connectivity check passed for subnet "10.10.16.48"
    Check: Node connectivity of subnet "10.10.0.0"
    Source Destination Connected?
    sph2erp[10.10.1.174] sph1erp[10.10.1.173] yes
    Result: Node connectivity passed for subnet "10.10.0.0" with node(s) sph2erp,sph1erp
    Check: TCP connectivity of subnet "10.10.0.0"
    Source Destination Connected?
    sph1erp:10.10.1.173 sph2erp:10.10.1.174 passed
    Result: TCP connectivity check passed for subnet "10.10.0.0"
    Interfaces found on subnet "10.10.0.0" that are likely candidates for VIP are:
    sph2erp lan900:10.10.1.174
    sph1erp lan900:10.10.1.173
    Interfaces found on subnet "10.10.16.48" that are likely candidates for a private interconnect are:
    sph2erp lan2:10.10.16.51
    sph1erp lan2:10.10.16.50
    Result: Node connectivity check passed
    Check: Total memory
    Node Name Available Required Comment
    sph2erp 63.9GB (6.7004024E7KB) 4GB (4194304.0KB) passed
    sph1erp 63.9GB (6.7004024E7KB) 4GB (4194304.0KB) passed
    Result: Total memory check passed
    Check: Available memory
    Node Name Available Required Comment
    sph2erp 53.3556GB (5.5947372E7KB) 50MB (51200.0KB) passed
    sph1erp 52.2323GB (5.47695E7KB) 50MB (51200.0KB) passed
    Result: Available memory check passed
    Check: Swap space
    Node Name Available Required Comment
    sph2erp 188.7773GB (1.97947352E8KB) 4GB (4194304.0KB) passed
    sph1erp 188.7773GB (1.97947352E8KB) 4GB (4194304.0KB) passed
    Result: Swap space check passed
    Check: Free disk space for "sph2erp:/var/tmp/"
    Path Node Name Mount point Available Required Comment
    /var/tmp/ sph2erp /var 13.8074GB 1GB passed
    Result: Free disk space check passed for "sph2erp:/var/tmp/"
    Check: Free disk space for "sph1erp:/var/tmp/"
    Path Node Name Mount point Available Required Comment
    /var/tmp/ sph1erp /var 13.8158GB 1GB passed
    Result: Free disk space check passed for "sph1erp:/var/tmp/"
    Check: User existence for "oracle"
    Node Name Status Comment
    sph2erp exists(199) passed
    sph1erp exists(199) passed
    Checking for multiple users with UID value 199
    Result: Check for multiple users with UID value 199 passed
    Result: User existence check passed for "oracle"
    Check: Group existence for "oinstall"
    Node Name Status Comment
    sph2erp exists passed
    sph1erp exists passed
    Result: Group existence check passed for "oinstall"
    Check: Group existence for "dba"
    Node Name Status Comment
    sph2erp exists passed
    sph1erp exists passed
    Result: Group existence check passed for "dba"
    Check: Membership of user "oracle" in group "oinstall" [as Primary]
    Node Name User Exists Group Exists User in Group Primary Comment
    sph2erp yes yes yes yes passed
    sph1erp yes yes yes yes passed
    Result: Membership check for user "oracle" in group "oinstall" [as Primary] passed
    Check: Membership of user "oracle" in group "dba"
    Node Name User Exists Group Exists User in Group Comment
    sph2erp yes yes yes passed
    sph1erp yes yes yes passed
    Result: Membership check for user "oracle" in group "dba" passed
    Check: Run level
    Node Name run level Required Comment
    sph2erp 3 3 passed
    sph1erp 3 3 passed
    Result: Run level check passed
    Check: Hard limits for "maximum open file descriptors"
    Node Name Type Available Required Comment
    sph2erp hard 63488 63488 passed
    sph1erp hard 63488 63488 passed
    Result: Hard limits check passed for "maximum open file descriptors"
    Check: Soft limits for "maximum open file descriptors"
    Node Name Type Available Required Comment
    sph2erp soft 1024 1024 passed
    sph1erp soft 63488 1024 passed
    Result: Soft limits check passed for "maximum open file descriptors"
    Check: Hard limits for "maximum user processes"
    Node Name Type Available Required Comment
    sph2erp hard 3687 3686 passed
    sph1erp hard 3687 3686 passed
    Result: Hard limits check passed for "maximum user processes"
    Check: Soft limits for "maximum user processes"
    Node Name Type Available Required Comment
    sph2erp soft 3687 2047 passed
    sph1erp soft 3687 2047 passed
    Result: Soft limits check passed for "maximum user processes"
    Check: System architecture
    Node Name Available Required Comment
    sph2erp ia64 ia64 passed
    sph1erp ia64 ia64 passed
    Result: System architecture check passed
    Check: Kernel version
    Node Name Available Required Comment
    sph2erp HP-UX B.11.31 B.11.31 passed
    sph1erp HP-UX B.11.31 B.11.31 passed
    Result: Kernel version check passed
    Check: Kernel parameter for "ksi_alloc_max"
    Node Name Configured Required Comment
    sph2erp 32768 32768 passed
    sph1erp 32768 32768 passed
    Result: Kernel parameter check passed for "ksi_alloc_max"
    Check: Kernel parameter for "executable_stack"
    Node Name Configured Required Comment
    sph2erp 0 0 passed
    sph1erp 0 0 passed
    Result: Kernel parameter check passed for "executable_stack"
    Check: Kernel parameter for "max_thread_proc"
    Node Name Configured Required Comment
    sph2erp 1024 1024 passed
    sph1erp 1024 1024 passed
    Result: Kernel parameter check passed for "max_thread_proc"
    Check: Kernel parameter for "maxdsiz"
    Node Name Configured Required Comment
    sph2erp 1073741824 1073741824 passed
    sph1erp 1073741824 1073741824 passed
    Result: Kernel parameter check passed for "maxdsiz"
    Check: Kernel parameter for "maxdsiz_64bit"
    Node Name Configured Required Comment
    sph2erp 2147483648 2147483648 passed
    sph1erp 2147483648 2147483648 passed
    Result: Kernel parameter check passed for "maxdsiz_64bit"
    Check: Kernel parameter for "maxssiz"
    Node Name Configured Required Comment
    sph2erp 134217728 134217728 passed
    sph1erp 134217728 134217728 passed
    Result: Kernel parameter check passed for "maxssiz"
    Check: Kernel parameter for "maxssiz_64bit"
    Node Name Configured Required Comment
    sph2erp 1073741824 1073741824 passed
    sph1erp 1073741824 1073741824 passed
    Result: Kernel parameter check passed for "maxssiz_64bit"
    Check: Kernel parameter for "maxuprc"
    Node Name Configured Required Comment
    sph2erp 3686 3686 passed
    sph1erp 3686 3686 passed
    Result: Kernel parameter check passed for "maxuprc"
    Check: Kernel parameter for "msgmni"
    Node Name Configured Required Comment
    sph2erp 4096 4096 passed
    sph1erp 4096 4096 passed
    Result: Kernel parameter check passed for "msgmni"
    Check: Kernel parameter for "msgtql"
    Node Name Configured Required Comment
    sph2erp 4096 4096 passed
    sph1erp 4096 4096 passed
    Result: Kernel parameter check passed for "msgtql"
    Check: Kernel parameter for "ncsize"
    Node Name Configured Required Comment
    sph2erp 35840 35840 passed
    sph1erp 35840 35840 passed
    Result: Kernel parameter check passed for "ncsize"
    Check: Kernel parameter for "shmmax"
    Node Name Configured Required Comment
    sph2erp 1073741824 1073741824 passed
    sph1erp 1073741824 1073741824 passed
    Result: Kernel parameter check passed for "shmmax"
    Check: Kernel parameter for "shmmni"
    Node Name Configured Required Comment
    sph2erp 4096 4096 passed
    sph1erp 4096 4096 passed
    Result: Kernel parameter check passed for "shmmni"
    Check: Kernel parameter for "shmseg"
    Node Name Configured Required Comment
    sph2erp 512 512 passed
    sph1erp 512 512 passed
    Result: Kernel parameter check passed for "shmseg"
    Check: Kernel parameter for "tcp_smallest_anon_port"
    Node Name Configured Required Comment
    sph2erp 9000 9000 passed
    sph1erp 9000 9000 passed
    Result: Kernel parameter check passed for "tcp_smallest_anon_port"
    Check: Kernel parameter for "tcp_largest_anon_port"
    Node Name Configured Required Comment
    sph2erp 65500 65500 passed
    sph1erp 65500 65500 passed
    Result: Kernel parameter check passed for "tcp_largest_anon_port"
    Check: Kernel parameter for "udp_smallest_anon_port"
    Node Name Configured Required Comment
    sph2erp 9000 9000 passed
    sph1erp 9000 9000 passed
    Result: Kernel parameter check passed for "udp_smallest_anon_port"
    Check: Kernel parameter for "udp_largest_anon_port"
    Node Name Configured Required Comment
    sph2erp 65500 65500 passed
    sph1erp 65500 65500 passed
    Result: Kernel parameter check passed for "udp_largest_anon_port"
    Check: Package existence for "OS-Core-B.11.31( ia64)"
    Node Name Available Required Comment
    sph2erp OS-Core-B.11.31-0 OS-Core-B.11.31( ia64) passed
    sph1erp OS-Core-B.11.31-0 OS-Core-B.11.31( ia64) passed
    Result: Package existence check passed for "OS-Core-B.11.31( ia64)"
    Check: Operating system patch for "Patch PHKL_38938"
    Node Name Applied Required Comment
    sph2erp Patch PHKL_39646 Patch PHKL_38938 passed
    sph1erp Patch PHKL_39646 Patch PHKL_38938 passed
    Result: Operating system patch check passed for "Patch PHKL_38938"
    Check: Operating system patch for "Patch PHKL_39351"
    Node Name Applied Required Comment
    sph2erp Patch PHKL_40207 Patch PHKL_39351 passed
    sph1erp Patch PHKL_40207 Patch PHKL_39351 passed
    Result: Operating system patch check passed for "Patch PHKL_39351"
    Check: Operating system patch for "Patch PHSS_36354"
    Node Name Applied Required Comment
    sph2erp Patch PHSS_40546 Patch PHSS_36354 passed
    sph1erp Patch PHSS_40546 Patch PHSS_36354 passed
    Result: Operating system patch check passed for "Patch PHSS_36354"
    Check: Operating system patch for "Patch PHSS_37042"
    Node Name Applied Required Comment
    sph2erp Patch PHSS_37042 Patch PHSS_37042 passed
    sph1erp Patch PHSS_37042 Patch PHSS_37042 passed
    Result: Operating system patch check passed for "Patch PHSS_37042"
    Check: Operating system patch for "Patch PHSS_37959"
    Node Name Applied Required Comment
    sph2erp Patch PHSS_40804 Patch PHSS_37959 passed
    sph1erp Patch PHSS_40804 Patch PHSS_37959 passed
    Result: Operating system patch check passed for "Patch PHSS_37959"
    Check: Operating system patch for "Patch PHSS_39094"
    Node Name Applied Required Comment
    sph2erp Patch PHSS_40538 Patch PHSS_39094 passed
    sph1erp Patch PHSS_40538 Patch PHSS_39094 passed
    Result: Operating system patch check passed for "Patch PHSS_39094"
    Check: Operating system patch for "Patch PHSS_39100"
    Node Name Applied Required Comment
    sph2erp Patch PHSS_40540 Patch PHSS_39100 passed
    sph1erp Patch PHSS_40540 Patch PHSS_39100 passed
    Result: Operating system patch check passed for "Patch PHSS_39100"
    Check: Operating system patch for "Patch PHSS_39102"
    Node Name Applied Required Comment
    sph2erp Patch PHSS_41496 Patch PHSS_39102 passed
    sph1erp Patch PHSS_41496 Patch PHSS_39102 passed
    Result: Operating system patch check passed for "Patch PHSS_39102"
    Check: Operating system patch for "Patch PHSS_38141"
    Node Name Applied Required Comment
    sph2erp Patch PHSS_38141 Patch PHSS_38141 passed
    sph1erp Patch PHSS_38141 Patch PHSS_38141 passed
    Result: Operating system patch check passed for "Patch PHSS_38141"
    Check: Operating system patch for "Patch PHCO_40381"
    Node Name Applied Required Comment
    sph2erp Patch PHCO_40381 Patch PHCO_40381 passed
    sph1erp Patch PHCO_40381 Patch PHCO_40381 passed
    Result: Operating system patch check passed for "Patch PHCO_40381"
    Check: Operating system patch for "Patch PHKL_38038"
    Node Name Applied Required Comment
    sph2erp Patch PHKL_41005 Patch PHKL_38038 passed
    sph1erp Patch PHKL_41005 Patch PHKL_38038 passed
    Result: Operating system patch check passed for "Patch PHKL_38038"
    Checking for multiple users with UID value 0
    Result: Check for multiple users with UID value 0 passed
    Check: Current group ID
    Result: Current group ID check passed
    Starting Clock synchronization checks using Network Time Protocol(NTP)...
    NTP Configuration file check started...
    Network Time Protocol(NTP) configuration file not found on any of the nodes. Oracle Cluster Time Synchronization Service(CTSS) can be used instead of NTP for time synchronization on the cluster nodes
    No NTP Daemons or Services were found to be running
    Result: Clock synchronization check using Network Time Protocol(NTP) passed
    Checking Core file name pattern consistency...
    Core file name pattern consistency check passed.
    Checking to make sure user "oracle" is not in "root" group
    Node Name Status Comment
    sph2erp does not exist passed
    sph1erp does not exist passed
    Result: User "oracle" is not part of "root" group. Check passed
    Check default user file creation mask
    Node Name Available Required Comment
    sph2erp 022 0022 passed
    sph1erp 022 0022 passed
    Result: Default user file creation mask check passed
    Checking consistency of file "/etc/resolv.conf" across nodes
    Node Name Status
    sph2erp passed
    sph1erp passed
    The DNS response time for an unreachable node is within acceptable limit on all nodes
    File "/etc/resolv.conf" is consistent across nodes
    Check: Time zone consistency
    Result: Time zone consistency check passed
    Checking settings of device file "/dev/async"
    Node Name Available Comment
    sph2erp yes failed (incorrect setting for minor number.)
    sph1erp yes failed (incorrect setting for minor number.)
    Result: Check for settings of device file "/dev/async" failed.
    Starting check for The SSH LoginGraceTime setting ...
    WARNING:
    PRVE-0038 : The SSH LoginGraceTime setting on node "sph2erp" may result in users being disconnected before login is completed
    PRVE-0038 : The SSH LoginGraceTime setting on node "sph1erp" may result in users being disconnected before login is completed
    Check for The SSH LoginGraceTime setting passed
    Fixup information has been generated for following node(s):
    sph2erp,sph1erp
    Please run the following script on each node as "root" user to execute the fixups:
    '/tmp/CVU_11.2.0.2.0_oracle/runfixup.sh'
    Pre-check for cluster services setup was unsuccessful on all the nodes.
    What could be the issue ????
    Any help would be appreciated...
    Regards,
    Manish

    Started with Grid Installation. Copying Software to remote node & linking libraries were successfully without any issue (upto 76%). But got issue while executing root.sh on Node1
    sph1erp:/oracle/11.2.0/grid #sh root.sh
    Running Oracle 11g root script...
    The following environment variables are set as:
    ORACLE_OWNER= oracle
    ORACLE_HOME= /oracle/11.2.0/grid
    Enter the full pathname of the local bin directory: [usr/local/bin]:
    Copying dbhome to /usr/local/bin ...
    Copying oraenv to /usr/local/bin ...
    Copying coraenv to /usr/local/bin ...
    Creating /etc/oratab file...
    Entries will be added to the /etc/oratab file as needed by
    Database Configuration Assistant when a database is created
    Finished running generic part of root script.
    Now product-specific root actions will be performed.
    Using configuration parameter file: /oracle/11.2.0/grid/crs/install/crsconfig_params
    Creating trace directory
    LOCAL ADD MODE
    Creating OCR keys for user 'root', privgrp 'sys'..
    Operation successful.
    OLR initialization - successful
    root wallet
    root wallet cert
    root cert export
    peer wallet
    profile reader wallet
    pa wallet
    peer wallet keys
    pa wallet keys
    peer cert request
    pa cert request
    peer cert
    pa cert
    peer root cert TP
    profile reader root cert TP
    pa root cert TP
    peer pa cert TP
    pa peer cert TP
    profile reader pa cert TP
    profile reader peer cert TP
    peer user cert
    pa user cert
    Adding daemon to inittab
    CRS-2672: Attempting to start 'ora.mdnsd' on 'sph1erp'
    CRS-2676: Start of 'ora.mdnsd' on 'sph1erp' succeeded
    CRS-2672: Attempting to start 'ora.gpnpd' on 'sph1erp'
    CRS-2676: Start of 'ora.gpnpd' on 'sph1erp' succeeded
    CRS-2672: Attempting to start 'ora.cssdmonitor' on 'sph1erp'
    CRS-2672: Attempting to start 'ora.gipcd' on 'sph1erp'
    CRS-2676: Start of 'ora.gipcd' on 'sph1erp' succeeded
    CRS-2676: Start of 'ora.cssdmonitor' on 'sph1erp' succeeded
    CRS-2672: Attempting to start 'ora.cssd' on 'sph1erp'
    CRS-2672: Attempting to start 'ora.diskmon' on 'sph1erp'
    CRS-2676: Start of 'ora.diskmon' on 'sph1erp' succeeded
    CRS-2676: Start of 'ora.cssd' on 'sph1erp' succeeded
    ASM created and started successfully.
    Disk Group OCRVOTE created successfully.
    clscfg: -install mode specified
    Successfully accumulated necessary OCR keys.
    Creating OCR keys for user 'root', privgrp 'sys'..
    Operation successful.
    CRS-4256: Updating the profile
    Successful addition of voting disk ab847ed2b4f04f2dbfb875226d2bb194.
    Successful addition of voting disk 85c05a5b30384f8dbff48cc069de7a7c.
    Successful addition of voting disk 649196fbdd614f9cbf26a9a0e6670a6e.
    Successful addition of voting disk 8815dfcee2e64f64bf00b9c76626ab41.
    Successful addition of voting disk 8ce55fe5534f4f77bfa9f54187592707.
    Successfully replaced voting disk group with +OCRVOTE.
    CRS-4256: Updating the profile
    CRS-4266: Voting file(s) successfully replaced
    ## STATE File Universal Id File Name Disk group
    1. ONLINE ab847ed2b4f04f2dbfb875226d2bb194 (/dev/oracle/ocrvote1) [OCRVOTE]
    2. ONLINE 85c05a5b30384f8dbff48cc069de7a7c (/dev/oracle/ocrvote2) [OCRVOTE]
    3. ONLINE 649196fbdd614f9cbf26a9a0e6670a6e (/dev/oracle/ocrvote3) [OCRVOTE]
    4. ONLINE 8815dfcee2e64f64bf00b9c76626ab41 (/dev/oracle/ocrvote4) [OCRVOTE]
    5. ONLINE 8ce55fe5534f4f77bfa9f54187592707 (/dev/oracle/ocrvote5) [OCRVOTE]
    Located 5 voting disk(s).
    Start of resource "ora.cluster_interconnect.haip" failed
    CRS-2672: Attempting to start 'ora.cluster_interconnect.haip' on 'sph1erp'
    CRS-5017: The resource action "ora.cluster_interconnect.haip start" encountered the following error:
    Start action for HAIP aborted
    CRS-2674: Start of 'ora.cluster_interconnect.haip' on 'sph1erp' failed
    CRS-2679: Attempting to clean 'ora.cluster_interconnect.haip' on 'sph1erp'
    CRS-2681: Clean of 'ora.cluster_interconnect.haip' on 'sph1erp' succeeded
    CRS-4000: Command Start failed, or completed with errors.
    Failed to start Oracle Clusterware stack
    Failed to start High Availability IP at /oracle/11.2.0/grid/crs/install/crsconfig_lib.pm line 1046.
    /oracle/11.2.0/grid/perl/bin/perl -I/oracle/11.2.0/grid/perl/lib -I/oracle/11.2.0/grid/crs/install /oracle/11.2.0/grid/crs/install/rootcrs.pl execution failed
    sph1erp:/oracle/11.2.0/grid #
    Last few lines from CRS Log for node 1, where error came
    [ctssd(6467)]CRS-2401:The Cluster Time Synchronization Service started on host sph1erp.
    2011-02-25 23:04:16.491
    [oracle/11.2.0/grid/bin/orarootagent.bin(6423)]CRS-5818:Aborted command 'start for resource: ora.cluster_interconnect.haip 1 1' for resource 'ora.cluster_int
    erconnect.haip'. Details at (:CRSAGF00113:) {0:0:178} in */oracle/11.2.0/grid/log/sph1erp/agent/ohasd/orarootagent_root/orarootagent_root.log.*
    2011-02-25 23:04:20.521
    [ohasd(5513)]CRS-2757:Command 'Start' timed out waiting for response from the resource 'ora.cluster_interconnect.haip'. Details at (:CRSPE00111:) {0:0:178} in
    */oracle/11.2.0/grid/log/sph1erp/ohasd/ohasd.log.*
    Few lines from */oracle/11.2.0/grid/log/sph1erp/agent/ohasd/orarootagent_root/orarootagent_root.log.*
    =====================================================================================================
    2011-02-25 23:04:16.823: [ USRTHRD][16] {0:0:178} Starting Probe for ip 169.254.74.54
    2011-02-25 23:04:16.823: [ USRTHRD][16] {0:0:178} Transitioning to Probe State
    2011-02-25 23:04:17.177: [ USRTHRD][15] {0:0:178} [NetHAMain] thread stopping
    2011-02-25 23:04:17.177: [ USRTHRD][15] {0:0:178} Thread:[NetHAMain]isRunning is reset to false here
    2011-02-25 23:04:17.178: [ USRTHRD][12] {0:0:178} Thread:[NetHAMain]stop }
    2011-02-25 23:04:17.178: [ USRTHRD][12] {0:0:178} thread cleaning up
    2011-02-25 23:04:17.178: [ USRTHRD][12] {0:0:178} pausing thread
    2011-02-25 23:04:17.178: [ USRTHRD][12] {0:0:178} posting thread
    2011-02-25 23:04:17.178: [ USRTHRD][12] {0:0:178} Thread:[NetHAWork]stop {
    2011-02-25 23:04:17.645: [ USRTHRD][16] {0:0:178} [NetHAWork] thread stopping
    2011-02-25 23:04:17.645: [ USRTHRD][16] {0:0:178} Thread:[NetHAWork]isRunning is reset to false here
    2011-02-25 23:04:17.645: [ USRTHRD][12] {0:0:178} Thread:[NetHAWork]stop }
    2011-02-25 23:04:17.645: [ USRTHRD][12] {0:0:178} Thread:[NetHAWork]stop {
    2011-02-25 23:04:17.645: [ USRTHRD][12] {0:0:178} Thread:[NetHAWork]stop }
    2011-02-25 23:04:17.891: [ora.cluster_interconnect.haip][12] {0:0:178} [start] Start of HAIP aborted
    2011-02-25 23:04:17.892: [   AGENT][12] {0:0:178} UserErrorException: Locale is
    2011-02-25 23:04:17.893: [ora.cluster_interconnect.haip][12] {0:0:178} [start] clsnUtils::error Exception type=2 string=
    CRS-5017: The resource action "ora.cluster_interconnect.haip start" encountered the following error:
    Start action for HAIP aborted
    2011-02-25 23:04:17.893: [    AGFW][12] {0:0:178} sending status msg [CRS-5017: The resource action "ora.cluster_interconnect.haip start" encountered the foll
    owing error:
    Start action for HAIP aborted
    ] for start for resource: ora.cluster_interconnect.haip 1 1
    2011-02-25 23:04:17.893: [ora.cluster_interconnect.haip][12] {0:0:178} [start] clsn_agent::start }
    2011-02-25 23:04:17.894: [    AGFW][10] {0:0:178} Agent sending reply for: RESOURCE_START[ora.cluster_interconnect.haip 1 1] ID 4098:661
    2011-02-25 23:04:18.552: [ora.diskmon][12] {0:0:154} [check] DiskmonAgent::check {
    2011-02-25 23:04:18.552: [ora.diskmon][12] {0:0:154} [check] DiskmonAgent::check } - 0
    2011-02-25 23:04:19.573: [    AGFW][10] {0:0:154} Agent received the message: AGENT_HB[Engine] ID 12293:669
    2011-02-25 23:04:20.510: [ora.cluster_interconnect.haip][18] {0:0:178} [start] got lock
    2011-02-25 23:04:20.511: [ora.cluster_interconnect.haip][18] {0:0:178} [start] tryActionLock }
    2011-02-25 23:04:20.511: [ora.cluster_interconnect.haip][18] {0:0:178} [start] abort }
    2011-02-25 23:04:20.511: [ora.cluster_interconnect.haip][18] {0:0:178} [start] clsn_agent::abort }
    2011-02-25 23:04:20.511: [    AGFW][18] {0:0:178} Command: start for resource: ora.cluster_interconnect.haip 1 1 completed with status: TIMEDOUT
    2011-02-25 23:04:20.512: [ora.cluster_interconnect.haip][8] {0:0:178} [check] NetworkAgent::init enter {
    2011-02-25 23:04:20.513: [ora.cluster_interconnect.haip][8] {0:0:178} [check] NetworkAgent::init exit }
    2011-02-25 23:04:20.517: [    AGFW][10] {0:0:178} Agent sending reply for: RESOURCE_START[ora.cluster_interconnect.haip 1 1] ID 4098:661
    2011-02-25 23:04:20.519: [ USRTHRD][8] {0:0:178} Ocr Context init default level 23886304
    2011-02-25 23:04:20.519: [ default][8]clsvactversion:4: Retrieving Active Version from local storage.
    [   CLWAL][8]clsw_Initialize: OLR initlevel [70000]
    Few lines from */oracle/11.2.0/grid/log/sph1erp/ohasd/ohasd.log.*
    =====================================================================================================
    2011-02-25 23:04:21.627: [UiServer][30] {0:0:180} Done for ctx=6000000002604ce0
    2011-02-25 23:04:21.642: [UiServer][31] Closed: remote end failed/disc.
    2011-02-25 23:04:26.139: [ CLSINET][33]Returning NETDATA: 1 interfaces
    2011-02-25 23:04:26.139: [ CLSINET][33]# 0 Interface 'lan2',ip='10.10.16.50',mac='3c-4a-92-48-71-be',mask='255.255.255.240',net='10.10.16.48',use='cluster_int
    erconnect'
    2011-02-25 23:04:26.973: [UiServer][31] CS(60000000014b0790)set Properties ( root,60000000012e0260)
    2011-02-25 23:04:26.973: [UiServer][31] SS(6000000001372270)Accepted client connection: saddr =(ADDRESS=(PROTOCOL=ipc)(DEV=92)(KEY=OHASD_UI_SOCKET))daddr = (A
    DDRESS=(PROTOCOL=ipc)(KEY=OHASD_UI_SOCKET))
    2011-02-25 23:04:26.992: [UiServer][30] {0:0:181} processMessage called
    2011-02-25 23:04:26.993: [UiServer][30] {0:0:181} Sending message to PE. ctx= 6000000001b440f0
    2011-02-25 23:04:26.993: [UiServer][30] {0:0:181} Sending command to PE: 67
    2011-02-25 23:04:26.994: [   CRSPE][29] {0:0:181} Processing PE command id=173. Description: [Stat Resource : 600000000135f760]
    2011-02-25 23:04:26.997: [UiServer][30] {0:0:181} Done for ctx=6000000001b440f0
    2011-02-25 23:04:27.012: [UiServer][31] Closed: remote end failed/disc.
    2011-02-25 23:04:31.135: [ CLSINET][33]Returning NETDATA: 1 interfaces
    2011-02-25 23:04:31.135: [ CLSINET][33]# 0 Interface 'lan2',ip='10.10.16.50',mac='3c-4a-92-48-71-be',mask='255.255.255.240',net='10.10.16.48',use='cluster_int
    erconnect'
    2011-02-25 23:04:32.318: [UiServer][31] CS(60000000014b0790)set Properties ( root,60000000012e0260)
    2011-02-25 23:04:32.318: [UiServer][31] SS(6000000001372270)Accepted client connection: saddr =(ADDRESS=(PROTOCOL=ipc)(DEV=92)(KEY=OHASD_UI_SOCKET))daddr = (A
    DDRESS=(PROTOCOL=ipc)(KEY=OHASD_UI_SOCKET))
    2011-02-25 23:04:32.332: [UiServer][30] {0:0:182} processMessage called
    2011-02-25 23:04:32.333: [UiServer][30] {0:0:182} Sending message to PE. ctx= 6000000001b45ef0
    2011-02-25 23:04:32.333: [UiServer][30] {0:0:182} Sending command to PE: 68
    2011-02-25 23:04:32.334: [   CRSPE][29] {0:0:182} Processing PE command id=174. Description: [Stat Resource : 600000000135f760]
    2011-02-25 23:04:32.338: [UiServer][30] {0:0:182} Done for ctx=6000000001b45ef0
    2011-02-25 23:04:32.352: [UiServer][31] Closed: remote end failed/disc.
    2011-02-25 23:04:36.155: [ CLSINET][33]Returning NETDATA: 1 interfaces
    2011-02-25 23:04:36.155: [ CLSINET][33]# 0 Interface 'lan2',ip='10.10.16.50',mac='3c-4a-92-48-71-be',mask='255.255.255.240',net='10.10.16.48',use='cluster_int
    erconnect'
    2011-02-25 23:04:37.683: [UiServer][31] CS(60000000014b0790)set Properties ( root,60000000012e0260)
    2011-02-25 23:04:37.683: [UiServer][31] SS(6000000001372270)Accepted client connection: saddr =(ADDRESS=(PROTOCOL=ipc)(DEV=92)(KEY=OHASD_UI_SOCKET))daddr = (A
    DDRESS=(PROTOCOL=ipc)(KEY=OHASD_UI_SOCKET))
    2011-02-25 23:04:37.702: [UiServer][30] {0:0:183} processMessage called
    2011-02-25 23:04:37.703: [UiServer][30] {0:0:183} Sending message to PE. ctx= 6000000002604ce0
    2011-02-25 23:04:37.703: [UiServer][30] {0:0:183} Sending command to PE: 69
    2011-02-25 23:04:37.704: [   CRSPE][29] {0:0:183} Processing PE command id=175. Description: [Stat Resource : 600000000135f760]
    2011-02-25 23:04:37.708: [UiServer][30] {0:0:183} Done for ctx=6000000002604ce0
    2011-02-25 23:04:37.722: [UiServer][31] Closed: remote end failed/disc.
    2011-02-25 23:04:41.156: [ CLSINET][33]Returning NETDATA: 1 interfaces
    2011-02-25 23:04:41.156: [ CLSINET][33]# 0 Interface 'lan2',ip='10.10.16.50',mac='3c-4a-92-48-71-be',mask='255.255.255.240',net='10.10.16.48',use='cluster_int
    erconnect'
    What could be the issue ????
    Experts Please help me. Doing setup for the PRoduction Env...
    Do response ASAP...... Thanks
    Regards,
    Manish

  • Failing PATH pre-requisite check installing 11g client

    Greetings -
    I'm trying to install the 32bit oracle 11g database client on Win 7 Professional x64. I'm stuck with this error when the installer gets to the "Perform Prerequisite Checks" step:
    Environment variable: "PATH" - This test checks whether the length of the environment variable "PATH" does not exceed the recommended length.
    Details:
    -      PRVF-3919 : Failed to retrieve value of environment variable "PATH"
    - Cause: Environment variable value could not be determined.
    - Action: Check user equivalence and whether the user has administrative privileges on the node.
    Google tells me this might be related to an excessive PATH environment variable length, so I made multiple repetitions of "clean some crap out and try to install again" with no effect. Currently it is set to:
    C:\>path
    PATH=C:\Windows\system32;C:\Windows;
    And the installer still fails.
    I've tried explicitly running the installer via "Run as Administrator" and as a regular user (who is in the Administrators group). No change either way.
    Someone on my team suggested making sure the installation target path has no spaces in it. I'm keeping the default path suggested by the installer, which is
    D:\app\ladams\product\11.2.0\client_1
    where ladams is my Windows user name. I did some experimentation here, changing the install path to things like "D:\oracle" and that hasn't resolved the issue.
    Interestingly, if I open the installer log, I can find this line in it near the top:
    INFO: PATH has :==>C:\Users\ladams\AppData\Local\Temp\OraInstall2013-01-28_02-19-03PM\jdk\jre\bin;C:\Windows\system32;C:\Windows;C:\Windows\system32;C:\Windows;;;.
    So it can apparently read the path at some point before the pre-requisite check, although it seems to be doubling up the contents for some reason...
    Later on in the log file, I see this:
    INFO: -----------------------------------------------
    INFO: *********************************************
    INFO: Environment variable: "PATH": This test checks whether the length of the environment variable "PATH" does not exceed the recommended length.
    INFO: Severity:CRITICAL
    INFO: OverallStatus:OPERATION_FAILED
    INFO: -----------------------------------------------
    Is there some way to work around this issue, or just skip the prerequisites check entirely? I found something on a blog via google about being able to pass a "-ignoreSysPrereqs" switch to the installer to bypass the check. When I tried that, the installer still performed it's checks, and failed with the same error, so apparently that was bad info...
    Any help would be appreciated.

    Thanks for the reply.
    I did indeed take a look at the client installation instructions here: http://docs.oracle.com/cd/E11882_01/install.112/e24282/toc.htm#BABGCIFF
    However, it appears to be out of date, or at least not applicable to my problem. Step 10 refers to an Ignore All button:
    "Note: Oracle recommends that you use caution in checking the Ignore All option. If you check this option, then Oracle Universal Installer may not confirm that your system is able to install Oracle Database successfully."
    I don't have an ignore all button. At least if there is, it's cleverly disguised. The only option I have after the check fails is "Cancel."
    Is there another section of the fine manual I should take a look at?
    Edited by: 984635 on Jan 28, 2013 6:09 PM
    Edited by: 984635 on Jan 28, 2013 6:17 PM

  • Pre-requisite checker script for EBS R12 and R12.1

    hi
    is it possible to make a pre-requisite checker script (in perl or shell) for EBS R12 and R12.1 in RHEL5 or sun OS??
    can anyone help / guide me to do so??
    rgrds

    I don't know about EBS R12, but apparently the Oracle Universal Installer can use options to just run the prerequisite checks without having to install the product.
    E.g. /runInstaller -prereqChecker or -executeSysPrereqs
    There is also a specific OTN forum available for installing E-Business suite:
    LCM: 11i Install/Upgrade

  • All 11g pre-requisites check failed on solaris 10

    During 11g R2 (64 bit) installation on Solaris 10 64 bit, all pre-requisites checks were failed.
    Like the first one given below:
    =======================
    Physical Memory - This is a prerequisite condition to test whether the system has at least 1GB (1048576.0KB) of total physical memory.
    Expected Value : n/a
    Actual Value : n/a
     List of errors:  - 
    PRVF-7531 : Physical memory check cannot be performed on node "sol11oracle-vm"  -
    Cause:  Could not perform check of physical memory on the node indicated.  -
    Action:  Ensure ability to access the node specified and view memory information.
    =======================
    It seems that oracle installer not able to resolve the name "sol11oracle-vm".
    Please suggest.

    Hi, know that its an old thread but anyway.
    Check metalink for *11GR2 INSTALL ON SOLARIS FAILS MANY PREREQUISITE CHECKS [ID 989727.1]*.
    Oracle 11gR2 software is NOT certified for:
    a.) Solaris 10 “less than update 6” with the right patches.
    b.) Solaris 10 “less than update 6” with a Solaris patch bundle.
    c.) Solaris 10 “less than update 6” with a Solaris release update
    It is only certified for a base install image of Solaris 10 update 6 or greater.

  • Pre-Requisite Check SQL Server 2012 SP2 TCP Port Enabled Error

    When doing the pre-requisite check to install SCCM (CAS) using an instance of SQL Server 2012 SP2, you get the following error even though SQL Server TCP port has been enabled, set to static port 4022 on the IP addresses in use in SQL Server Configuration
    Manager under Protocols for <SQLInstanceName>: configuration manager primary site and central administration site require sql server tcp enables and set to static port
    To resolve this issue, make sure "4022" is also set in the IPAll node in SQL Server Configuration Manager under Protocols for <SQLInstanceName> then restart the SQL Service and re-run the pre-requisite check and you should be good to go.
    To avoid SCCM SQL-related install failure, keep in mind that SCCM SQL Service Broker (SSB) (used to replicate data between database sites) is set to port 4022 by default. This is different from and cannot be same as the tcp static port set in SQL Server
    Configuration Manager under Protocols for <SQLInstanceName>. For example SSB can use its default tcp port 4022 while a static tcp port of 4023 can be set in SQL Server Configuration Manager under Protocols for <SQLInstanceName> or vice-versa. The
    SCCM SSB port number can be adjusted during SCCM installation on the Database Information page. My take it so change SSB port to 4023 and leave SQL default port at 4022 since SQL serves potentially many apps while SSB is used within/by SCCM.
    If you are getting errors relating to SQL Server service running accounts, SQL Server Collation, and/or SQL Server sysadmin rights while attempting to install a primary site, unselect the SCCM installation option to install default settings at the beginning
    of the install process.
    Also, ensure to install important updates and restart the server.

    Thank you for sharing.
    We
    are trying to better understand customer views on social support experience, so your participation in this
    interview project would be greatly appreciated if you have time.
    Thanks for helping make community forums a great place.

  • 10gR2 Install Issue: "No pre-requisite checks found in oraparam.ini"

    Hello there
    I have recently created a virtual machine under VMWare 5 with a base Windows 2000 build on it.
    When I try and load the OUI for the 10gR2 install, the command box just tells:
    "No pre-requisite checks found in oraparam.ini"
    The OUI then proceeds to install the database.
    Why am I getting this warnig? The reason I ask is that I can't install the Companion CD becasue of this. The universal installer does not work for CD2!!!
    Any help much appreciated
    Duncan

    "No pre-requisite checks found in oraparam.ini"That is normal. For the operating system you are installing it on, there are no predefined pre-requisite steps that installer needs to verify (like libraries required, versions of components, software tools required etc).

  • Oracle 10g / RH9 : No pre-requisite checks found in oraparam.ini

    Hi,
    When I was trying to run the ./runInstaller on linux9,
    it was saying
    "Starting Oracle Universal Installer...
    No pre-requisite checks found in oraparam.ini, no system pre-requisite checks will be executed."
    can anyone please help me in finding the solution for that ?
    Thanks

    I don't think 10g will install on RH9 - you will need to get AS2.1 or 3.

  • No pre-requisite checks found in oraparam.ini

    Hi,
    When I was trying to run the ./runInstaller(oracle 10g) on linux4,
    it was saying
    "Starting Oracle Universal Installer...
    No pre-requisite checks found in oraparam.ini, no system pre-requisite checks will be executed."
    can anyone please help me in finding the solution for that ?
    Thanks

    Hi user;
    Please be sure you have all pre-request,check
    http://www.oracle.com/pls/db102/homepage
    Also check below note:
    10g runInstaller (OUI) fails on startup with checkdir error: cannot create /oui/bin/ouica.sh [ID 263692.1]<<Solution part 2
    Regard
    Helios

  • Pre-requisites required for the local configuration of the Weblogic portal

    Hi All,
    I have got the code from the client. It is appenntly came to know that Code has been developed in Weblogic workshop.
    When we build teh application we are getting the following web services related Errors:
    ERROR: DESCRIPTION:An unexpected exception occurred while attempting to locate the run-time information for this Web Service. Error: java.lang.NullPointerException:null
    WARNING: SUGGESTION:An unexpected error occurred. Please contact [email protected] for further assistance.
    ERROR: ERROR
    ERROR: DESCRIPTION:An unexpected exception occurred while attempting to locate the run-time information for this Web Service. Error: java.lang.NullPointerException:null
    WARNING: SUGGESTION:An unexpected error occurred. Please contact [email protected] for further assistance.
    ERROR: ERROR
    ERROR: DESCRIPTION:An unexpected exception occurred while attempting to locate the run-time information for this Web Service. Error: java.lang.NullPointerException:null
    WARNING: SUGGESTION:An unexpected error occurred. Please contact [email protected] for further assistance.
    ERROR: ERROR
    ERROR: DESCRIPTION:An unexpected exception occurred while attempting to locate the run-time information for this Web Service. Error: java.lang.NullPointerException:null
    WARNING: SUGGESTION:An unexpected error occurred. Please contact [email protected] for further assistance.
    ERROR: ERROR
    ERROR: DESCRIPTION:An unexpected exception occurred while attempting to locate the run-time information for this Web Service. Error: java.lang.NullPointerException:null
    WARNING: SUGGESTION:An unexpected error occurred. Please contact [email protected] for further assistance.
    ERROR: ERROR
    ERROR: DESCRIPTION:An unexpected exception occurred while attempting to locate the run-time information for this Web Service. Error: java.lang.NullPointerException:null
    WARNING: SUGGESTION:An unexpected error occurred. Please contact [email protected] for further assistance.
    PortaleWebApp: Created control beans for 19 controls in 12703 milliseconds
    BUILD FAILED
    ERROR: Build failed with 15 error(s).
    When we deploy in the Portal weblogic server, Application is deploying with out any errors. But it is not showing any login page when I start the PTLoginMain.portal file.
    As I am completly new to this Weblogic Portal server, Please let me know, Do i need to configure the any setting before starting the application. I mean to ask you that Pre-requisites required for the local configuration of the Weblogic portal Server.
    Any Help would be much appriciated.
    Regards & thanks,
    Nirmala Vijaay Sekhar Varre

    and your server address can be resolved or not?
    Are you accessing the server from Windows or Linux?
    - On Linux try editing the /etc/hosts file and add something like: 10.241.110.105 server1.etcetera
    - On Windows try editing the C:\WINDOWS\system32\drivers\etc\hosts file and add something like: 10.241.110.105 server1.etcetera
    When this works, contact your system administrator and ask him or her to map an ip to your hostname in DNS and DHCP
    such that the servername automatically resolves the ip-address

  • ERP Package for client deletion

    Hi experts,
    I have a problem when I do the client deletion using the process type"ERP Package for client deletion".
    After the first time execution of deleting the datas of table TD09P_*...,
    I received the follows below.
    State of sub-activity  State Sub-activities
    Aborted                                  5
    Completed successfully              10,203
    Completed with warning                   0
    Completed with error                     0
    Running (In process)                     0
    Not yet started                          0
    There are 5 aborted jobs
    (TD09P_T313I
    TD09P_T313J
    TD09P_T313K
    TD09P_T313L
    TD09P_T313LD).
    I checked the logs, which said all these 5 like this:
    Message text
    Job started
    Step 001 started (program /TDM/9_300_90007_02208_C, variant &0000000000007, user ID LEEE03)
    Error while reading cluster CNVMBTCLU, Key 0144703489
    Job cancelled
    I searched in note1175565 and found that it was fixed since I have updated to sp11 already.
    Also I tried to re-run the cancelled jobs manually using sm37, the error is like this:
    Job started
    Step 001 started (program /TDM/9_300_90007_02208_C, variant &0000000000007, user ID LEEE03)
    Session ID C1290007000000000010 is not valid
    Job cancelled
    according to these above, could anyone tell me the reason?
    Thanks& Best Regards,
    Eric

    Hi
    I had the exact same issue, and what i have found was that the tool drop all the authorization data and if you had specified a cust profile that handle the RFC authorization then the RFC connection to the receiver system then no longer works.
    The way I managed to solve the issue was to change the SAP_TDMS_MASTER role and added in object S_RFCACL with all permissions and generated and activated it.
    This allowed the RFC to work again and then you could restart the process from the central system
    Regards
    Alex Tender

  • Swap Space error in pre requisite check of NWDS2004(Support Pack18)install

    Hi,
    Trying to install NWDI SP 18 (SAP Netweaver Developer Workplace ) trial version on my machine with Windows XP.
    The installation (after installing J2EE Engine + MaxDB + NWDS 2004 etc), it has thrown some error regarding page size.
    So when we check the pre requisites for the installation of the software, it is giving the below error that the swap size needs to be increased.
    ==============================================
    Condition:- Swap Size
    Result Code:- Condition not met
    Severity:- HIGH
    Message:- For the selected services atleast 7135 MB swap space recommeneded.Current value 3921 MB(updated 2005-06-24)
    =============================================
    Please anybody let me know if there is a way to increase the swap size and fix the issue at the earliest.

    Hi Gandhi,
    Right click my on computer ->Select Properties -> Click Advanced Tab ->Click Settings (performance) -> Select Advanced Tab -> In virtual memory -> Change ; You canIncrease swap space/page file here.
    regards
    Juan
    Please reward with points if helpful

  • Warning while running pre-req checks for installing 11g binaries

    I am trying to install 11g binaries on my box for upgrading my production db from 10.2.0.4 to 11.1.0.7. I have dev and Prod running from the same box. I already upgraded my dev instance to 11g and its home is /opt/oracle/product/11.10/dev.
    I created another path for production as /opt/oracle/product/11.1.0/prod so that I can install the 11g binaries for production in there. When I run the installer, the pre-req checks gives me two warnings -
    Checking PATH environment variable...
    Check complete. The overall result of this check is: Failed <<<<
    Problem: The installer has detected that the PATH environment variable includes other ORACLE_HOME locations in it.
    Recommendation: Restart the installer after removing other ORACLE_HOME locations from PATH environment variable.
    ========================================================
    Checking LD_LIBRARY_PATH environment variable...
    Check complete. The overall result of this check is: Failed <<<<
    Problem: The installer has detected that environment variable LD_LIBRARY_PATH includes other ORACLE_HOME locations in it.
    Recommendation: Restart the installer after removing other ORACLE_HOME locations from LD_LIBRARY_PATH environment variable.
    I ran ther pre-req again after unsetting the PATH and HOME variable. But it still gives me a warning on the PATH variable. What should I do to avoid this warning?

    If I were you, I would have defined the HOMEs as "/opt/oracle/product/dev/11.1.0" and "/opt/oracle/product/prod/11.1.0" - that would eliminate the errors you are facing. It is still not too late - you can install the prod binaries as "/opt/oracle/product/prod/11.1.0", then later on "clone" the OH from "/opt/oracle/product/11.1.0/dev" to "/opt/oracle/product/dev/11.1.0" and delete the former.
    You could also simply clone "/opt/oracle/product/prod/11.1.0" from "/opt/oracle/product/11.1.0/dev" rather than running the the install/patching process all over again.
    HTH
    Srini

  • CPO SAP Adapter pre-requisite Check Error

    TEO 2.3.5 SAP adpater Pre-requisite Error
             Trying to setup an SAP ABAP connection. Satisfied the pre-requisite of SAP NCO sapnco30dotnet40P_7-20007348, still get the following error while checking the pre-requisite.
    Unable to check for prerequisites:
    A connection attempt failed because the connected party did not properly respond after a period of time, or established connection failed because connected host has failed to respond
    This is what I see in the logs-
    /StackTrace><ExceptionString>System.ServiceModel.CommunicationObjectAbortedException: The communication object, System.ServiceModel.Channels.TransportReplyChannelAcceptor+TransportReplyChannel, cannot be used for communication because it has been Aborted.</ExceptionString></Exception></TraceRecord>
    ||735|2013/03/01 07:33:30.028|2084|PoolThread:57|||WCF: System.ServiceModel Error: 131075 :
    ||736|2013/03/01 07:33:30.029|2084|PoolThread:57|||WCF: <TraceRecord xmlns="
    http://schemas.microsoft.com/2004/10/E2ETraceEvent/TraceRecord
    " Severity="Error"><TraceIdentifier>http://msdn.microsoft.com/en-US/library/System.ServiceModel.Diagnostics.ThrowingException.aspx</TraceIdentifier><Description>Throwing an exception.</Description><AppDomain>Tidal.Automation.Server.exe</AppDomain><Source>System.ServiceModel.Channels.TransportReplyChannelAcceptor+TransportReplyChannel/59871390</Source><Exception><ExceptionType>System.ServiceModel.CommunicationObjectAbortedException, System.ServiceModel, Version=4.0.0.0, Culture=neutral, PublicKeyToken=b77a5c561934e089</ExceptionType><Message>The communication object, System.ServiceModel.Channels.TransportReplyChannelAcceptor+TransportReplyChannel, cannot be used for communication because it has been Aborted.</Message><StackTrace>   at System.ServiceModel.Channels.InputQueueChannel`1.EndDequeue(IAsyncResult result, TDisposable&amp;amp; item)
       at System.ServiceModel.Dispatcher.ErrorHandlingReceiver.EndTryReceive(IAsyncResult result, RequestContext&amp;amp; requestContext)
       at System.ServiceModel.Dispatcher.ChannelHandler.EndTryReceive(IAsyncResult result, RequestContext&amp;amp; requestContext)
       at System.ServiceModel.Dispatcher.ChannelHandler.AsyncMessagePump(IAsyncResult result)
       at System.Runtime.Fx.AsyncThunk.UnhandledExceptionFrame(IAsyncResult result)
       at System.Runtime.AsyncResult.Complete(Boolean completedSynchronously)
       at System.Runtime.InputQueue`1.AsyncQueueReader.Set(Item item)
       at System.Runtime.InputQueue`1.Shutdown(Func`1 pendingExceptionGenerator)
       at System.ServiceModel.Channels.CommunicationObject.Abort()
       at System.ServiceModel.Dispatcher.ListenerHandler.AbortChannels()
       at System.ServiceModel.Dispatcher.ListenerHandler.OnAbort()
       at System.ServiceModel.Channels.CommunicationObject.Abort()
       at System.ServiceModel.Dispatcher.ChannelDispatcher.OnAbort()
       at System.ServiceModel.Channels.CommunicationObject.Abort()
       at System.ServiceModel.ServiceHostBase.OnAbort()
       at System.ServiceModel.Channels.CommunicationObject.Abort()
       at Tidal.Automation.Server.WebService.WCFHost.StopServiceHost(Object state)
       at Tidal.Automation.Common.ThreadPool.OuterWaitCallBack(Object state)
       at System.Threading.ExecutionContext.Run(ExecutionContext executionContext, ContextCallback callback, Object state, Boolean ignoreSyncCtx)
       at System.Threading.QueueUserWorkItemCallback.System.Threading.IThreadPoolWorkItem.ExecuteWorkItem()
       at System.Threading.ThreadPoolWorkQueue.Dispatch()
       at System.Threading._ThreadPoolWaitCallback.PerformWaitCallback()
    </StackTrace><ExceptionString>System.ServiceModel.CommunicationObjectAbortedException: The communication object, System.ServiceModel.Channels.TransportReplyChannelAcceptor+TransportReplyChannel, cannot be used for communication because it has been Aborted.</ExceptionString></Exception></TraceRecord>
    ||737|2013/03/01 07:33:30.164|2508|MainEngineThread|||Encountered an exception while attempting to kill adapter SAP Solution Manager Adapter (95151695-aacc-4310-af5f-c38abfcea384).  Proceeding.
    ||738|2013/03/01 07:33:30.164|2508|MainEngineThread|||EXCEPTION (Tidal.Automation.Common.Product.RhapsodyException): An attempt was made to stop the adapter named 95151695-aacc-4310-af5f-c38abfcea384 but it appears to have never been started.
    Stack Trace:   at Tidal.Automation.Engine.Core.AdapterStarter.KillAdapter(Guid adapterId)
       at Tidal.Automation.Engine.Core.AdapterLifecycleManager.DisableAdapterStartups()
    ||739|2013/03/01 07:33:30.165|2508|MainEngineThread|||Encountered an exception while attempting to kill adapter SAP ABAP Adapter (cf6f0f84-a364-4105-b11f-0fef62873b37).  Proceeding.
    ||740|2013/03/01 07:33:30.165|2508|MainEngineThread|||EXCEPTION (Tidal.Automation.Common.Product.RhapsodyException): An attempt was made to stop the adapter named cf6f0f84-a364-4105-b11f-0fef62873b37 but it appears to have never been started.
    Stack Trace:   at Tidal.Automation.Engine.Core.AdapterStarter.KillAdapter(Guid adapterId)
       at Tidal.Automation.Engine.Core.AdapterLifecycleManager.DisableAdapterStartups()
    ||741|2013/03/01 07:33:30.221|2508|MainEngineThread|||Encountered an exception while attempting to kill adapter SAP Solution Manager Adapter (95151695-aacc-4310-af5f-c38abfcea384).  Proceeding.
    ||742|2013/03/01 07:33:30.221|2508|MainEngineThread|||EXCEPTION (Tidal.Automation.Common.Product.RhapsodyException): An attempt was made to stop the adapter named 95151695-aacc-4310-af5f-c38abfcea384 but it appears to have never been started.
    Stack Trace:   at Tidal.Automation.Engine.Core.AdapterStarter.KillAdapter(Guid adapterId)
       at Tidal.Automation.Engine.Core.AdapterLifecycleManager.DisableAdapterStartups()
    ||743|2013/03/01 07:33:30.222|2508|MainEngineThread|||Encountered an exception while attempting to kill adapter SAP ABAP Adapter (cf6f0f84-a364-4105-b11f-0fef62873b37).  Proceeding.
    ||744|2013/03/01 07:33:30.222|2508|MainEngineThread|||EXCEPTION (Tidal.Automation.Common.Product.RhapsodyException): An attempt was made to stop the adapter named cf6f0f84-a364-4105-b11f-0fef62873b37 but it appears to have never been started.
    Stack Trace:   at Tidal.Automation.Engine.Core.AdapterStarter.KillAdapter(Guid adapterId)
       at Tidal.Automation.Engine.Core.AdapterLifecycleManager.DisableAdapterStartups()

    Please open a TAC case.  They can not only get you past the missing prerequisite, but also raise the issue on the bad prerequisite detection error which you are seeing so we can get it fixed in the product.

  • Checking for client-side FW from VPN3000

    Can I customize the firewall that the VPN3000 checks connecting clients for? Like and I specify a certain executable that must be running to allow the tunnel to be established or do something along those lines?

    No, It not possible through VPN300.
    Try this link:
    http://www.cisco.com/warp/public/110/pix3000.html

Maybe you are looking for

  • Error while saving Ibots

    Hi, I got following error while saving the ibots. Scheduler is running, and we checked in the configuration we found no error there nqserror:12008 unable to connect to port 9705 on machine dev01 nqserror:12010 communication error connecting to remote

  • IPhone Mail app lost.

    HI, i wasnt able to locate my iphone mail app. I can find using search. but the app icon is missing. Have tried to restore the phone. but the mail app is still missing. Pls advise.

  • Edit in Photoshop Elements 9 from Lightroom 3 on a Mac

    I can't seem to get the PS9 to open properly with my photo.  So I'm in LR3 and I right click and select 'edit in photoshop elements 9'.  It asks me if I want to 'edit a copy with lightroom adjustments' - I say yes and click 'edit'. PS9 opens and I se

  • Re: help with calling methods

    TL;DR--OK, here are 2 things for you to check 1 - are you making changes to your object in a scope as a passed by value variable? public void myMethod(MyObject o){   o.my_int = 66; }when you return from this method, my_int will be the same as it was

  • Lost iPad and iTunes account?

    How do I delete the missing iPad from my iTunes account? My only concern right how, since the chances of it turning up is slim, is that they don't use my account to purchase anything. I've browsed though the forums and it says pretty much that I can