VMware 9.0.2 vmnet fails to build on 3.13.7

So yet another thread and problem with VMware and I've tried all different kind of patches from all kind of places without any results.
As usual with an upgrade (Syu) I needed to rebuild vmblock and vmnet. vmblock built successfully using the available patches for 3.13, vmnet however didn't.
I've tried the solution listed on http://dandar3.blogspot.se/2014/01/vmwa … alpha.html, tried the one listed on the wiki (patch that came with vmblock), tried the patch in the AUR vmware-patch, but nothing. I've also tried reinstalling the packages listed in some threads that got it working for a few people, that did however not help me.
This is the log from the last run, I've used the patch that came with vmblock (the solution listed on the wiki), I'm using the stock kernel which means no netfilter.
Logging to /tmp/vmware-root/vmware-modconfig-724.log
Stopping VMware services:
VMware Authentication Daemon done
VM communication interface socket family done
Virtual machine communication interface done
Virtual machine monitor done
Blocking file system done
make: Entering directory '/tmp/modconfig-6SBn6j/vmnet-only'
Using 2.6.x kernel build system.
/sbin/make -C /lib/modules/3.13.7-1-ARCH/build/include/.. SUBDIRS=$PWD SRCROOT=$PWD/. \
MODULEBUILDDIR= modules
make[1]: Entering directory '/usr/lib/modules/3.13.7-1-ARCH/build'
CC [M] /tmp/modconfig-6SBn6j/vmnet-only/driver.o
CC [M] /tmp/modconfig-6SBn6j/vmnet-only/hub.o
CC [M] /tmp/modconfig-6SBn6j/vmnet-only/userif.o
CC [M] /tmp/modconfig-6SBn6j/vmnet-only/netif.o
In file included from /tmp/modconfig-6SBn6j/vmnet-only/vnet.h:28:0,
from /tmp/modconfig-6SBn6j/vmnet-only/vnetInt.h:24,
from /tmp/modconfig-6SBn6j/vmnet-only/netif.c:42:
/tmp/modconfig-6SBn6j/vmnet-only/vm_atomic.h: In function 'AtomicAssertOnCompilePtr':
In file included from /tmp/modconfig-6SBn6j/vmnet-only/vnet.h:28:0,
from /tmp/modconfig-6SBn6j/vmnet-only/vnetInt.h:24,
from /tmp/modconfig-6SBn6j/vmnet-only/driver.c:51:
/tmp/modconfig-6SBn6j/vmnet-only/vm_atomic.h: In function 'AtomicAssertOnCompilePtr':
/tmp/modconfig-6SBn6j/vmnet-only/vm_atomic.h:2397:20: warning: typedef 'AssertOnCompileFailed' locally defined but not used [-Wunused-local-typedefs]
typedef char AssertOnCompileFailed[AssertOnCompileMisused]; \
^
/tmp/modconfig-6SBn6j/vmnet-only/vm_atomic.h:2558:1: note: in expansion of macro 'MAKE_ATOMIC_TYPE'
MAKE_ATOMIC_TYPE(Ptr, 64, void const *, void *, uintptr_t)
^
/tmp/modconfig-6SBn6j/vmnet-only/vm_atomic.h:2397:20: warning: typedef 'AssertOnCompileFailed' locally defined but not used [-Wunused-local-typedefs]
typedef char AssertOnCompileFailed[AssertOnCompileMisused]; \
^
/tmp/modconfig-6SBn6j/vmnet-only/vm_atomic.h:2558:1: note: in expansion of macro 'MAKE_ATOMIC_TYPE'
MAKE_ATOMIC_TYPE(Ptr, 64, void const *, void *, uintptr_t)
^
/tmp/modconfig-6SBn6j/vmnet-only/vm_atomic.h: In function 'AtomicAssertOnCompileInt':
/tmp/modconfig-6SBn6j/vmnet-only/vm_atomic.h:2397:20: warning: typedef 'AssertOnCompileFailed' locally defined but not used [-Wunused-local-typedefs]
typedef char AssertOnCompileFailed[AssertOnCompileMisused]; \
^
/tmp/modconfig-6SBn6j/vmnet-only/vm_atomic.h:2562:1: note: in expansion of macro 'MAKE_ATOMIC_TYPE'
MAKE_ATOMIC_TYPE(Int, 32, int, int, int)
^
/tmp/modconfig-6SBn6j/vmnet-only/vm_atomic.h: In function 'AtomicAssertOnCompileInt':
/tmp/modconfig-6SBn6j/vmnet-only/vm_atomic.h:2397:20: warning: typedef 'AssertOnCompileFailed' locally defined but not used [-Wunused-local-typedefs]
typedef char AssertOnCompileFailed[AssertOnCompileMisused]; \
^
/tmp/modconfig-6SBn6j/vmnet-only/vm_atomic.h:2562:1: note: in expansion of macro 'MAKE_ATOMIC_TYPE'
MAKE_ATOMIC_TYPE(Int, 32, int, int, int)
^
In file included from /tmp/modconfig-6SBn6j/vmnet-only/vnet.h:28:0,
from /tmp/modconfig-6SBn6j/vmnet-only/vnetInt.h:24,
from /tmp/modconfig-6SBn6j/vmnet-only/userif.c:46:
/tmp/modconfig-6SBn6j/vmnet-only/vm_atomic.h: In function 'AtomicAssertOnCompilePtr':
In file included from /tmp/modconfig-6SBn6j/vmnet-only/monitorAction_exported.h:31:0,
from /tmp/modconfig-6SBn6j/vmnet-only/vnet.h:29,
from /tmp/modconfig-6SBn6j/vmnet-only/vnetInt.h:24,
from /tmp/modconfig-6SBn6j/vmnet-only/netif.c:42:
/tmp/modconfig-6SBn6j/vmnet-only/monitorAction_exported.h: In function 'MonitorActionSet_AtomicInclude':
/tmp/modconfig-6SBn6j/vmnet-only/vm_assert.h:320:20: warning: typedef 'AssertOnCompileFailed' locally defined but not used [-Wunused-local-typedefs]
typedef char AssertOnCompileFailed[AssertOnCompileMisused]; \
^
/tmp/modconfig-6SBn6j/vmnet-only/monitorAction_exported.h:91:4: note: in expansion of macro 'ASSERT_ON_COMPILE'
ASSERT_ON_COMPILE((ACTION_WORD_SIZE & (ACTION_WORD_SIZE - 1)) == 0);
^
/tmp/modconfig-6SBn6j/vmnet-only/vm_atomic.h:2397:20: warning: typedef 'AssertOnCompileFailed' locally defined but not used [-Wunused-local-typedefs]
typedef char AssertOnCompileFailed[AssertOnCompileMisused]; \
^
/tmp/modconfig-6SBn6j/vmnet-only/vm_atomic.h:2558:1: note: in expansion of macro 'MAKE_ATOMIC_TYPE'
MAKE_ATOMIC_TYPE(Ptr, 64, void const *, void *, uintptr_t)
^
In file included from /tmp/modconfig-6SBn6j/vmnet-only/vnet.h:28:0,
from /tmp/modconfig-6SBn6j/vmnet-only/vnetInt.h:24,
from /tmp/modconfig-6SBn6j/vmnet-only/hub.c:43:
/tmp/modconfig-6SBn6j/vmnet-only/vm_atomic.h: In function 'AtomicAssertOnCompilePtr':
In file included from /tmp/modconfig-6SBn6j/vmnet-only/monitorAction_exported.h:31:0,
from /tmp/modconfig-6SBn6j/vmnet-only/vnet.h:29,
from /tmp/modconfig-6SBn6j/vmnet-only/vnetInt.h:24,
from /tmp/modconfig-6SBn6j/vmnet-only/driver.c:51:
/tmp/modconfig-6SBn6j/vmnet-only/monitorAction_exported.h: In function 'MonitorActionSet_AtomicInclude':
/tmp/modconfig-6SBn6j/vmnet-only/vm_atomic.h:2397:20: warning: typedef 'AssertOnCompileFailed' locally defined but not used [-Wunused-local-typedefs]
typedef char AssertOnCompileFailed[AssertOnCompileMisused]; \
^
/tmp/modconfig-6SBn6j/vmnet-only/vm_atomic.h:2558:1: note: in expansion of macro 'MAKE_ATOMIC_TYPE'
MAKE_ATOMIC_TYPE(Ptr, 64, void const *, void *, uintptr_t)
^
/tmp/modconfig-6SBn6j/vmnet-only/vm_atomic.h: In function 'AtomicAssertOnCompileInt':
/tmp/modconfig-6SBn6j/vmnet-only/vm_assert.h:320:20: warning: typedef 'AssertOnCompileFailed' locally defined but not used [-Wunused-local-typedefs]
typedef char AssertOnCompileFailed[AssertOnCompileMisused]; \
^
/tmp/modconfig-6SBn6j/vmnet-only/monitorAction_exported.h:91:4: note: in expansion of macro 'ASSERT_ON_COMPILE'
ASSERT_ON_COMPILE((ACTION_WORD_SIZE & (ACTION_WORD_SIZE - 1)) == 0);
^
/tmp/modconfig-6SBn6j/vmnet-only/vm_atomic.h:2397:20: warning: typedef 'AssertOnCompileFailed' locally defined but not used [-Wunused-local-typedefs]
typedef char AssertOnCompileFailed[AssertOnCompileMisused]; \
^
/tmp/modconfig-6SBn6j/vmnet-only/vm_atomic.h:2562:1: note: in expansion of macro 'MAKE_ATOMIC_TYPE'
MAKE_ATOMIC_TYPE(Int, 32, int, int, int)
^
/tmp/modconfig-6SBn6j/vmnet-only/vm_atomic.h: In function 'AtomicAssertOnCompileInt':
/tmp/modconfig-6SBn6j/vmnet-only/vm_atomic.h:2397:20: warning: typedef 'AssertOnCompileFailed' locally defined but not used [-Wunused-local-typedefs]
typedef char AssertOnCompileFailed[AssertOnCompileMisused]; \
^
/tmp/modconfig-6SBn6j/vmnet-only/vm_atomic.h:2562:1: note: in expansion of macro 'MAKE_ATOMIC_TYPE'
MAKE_ATOMIC_TYPE(Int, 32, int, int, int)
^
In file included from /tmp/modconfig-6SBn6j/vmnet-only/monitorAction_exported.h:31:0,
from /tmp/modconfig-6SBn6j/vmnet-only/vnet.h:29,
from /tmp/modconfig-6SBn6j/vmnet-only/vnetInt.h:24,
from /tmp/modconfig-6SBn6j/vmnet-only/userif.c:46:
/tmp/modconfig-6SBn6j/vmnet-only/monitorAction_exported.h: In function 'MonitorActionSet_AtomicInclude':
/tmp/modconfig-6SBn6j/vmnet-only/vm_assert.h:320:20: warning: typedef 'AssertOnCompileFailed' locally defined but not used [-Wunused-local-typedefs]
typedef char AssertOnCompileFailed[AssertOnCompileMisused]; \
^
/tmp/modconfig-6SBn6j/vmnet-only/monitorAction_exported.h:91:4: note: in expansion of macro 'ASSERT_ON_COMPILE'
ASSERT_ON_COMPILE((ACTION_WORD_SIZE & (ACTION_WORD_SIZE - 1)) == 0);
^
In file included from /tmp/modconfig-6SBn6j/vmnet-only/monitorAction_exported.h:31:0,
from /tmp/modconfig-6SBn6j/vmnet-only/vnet.h:29,
from /tmp/modconfig-6SBn6j/vmnet-only/vnetInt.h:24,
from /tmp/modconfig-6SBn6j/vmnet-only/hub.c:43:
/tmp/modconfig-6SBn6j/vmnet-only/monitorAction_exported.h: In function 'MonitorActionSet_AtomicInclude':
/tmp/modconfig-6SBn6j/vmnet-only/vm_assert.h:320:20: warning: typedef 'AssertOnCompileFailed' locally defined but not used [-Wunused-local-typedefs]
typedef char AssertOnCompileFailed[AssertOnCompileMisused]; \
^
/tmp/modconfig-6SBn6j/vmnet-only/monitorAction_exported.h:91:4: note: in expansion of macro 'ASSERT_ON_COMPILE'
ASSERT_ON_COMPILE((ACTION_WORD_SIZE & (ACTION_WORD_SIZE - 1)) == 0);
^
/tmp/modconfig-6SBn6j/vmnet-only/hub.c: In function 'VNetHubFindHubByID':
/tmp/modconfig-6SBn6j/vmnet-only/hub.c:132:49: warning: argument to 'sizeof' in 'memcmp' call is the same expression as the first source; did you mean to provide an explicit length? [-Wsizeof-pointer-memaccess]
memcmp(idNum, currHub->id.pvnID, sizeof idNum))) {
^
/tmp/modconfig-6SBn6j/vmnet-only/hub.c: In function 'VNetHubAlloc':
/tmp/modconfig-6SBn6j/vmnet-only/hub.c:315:36: warning: argument to 'sizeof' in 'memcpy' call is the same pointer type 'uint8 *' as the destination; expected 'uint8' or an explicit length [-Wsizeof-pointer-memaccess]
memcpy(hub->id.pvnID, id, sizeof id);
^
/tmp/modconfig-6SBn6j/vmnet-only/hub.c:366:28: error: dereferencing pointer to incomplete type
jack->procEntry->read_proc = VNetHubProcRead;
^
/tmp/modconfig-6SBn6j/vmnet-only/hub.c:367:28: error: dereferencing pointer to incomplete type
jack->procEntry->data = jack;
^
/tmp/modconfig-6SBn6j/vmnet-only/userif.c: In function 'VNetUserIfIoctl':
/tmp/modconfig-6SBn6j/vmnet-only/vm_assert.h:320:20: warning: typedef 'AssertOnCompileFailed' locally defined but not used [-Wunused-local-typedefs]
typedef char AssertOnCompileFailed[AssertOnCompileMisused]; \
^
/tmp/modconfig-6SBn6j/vmnet-only/userif.c:810:7: note: in expansion of macro 'ASSERT_ON_COMPILE'
ASSERT_ON_COMPILE(VNET_NOTIFY_VERSION == 5);
^
/tmp/modconfig-6SBn6j/vmnet-only/vm_assert.h:320:20: warning: typedef 'AssertOnCompileFailed' locally defined but not used [-Wunused-local-typedefs]
typedef char AssertOnCompileFailed[AssertOnCompileMisused]; \
^
/tmp/modconfig-6SBn6j/vmnet-only/userif.c:811:7: note: in expansion of macro 'ASSERT_ON_COMPILE'
ASSERT_ON_COMPILE(ACTION_EXPORTED_VERSION == 2);
^
/tmp/modconfig-6SBn6j/vmnet-only/userif.c: In function 'VNetUserIf_Create':
/tmp/modconfig-6SBn6j/vmnet-only/userif.c:1049:34: error: dereferencing pointer to incomplete type
userIf->port.jack.procEntry->read_proc = VNetUserIfProcRead;
^
/tmp/modconfig-6SBn6j/vmnet-only/userif.c:1050:34: error: dereferencing pointer to incomplete type
userIf->port.jack.procEntry->data = userIf;
^
scripts/Makefile.build:308: recipe for target '/tmp/modconfig-6SBn6j/vmnet-only/hub.o' failed
make[2]: *** [/tmp/modconfig-6SBn6j/vmnet-only/hub.o] Error 1
make[2]: *** Waiting for unfinished jobs....
scripts/Makefile.build:308: recipe for target '/tmp/modconfig-6SBn6j/vmnet-only/userif.o' failed
make[2]: *** [/tmp/modconfig-6SBn6j/vmnet-only/userif.o] Error 1
/tmp/modconfig-6SBn6j/vmnet-only/netif.c: In function 'VNetNetIf_Create':
/tmp/modconfig-6SBn6j/vmnet-only/netif.c:191:33: error: dereferencing pointer to incomplete type
netIf->port.jack.procEntry->read_proc = VNetNetIfProcRead;
^
/tmp/modconfig-6SBn6j/vmnet-only/netif.c:192:33: error: dereferencing pointer to incomplete type
netIf->port.jack.procEntry->data = netIf;
^
scripts/Makefile.build:308: recipe for target '/tmp/modconfig-6SBn6j/vmnet-only/netif.o' failed
make[2]: *** [/tmp/modconfig-6SBn6j/vmnet-only/netif.o] Error 1
Makefile:1249: recipe for target '_module_/tmp/modconfig-6SBn6j/vmnet-only' failed
make[1]: *** [_module_/tmp/modconfig-6SBn6j/vmnet-only] Error 2
make[1]: Leaving directory '/usr/lib/modules/3.13.7-1-ARCH/build'
Makefile:130: recipe for target 'vmnet.ko' failed
make: *** [vmnet.ko] Error 2
make: Leaving directory '/tmp/modconfig-6SBn6j/vmnet-only'
Failed to build vmnet. Failed to execute the build command.
$ uname -a
Linux prometheus 3.13.7-1-ARCH #1 SMP PREEMPT Mon Mar 24 20:06:08 CET 2014 x86_64 GNU/Linux
$ vmware --version
VMware Workstation 9.0.2 build-1031769
Thanks in advance
Last edited by darnit (2014-03-28 21:11:46)

this issue was particularly upsetting today, as my phone was at 100% last night, during the night Irene knocked our power out, and apparently something about this drained by battery to only 40% when I woke up. Luckily my laptop is charged, so I can usb charge my phone, but I had hoped to use that later in the day, not first thing in the morning.
hopefully a resolution to this is being worked on.

Similar Messages

  • VMware crashes when loading VMware Player unrecoverable error: (vmx) NOT_IMPLEMENTED d:/build/ob/bora-203739/bora/vmx/main/pollVMX.c:3981

    VMware crashes when loading VMware Player unrecoverable error: (vmx) NOT_IMPLEMENTED d:/build/ob/bora-203739/bora/vmx/main/pollVMX.c:3981

    Hi,
    Please next time do not post a full log as content of the post, instead use the browse button to attach as file.
    Also add a little bit of background information, like if you installed fresh, has it worked before, has anything changed, what is your host OS?
    The relevant part in your log appears to be:
    May 18 12:10:07.330: player-3900| Cnx_Connect: Error message: Failed to read vmware-authd port number: Cannot connect to VMX: C:\Users\Columbus\Documents\Virtual Machines\Windows XP Home Edition\Windows XP Home Edition.vmx
    May 18 12:10:07.330: player-3900|
    May 18 12:10:07.423: player| Unhandled Win32 SEH exception
    May 18 12:10:07.423: player| ----Win32 exception detected, exceptionCode 0xc0000005 (access violation)----
    Either you have some security software (firewall, antimalware, antivirus) not allowing VMware Player to connect to the vmware-authd port or your install is broken and you have to rerun the install (uninstall, reboot, install, reboot)
    Wil

  • [SOLVED] l2tp-ipsec-vpn-daemon from AUR fails to build

    Please let me know if there are other details that require posting:-
    ==> Starting build()...
    /usr/bin/qmake -o qttmp-Release.mk -after "OBJECTS_DIR=build/Release" "DESTDIR=dist/Release" nbproject/qt-Release.pro
    mv -f qttmp-Release.mk nbproject/qt-Release.mk
    make -f nbproject/qt-Release.mk dist/Release/L2tpIPsecVpnControlDaemon
    make[1]: Entering directory '/tmp/yaourt-tmp-nimda/aur-l2tp-ipsec-vpn-daemon/src/l2tp-ipsec-vpn-daemon'
    g++ -c -pipe -march=x86-64 -mtune=generic -O2 -pipe -fstack-protector-strong --param=ssp-buffer-size=4 -Wall -W -D_REENTRANT -fPIE -DQT_NO_DEBUG -DQT_NETWORK_LIB -DQT_CORE_LIB -I/usr/lib/qt/mkspecs/linux-g++ -Inbproject -isystem /usr/include/qt -isystem /usr/include/qt/QtNetwork -isystem /usr/include/qt/QtCore -Isrc/generated -I. -o build/Release/main.o src/main.cpp
    g++ -c -pipe -march=x86-64 -mtune=generic -O2 -pipe -fstack-protector-strong --param=ssp-buffer-size=4 -Wall -W -D_REENTRANT -fPIE -DQT_NO_DEBUG -DQT_NETWORK_LIB -DQT_CORE_LIB -I/usr/lib/qt/mkspecs/linux-g++ -Inbproject -isystem /usr/include/qt -isystem /usr/include/qt/QtNetwork -isystem /usr/include/qt/QtCore -Isrc/generated -I. -o build/Release/VpnClientConnection.o src/VpnClientConnection.cpp
    src/VpnClientConnection.cpp: In member function 'void VpnClientConnection::readyRead()':
    src/VpnClientConnection.cpp:133:99: error: 'class QString' has no member named 'toAscii'
    ::syslog(LOG_DEBUG|LOG_DAEMON, "Executing command %s", m_strActiveCommand.toAscii().constData());
    ^
    src/VpnClientConnection.cpp:140:75: error: 'class QString' has no member named 'toAscii'
    if (COMMANDS[iCommand].pPipe->write(strCommand.toAscii().constData()) == strCommand.length())
    ^
    src/VpnClientConnection.cpp:159:63: error: 'class QString' has no member named 'toAscii'
    if (::mkfifo(strCommandParts[1].toAscii().constData(), DEFFILEMODE) == 0)
    ^
    src/VpnClientConnection.cpp:161:84: error: 'class QString' has no member named 'toAscii'
    const int iChmodResult(::chmod(strCommandParts[1].toAscii().constData(), DEFFILEMODE));
    ^
    src/VpnClientConnection.cpp:168:87: error: 'class QString' has no member named 'toAscii'
    const int iChownResult(::chown(strCommandParts[1].toAscii().constData(), pPwdInfo->pw_uid, pPwdInfo->pw_gid));
    ^
    src/VpnClientConnection.cpp:193:77: error: 'const class QString' has no member named 'toAscii'
    if (COMMANDS[iCommand].pPipe->write(str.toAscii().constData()) != str.length())
    ^
    src/VpnClientConnection.cpp: In member function 'void VpnClientConnection::onCommandError(QProcess::ProcessError)':
    src/VpnClientConnection.cpp:250:96: error: 'class QString' has no member named 'toAscii'
    ::syslog(LOG_DEBUG|LOG_DAEMON, "Command %s finished with error code %d", m_strActiveCommand.toAscii().constData(), ERR_COMMAND_FAILED_TO_START + iError);
    ^
    src/VpnClientConnection.cpp: In member function 'void VpnClientConnection::onCommandFinished(int)':
    src/VpnClientConnection.cpp:257:95: error: 'class QString' has no member named 'toAscii'
    ::syslog(LOG_DEBUG|LOG_DAEMON, "Command %s finished with exit code %d", m_strActiveCommand.toAscii().constData(), iExitCode);
    ^
    src/VpnClientConnection.cpp: In member function 'bool VpnClientConnection::send(VpnClientConnection::ResponseType, VpnClientConnection::ResponseResult, const QString&)':
    src/VpnClientConnection.cpp:268:118: error: 'const class QString' has no member named 'toAscii'
    m_pSocket->write((QString::number(responseType) + " " + QString::number(resultCode) + " " + strCommand + '\n').toAscii().constData());
    ^
    src/VpnClientConnection.cpp: In member function 'bool VpnClientConnection::send(VpnClientConnection::ResponseType, VpnClientConnection::ResponseInformation)':
    src/VpnClientConnection.cpp:281:108: error: 'const class QString' has no member named 'toAscii'
    m_pSocket->write((QString::number(responseType) + " " + QString::number(responseInformation) + '\n').toAscii().constData());
    ^
    src/VpnClientConnection.cpp: In member function 'bool VpnClientConnection::send(VpnClientConnection::ResponseType, const QString&)':
    src/VpnClientConnection.cpp:294:78: error: 'const class QString' has no member named 'toAscii'
    m_pSocket->write((QString::number(responseType) + " " + strOutputline).toAscii().constData());
    ^
    nbproject/qt-Release.mk:319: recipe for target 'build/Release/VpnClientConnection.o' failed
    make[1]: *** [build/Release/VpnClientConnection.o] Error 1
    make[1]: Leaving directory '/tmp/yaourt-tmp-nimda/aur-l2tp-ipsec-vpn-daemon/src/l2tp-ipsec-vpn-daemon'
    Makefile:62: recipe for target 'build' failed
    make: *** [build] Error 2
    ==> ERROR: A failure occurred in build().
    Aborting...
    ==> ERROR: Makepkg was unable to build l2tp-ipsec-vpn-daemon.
    Last edited by n1md4 (2014-06-06 09:47:25)

    Have you tried 0.9.9-2 from the comments: https://aur.archlinux.org/packages/l2tp … pn-daemon/ ?

  • Failed to build StructureDefinition for - POJO Datacontrol

    Hi
    I found a message - "<BeanHandler> <getStructure> Failed to build StructureDefinition for : oracle.****.***.model.services.HomeService" in weblogic server log, while the pages renders completely, i did not define any action / actionlistener though.
    The HomeService is simple POJO data control:
    -------------------------------------HomeService.java-----------------------------------
    package oracle.****.***.model.services;
    import oracle.****.***.model.bean.HomeSearchParams;
    public class HomeService {
    private HomeSearchParams homeSearchParams = new HomeSearchParams();
    public HomeService() {
    public HomeSearchParams getHomeSearchParams() {
    return homeSearchParams;
    --------------------------DataControls.dcx---------------------------------------
    <AdapterDataControl id="HomeService" FactoryClass="oracle.adf.model.adapter.DataControlFactoryImpl"
    ImplDef="oracle.adf.model.adapter.bean.BeanDCDefinition" SupportsTransactions="false"
    SupportsSortCollection="true" SupportsResetState="false" SupportsRangesize="false"
    SupportsFindMode="false" SupportsUpdates="true"
    Definition="oracle.****.***.model.services.HomeService"
    BeanClass="oracle.****.***.model.services.HomeService"
    xmlns="http://xmlns.oracle.com/adfm/datacontrol">
    <CreatableTypes>
    <TypeInfo FullName="oracle.****.***.model.bean.HomeSearchParams"/>
    <TypeInfo FullName="oracle.****.***.model.services.HomeService"/>
    </CreatableTypes>
    <Source>
    <bean-definition BeanClass="oracle.****.***.model.services.RdcHomeService"
    xmlns="http://xmlns.oracle.com/adfm/adapter/bean"/>
    </Source>
    </AdapterDataControl>
    --------------------------DataBindings.cpx---------------------------------------
    <dataControlUsages>
    <dc id="RdcHomeService" path="oracle/****/*****/model/services.RdcHomeService"/>
    </dataControlUsages>
    I wonder if there could be any issue here.
    Can anybody advice here..
    Thanks in advance,
    Mayil
    Edited by: user10254453 on Oct 21, 2011 12:08 AM

    Hi,
    does the application run fine ? If so then I don't see why you should worry about this
    Frank

  • XSS SCA import in CMS error: failed to build

    We are getting error when trying to build XSS Track in NWDI. There are 2 brocken DC for development track.
    Here is the error message that we get:
    Development Component Build (2008-11-28 22:04:10)
      Component name: mss/mol
      Component vendor: sap.com
      SC compartment: sap.com_SAP_MSS_1
      Configuration: <SID>_XSS_D
      Location: <SID>_XSS_D
      Source code location: http://server01:55100/dtr/ws/XSS/sap.com_SAP_MSS/dev/active/DCs/sap.com/mss/mol/_comp/
      DC root folder: /usr/sap/<SID>/JC51/j2ee/cluster/server0/temp/CBS/27/.B/6448/DCs/sap.com/mss/mol/_comp/
      DC type: Web Dynpro
      Host: server01
    DC Model check:
       All used DCs are available locally
       validating dependency to build plugin "sap.com/tc/bi/bp/webDynpro"
       validating dependency to  public part "FloorplanManager" of DC "sap.com/pcui_gp/xssfpm"
       validating dependency to  public part "default" of DC "sap.com/tc/wd/webdynpro"
       validating dependency to  public part "default" of DC "sap.com/com.sap.exception"
       validating dependency to  public part "default" of DC "sap.com/tc/ddic/ddicruntime"
       validating dependency to  public part "default" of DC "sap.com/tc/col/api"
       validating dependency to  public part "default" of DC "sap.com/tc/wdp/metamodel/content"
       validating dependency to  public part "Isrlpd" of DC "sap.com/pcui_gp/isrlpd"
       validating dependency to  public part "default" of DC "sap.com/com.sap.mw.jco"
       validating dependency to  public part "default" of DC "sap.com/com.sap.aii.proxy.framework"
       validating dependency to  public part "default" of DC "sap.com/tc/logging"
       validating dependency to  public part "default" of DC "sap.com/com.sap.aii.util.misc"
       validating dependency to  public part "FPMUtils" of DC "sap.com/pcui_gp/xssutils"
       validating dependency to  public part "default" of DC "sap.com/tc/ddic/metamodel/content"
       validating dependency to  public part "default" of DC "sap.com/tc/cmi"
       validating dependency to  public part "FinUtils" of DC "sap.com/mss/finutils"
       DC model check OK
    Start build plugin:
       using build plugin: sap.com/tc/bi/bp/webDynpro
       starting build plugin from : /usr/sap/<SID>/JC51/j2ee/cluster/server0/temp/CBS/27/.B/6448/DCs/sap.com/tc/bi/bp/webDynpro/_comp/gen/default/public/webDynpro/
    Build Plugin 'WebdynproPlugin', Version 7.00 SP 16 (645_VAL_REL, built on 2008-06-09 20:46:40 CEST, CL83275)
       development component:  mss/mol (sap.com)
          software component:  SAP_MSS (sap.com)
           support component:  EP-PCT-MGR-CO
                    location:  <SID>_XSS_D
                        type:  Web Dynpro
               build variant:  default
             output location:  /usr/sap/<SID>/JC51/j2ee/cluster/server0/temp/CBS/27/.B/6448/DCs/sap.com/mss/mol/_comp/gen/default
           generation folder:  /usr/sap/<SID>/JC51/j2ee/cluster/server0/temp/CBS/27/.B/6448/t/64CE6536D7BD962CDCB65DC8A7640047
           plugin start time:  2008-11-28 22:04:11 GMT-07:00 (MST)
                     Java VM:  Java HotSpot(TM) Client VM, 1.4.2_12-b03 (Sun Microsystems Inc.)
    General options:
      convert *.xlf to *.properties: yes
      include sources for debugging: yes
    Warning: Source folder "META-INF" exists but is empty and will be ignored.
    Warning: Source folder "src/configuration" exists but is empty and will be ignored.
    Preparing data context..
    No public part descriptor found for component "tc/wd/webdynpro" (vendor "sap.com"), public part "default", using legacy mode.
    No public part descriptor found for component "com.sap.exception" (vendor "sap.com"), public part "default", using legacy mode.
    No public part descriptor found for component "tc/ddic/ddicruntime" (vendor "sap.com"), public part "default", using legacy mode.
    No public part descriptor found for component "tc/col/api" (vendor "sap.com"), public part "default", using legacy mode.
    No public part descriptor found for component "tc/wdp/metamodel/content" (vendor "sap.com"), public part "default", using legacy mode.
    No public part descriptor found for component "com.sap.mw.jco" (vendor "sap.com"), public part "default", using legacy mode.
    No public part descriptor found for component "com.sap.aii.proxy.framework" (vendor "sap.com"), public part "default", using legacy mode.
    No public part descriptor found for component "tc/logging" (vendor "sap.com"), public part "default", using legacy mode.
    No public part descriptor found for component "com.sap.aii.util.misc" (vendor "sap.com"), public part "default", using legacy mode.
    No public part descriptor found for component "tc/ddic/metamodel/content" (vendor "sap.com"), public part "default", using legacy mode.
    No public part descriptor found for component "tc/cmi" (vendor "sap.com"), public part "default", using legacy mode.
    No 'default' JDK defined, will use running VM.
    Data context preparation finished in 0.934 seconds
    Creating Ant build file..
      Creating output file: /usr/sap/<SID>/JC51/j2ee/cluster/server0/temp/CBS/27/.B/6448/DCs/sap.com/mss/mol/_comp/gen/default/logs/build.xml
      Using macro file:     /usr/sap/<SID>/JC51/j2ee/cluster/server0/temp/CBS/27/.B/6448/DCs/sap.com/tc/bi/bp/webDynpro/_comp/gen/default/public/webDynpro/macros/build.vm
    Build file creation finished in 1 second
    Starting Ant..
      Using build file:     /usr/sap/<SID>/JC51/j2ee/cluster/server0/temp/CBS/27/.B/6448/DCs/sap.com/mss/mol/_comp/gen/default/logs/build.xml
      Using build target:   build
      Using Ant version:    1.6.2
    compile:
          [echo] Starting dictionary generator
         [ddgen]
         [ddgen] [Info]    Property deployment is true: Deployment information is provided!
         [ddgen] [Info]    Property sourcepath: /usr/sap/<SID>/JC51/j2ee/cluster/server0/temp/CBS/27/.B/6448/DCs/sap.com/mss/mol/_comp/src/packages
         [ddgen] [Info]    Property targetpath: /usr/sap/<SID>/JC51/j2ee/cluster/server0/temp/CBS/27/.B/6448/t/64CE6536D7BD962CDCB65DC8A7640047/gen_ddic
         [ddgen] [Info]    Property archivename: sap.commssmol
         [ddgen] [Info]    Property vendor: sap.com
         [ddgen] [Info]    Property dcname: mss/mol
         [ddgen] [Info]    Property projectlanguage: de
         [ddgen] [Info]    Property language: Available languages are automatically determined!
         [ddgen] [Info]    Property addpaths ...
         [ddgen] [Info]    Generating datatypes/com/sap/mss/mol/monitor/model/types/MolModel.gdictionary
         [ddgen] [Info]    Generating datatypes/com/sap/pcuigp/xssutils/objectselection/model/types/FcObjectSelection.gdictionary
         [ddgen] [Info]    Generating datatypes/com/sap/pcuigp/xssutils/pernr/model/types/RHXSS_SER_EMPLOYEE.gdictionary
         [ddgen] [Info]    Generating dbtables/sdmDeployDd.xml
         [ddgen] [Info]    Generation finished (8 seconds)
         [ddgen]
         [timer] Dictionary generator finished in 8.499 seconds
          [echo] Starting WebDynpro generator
         [wdgen]
         [wdgen] [Info]    Property deployment is true: Deployment information is provided!
         [wdgen] [Info]    Property sourcepath: /usr/sap/<SID>/JC51/j2ee/cluster/server0/temp/CBS/27/.B/6448/DCs/sap.com/mss/mol/_comp/src/packages
         [wdgen] [Info]    Property targetpath: /usr/sap/<SID>/JC51/j2ee/cluster/server0/temp/CBS/27/.B/6448/t/64CE6536D7BD962CDCB65DC8A7640047/gen_wdp
         [wdgen] [Info]    Property archivename: sap.commssmol
         [wdgen] [Info]    Property vendor: sap.com
         [wdgen] [Info]    Property dcname: mss/mol
         [wdgen] [Info]    Property projectlanguage: de
         [wdgen] [Info]    Property language: Available languages are automatically determined!
         [wdgen] WARNING: Metadata of component FcLineItemMonitor is not valid! Component "//WebDynpro/Component:com.sap.mss.mol.monitor.FcLineItemMonitor", Role "ComponentController": A minimum of 1 object(s) is required
         [wdgen] [Error]   com.sap.mss.mol.monitor.VcLineItemMonitorView --> TextView rulename_editor [text]: Context element and property are not compatible
         [wdgen] [Error]   com.sap.mss.mol.monitor.VcLineItemMonitorView --> TextView count_editor [text]: Context element and property are not compatible
         [wdgen] [Error]   com.sap.mss.mol.monitor.VcLineItemMonitorView --> TextView evaldate [text]: Context element and property are not compatible
         [wdgen] [Error]   com.sap.mss.mol.monitor.VcLineItemMonitorView --> TextView evaltime_2 [text]: Context element and property are not compatible
         [wdgen] [Info]    com.sap.mss.mol.monitor.VcLineItemMonitorView --> TransparentContainer tcActionBar [Children]: Container does not contain children
         [wdgen] [Error]   com.sap.mss.mol.monitor.VcLineItemMonitorView --> Button btnEditRule [visible]: Context element and property are not compatible
         [wdgen] [Error]   com.sap.mss.mol.monitor.VcLineItemMonitorView --> Button btnCreateRule [visible]: Context element and property are not compatible
         [wdgen] [Error]   com.sap.mss.mol.monitor.VcLineItemMonitorView --> Button btnCopyRule [visible]: Context element and property are not compatible
         [wdgen] [Error]   com.sap.mss.mol.monitor.VcLineItemMonitorView --> Button btnDeleteRule [visible]: Context element and property are not compatible
         [wdgen] [Error]   com.sap.mss.mol.monitor.VcLineItemMonitorView --> Button btnPersonalize [visible]: Context element and property are not compatible
         [wdgen] [Error]   com.sap.mss.mol.monitor.VcLineItemMonitorView --> TextView itemtxt_editor [text]: Context element and property are not compatible
         [wdgen] [Error]   com.sap.mss.mol.monitor.VcLineItemMonitorView --> LinkToURL verakUser_url [text]: Context element and property are not compatible
         [wdgen] [Error]   com.sap.mss.mol.monitor.VcLineItemMonitorView --> LinkToURL verakUser_url [reference]: Context element and property are not compatible
         [wdgen] [Error]   com.sap.mss.mol.monitor.VcLineItemMonitorView --> TextView itemdate_editor [text]: Context element and property are not compatible
         [wdgen] [Error]   com.sap.mss.mol.monitor.VcLineItemMonitorView --> TextView value_editor [text]: Context element and property are not compatible
         [wdgen] [Error]   com.sap.mss.mol.monitor.VcLineItemMonitorView --> TextView waers_editor [text]: Context element and property are not compatible
         [wdgen] [Error]   com.sap.mss.mol.monitor.VcLineItemMonitorView --> Image confirmedImage [tooltip]: Context element and property are not compatible
         [wdgen] [Error]   com.sap.mss.mol.monitor.VcLineItemMonitorView --> Image confirmedImage [alt]: Context element and property are not compatible
         [wdgen] [Error]   com.sap.mss.mol.monitor.VcLineItemMonitorView --> Image confirmedImage [source]: Context element and property are not compatible
         [wdgen] [Error]   com.sap.mss.mol.monitor.VcLineItemMonitorView --> TextView actionTaken_editor [text]: Context element and property are not compatible
         [wdgen] [Error]   com.sap.mss.mol.monitor.VcLineItemMonitorView --> TextView tvCurrency [text]: Context element and property are not compatible
         [wdgen] [Info]    com.sap.mss.mol.monitor.VcLineItemMonitorView --> TransparentContainer DetailContainer [Children]: Container does not contain children
         [wdgen] [Error]   com.sap.mss.mol.monitor.VcLineItemMonitorView --> UIElement UpdateTrigger [enabled]: Context element and property are not compatible
         [wdgen] [Info]    com.sap.mss.mol.monitor.VcLineItemMonitorView --> TextView tvStatus: UIElement does not have a label
         [wdgen] [Info]    com.sap.mss.mol.monitor.VcLineItemMonitorView --> TextView evaldate: UIElement does not have a label
         [wdgen] [Info]    com.sap.mss.mol.monitor.VcLineItemMonitorView --> TextView evaltime_2: UIElement does not have a label
         [wdgen] [Info]    com.sap.mss.mol.monitor.VcLineItemMonitorView --> LinkToAction LinkUpdate: UIElement does not have a label
         [wdgen] [Info]    com.sap.mss.mol.monitor.VcLineItemMonitorView --> TextView tvUpdateRunning: UIElement does not have a label
         [wdgen] [Info]    com.sap.mss.mol.monitor.VcLineItemMonitorView --> Caption RuleGroup_Header: UIElement does not have a label
         [wdgen] [Info]    com.sap.mss.mol.monitor.VcLineItemMonitorView --> TextView tvCurrency: UIElement does not have a label
         [wdgen] [Info]    com.sap.mss.mol.monitor.VcLineItemMonitorView --> Caption Details_Header: UIElement does not have a label
         [wdgen] [Info]    com.sap.mss.mol.monitor.VcLineItemMonitorView --> Caption ItemDetails_Header: UIElement does not have a label
         [wdgen] [Error]   com.sap.mss.mol.monitor.RuleMaintView --> TextView rulename_editor [text]: Context element and property are not compatible
         [wdgen] [Error]   com.sap.mss.mol.monitor.RuleMaintView --> TextView ruleid_editor [text]: Context element and property are not compatible
         [wdgen] [Error]   com.sap.mss.mol.monitor.RuleMaintView --> InputField inDescription [value]: Context element and property are not compatible
         [wdgen] [Error]   com.sap.mss.mol.monitor.RuleMaintView --> CheckBox cbShowAlert [checked]: Context element and property are not compatible
         [wdgen] [Error]   com.sap.mss.mol.monitor.RuleMaintView --> DropDownByKey ddKF1 [selectedKey]: Context element and property are not compatible
         [wdgen] [Error]   com.sap.mss.mol.monitor.RuleMaintView --> DropDownByKey ddSign [selectedKey]: Context element and property are not compatible
         [wdgen] [Error]   com.sap.mss.mol.monitor.RuleMaintView --> InputField inLimitAbs [value]: Context element and property are not compatible
         [wdgen] [Error]   com.sap.mss.mol.monitor.RuleMaintView --> DropDownByKey ddAbsRel [selectedKey]: Context element and property are not compatible
         [wdgen] [Error]   com.sap.mss.mol.monitor.RuleMaintView --> InputField InputTimestamp [value]: Context element and property are not compatible
         [wdgen] [Error]   com.sap.mss.mol.monitor.RuleMaintView --> Tree treeObject [title]: Context element and property are not compatible
         [wdgen] [Error]   com.sap.mss.mol.monitor.RuleMaintView --> Tree treeObject [tooltip]: Context element and property are not compatible
         [wdgen] [Error]   com.sap.mss.mol.monitor.RuleMaintView --> Tree treeKfspecgl [title]: Context element and property are not compatible
         [wdgen] [Error]   com.sap.mss.mol.monitor.RuleMaintView --> Tree treeKfspecgl [tooltip]: Context element and property are not compatible
         [wdgen] [Info]    com.sap.mss.mol.monitor.RuleMaintView --> Caption tableRulesHeader: UIElement does not have a label
         [wdgen] [Info]    com.sap.mss.mol.monitor.RuleMaintView --> CheckBox cbShowAlert: UIElement does not have a label
         [wdgen] [Warning] com.sap.mss.mol.monitor.RuleMaintView --> DropDownByKey ddSign: UIElement does not have a label
         [wdgen] [Warning] com.sap.mss.mol.monitor.RuleMaintView --> InputField inLimitAbs: UIElement does not have a label
         [wdgen] [Warning] com.sap.mss.mol.monitor.RuleMaintView --> DropDownByKey ddAbsRel: UIElement does not have a label
         [wdgen] [Info]    Catching throwable null
         [wdgen] [Info]    com.sap.webdynpro.generation.ant.GenerationAntTaskError
         [wdgen]      at com.sap.webdynpro.generation.ant.GenerationAnt.showCheckResult(GenerationAnt.java:157)
         [wdgen]      at com.sap.tc.buildcontroller.CBSBuildController.mainLoop(CBSBuildController.java:207)
         [wdgen]      at com.sap.tc.buildcontroller.CBSBuildController.main(CBSBuildController.java:168)
         [wdgen] ERROR: Unknown exception during generation null (com.sap.webdynpro.generation.ant.GenerationAntTaskError)
         [wdgen] ERROR: Generation failed due to errors (7 seconds)
    Error: /usr/sap/<SID>/JC51/j2ee/cluster/server0/temp/CBS/27/.B/6448/DCs/sap.com/mss/mol/_comp/gen/default/logs/build.xml:99: [Error]   Generation failed!
         at com.sap.webdynpro.generation.ant.WDGenAntTask.execute(WDGenAntTask.java:254)
         at org.apache.tools.ant.UnknownElement.execute(UnknownElement.java:275)
         at org.apache.tools.ant.Task.perform(Task.java:364)
         at com.sap.tc.buildcontroller.CBSBuildController.mainLoop(CBSBuildController.java:207)
         at com.sap.tc.buildcontroller.CBSBuildController.main(CBSBuildController.java:168)
    Ant runtime 16.597 seconds
    Ant build finished with ERRORS
    [Error]   Generation failed!
    Error: Build stopped due to an error: [Error]   Generation failed!
    Build plugin finished at 2008-11-28 22:04:32 GMT-07:00 (MST)
    Total build plugin runtime: 20.648 seconds
    Build finished with ERROR
    What can be done to resolve these error and trigger the build again.
    Bhavin

    Resloved with SAP help.
    1. Ran configuration wizard for CBS, CMS & DTR
    2. Changes few JVM parameters (increased heap size, jdbc pool size)

  • Formatting Failed. Building not successful. See log.

    I keep getting a 'Formatting Failed. Building not successful. See log.' error every time I try to burn a project.
    I created the movie using Final Cut Pro, exported it to Compressor, and then submitting it using the DVD: Best Quality 120 minutes preset. I got 2 files, an m2v and an ac3 file which I assume is the video and the audio. I imported it to DVDSP as assets and then inserted a blank DVD ready to burn and I get that error when I try to burn.
    I tried burning several times and getting the same error. First time using Final Cut Studio.
    FYI: It's a 1h and 43 minutes video.
    This is my log:
    Starting DVD Build UNTITLED_DISC...
    Compiler Initializing...
    Precompiling Project UNTITLED_DISC
    No Video or Still Assets found in Track:Track 1
    Build cancelled
    Formatting finished.
    Building was not successful. See log.
    Starting DVD Build UNTITLED_DISC...
    Compiler Initializing...
    Precompiling Project UNTITLED_DISC
    No Video or Still Assets found in Track:Track 1
    Build cancelled
    Formatting finished.
    Building was not successful. See log.
    Starting DVD Build UNTITLED_DISC...
    Compiler Initializing...
    Precompiling Project UNTITLED_DISC
    No Video or Still Assets found in Track:Track 1
    Build cancelled
    Formatting finished.
    Building was not successful. See log.

    I am having exactly the same problem, which suddenly started happening. I have been successfully authoring DVD projects with DVD Studio Pro for about 2 years, so I know how to set up projects and output them properly. When I select "Burn" I get a failure message during the build process which tells me nothing other than the fact that that the build failed. To determine if the optical drive was faulty I checked playback of DVDs and data burning to a blank DVD from the Mac OS and both worked fine. Then I tried doing a separate Build and Format and that worked as well. But, I cannot seem to do the one step Burn that I have done dozens of time before. I can't imagine that this has any relationship to the problem, but I recently replaced the 750 GB Media Drive with three 1 TB drives, set up as a RAID, but did not touch the 750 GB Boot Drive. Any thoughts on this would be appreciated.

  • Changes to MXML fail to build

    I imported a flex archive file but when Changes to MXML file
    they fail to build when I run the application. Flex builder keeps
    build a different Flex project. How to get it to build the current
    project I'm working on?
    I'm also not getting syntax highlighting as I type even
    though build automatically is ticked.
    I only get syntax highlighting when I run 1 of my projects I
    was working on in the past after I run any project.

    quote:
    Originally posted by:
    ntsiii
    Check for errors in the Problems pane. This will prevent
    compilation.
    Also, how do you know your project is not building?
    Tracy
    Thanks for that observation, Looking in the problems pane I
    get a strange error
    Severity and Description Path Resource Location Creation Time
    Id
    unable to open 'C:\Users\Nikos\Documents\Flex Builder
    3\ClickCarousel\libs' ClickCarousel Unknown 1216021345733 672
    As far as I know there is no reference to
    C:\Users\Nikos\Documents\Flex Builder 3\ClickCarousel\libs in my
    MXML code. I imported this project as an archive file into my
    workspace, maybe something went wrong there? What do you think?

  • [SOLVED] nVidia 87.76 Drivers installer fails to build kernel module

    Hey,
    I have a nVidia GeForce2 Integrated graphics card on my Asus A7N266 motherboard. According to the nVidia site, http://www.nvidia.com/object/IO_32667.html, the most recent driver that supports this is the 96.xx series. Yet as shown here, http://www.nvnews.net/vbulletin/showthread.php?t=87332, many people have found that the 96.xx series drivers cause graphical corruption when using a GeForce2 IGP.
    Before coming to Arch, I had used Xubuntu 7.04 and managed to compile the last known working drivers, version 87.76, following the instructions here: http://kmandla.wordpress.com/2007/03/25 … 20-12-386/
    That all went well but now I'm using Arch. I tried using the nvidia-96.xx driver in the repos just for testing sake but I still got the same graphical corruption.
    Thus I have been trying to install the 87.76 drivers on Arch, but it always fails at the kernel module building stage. I had first applied this patch here, http://www.nvnews.net/vbulletin/showthr … ost1086669, before compling as the plain driver wont compile against recent kernels.
    Here is the output from the installer:
    nvidia-installer log file '/var/log/nvidia-installer.log'
    creation time: Sun Aug 5 11:57:53 2007
    option status:
    license pre-accepted : false
    update : false
    force update : false
    expert : false
    uninstall : false
    driver info : false
    precompiled interfaces : true
    no ncurses color : false
    query latest version : false
    OpenGL header files : true
    no questions : false
    silent : false
    no recursion : false
    no backup : false
    kernel module only : false
    sanity : false
    add this kernel : false
    no runlevel check : false
    no network : false
    no ABI note : false
    no RPMs : false
    no kernel module : false
    force SELinux : default
    force tls : (not specified)
    X install prefix : (not specified)
    X library install path : (not specified)
    X module install path : (not specified)
    OpenGL install prefix : (not specified)
    OpenGL install libdir : (not specified)
    utility install prefix : (not specified)
    utility install libdir : (not specified)
    doc install prefix : (not specified)
    kernel name : (not specified)
    kernel include path : (not specified)
    kernel source path : (not specified)
    kernel output path : (not specified)
    kernel install path : (not specified)
    proc mount point : /proc
    ui : (not specified)
    tmpdir : /tmp
    ftp mirror : ftp://download.nvidia.com
    RPM file list : (not specified)
    Using: nvidia-installer ncurses user interface
    -> License accepted.
    -> No precompiled kernel interface was found to match your kernel; would you li
    ke the installer to attempt to download a kernel interface for your kernel f
    rom the NVIDIA ftp site (ftp://download.nvidia.com)? (Answer: Yes)
    -> No matching precompiled kernel interface was found on the NVIDIA ftp site;
    this means that the installer will need to compile a kernel interface for
    your kernel.
    -> Performing CC sanity check with CC="cc".
    -> Performing CC version check with CC="cc".
    -> Kernel source path: '/lib/modules/2.6.22-ARCH/build'
    -> Kernel output path: '/lib/modules/2.6.22-ARCH/build'
    -> Performing rivafb check.
    -> Performing nvidiafb check.
    -> Cleaning kernel module build directory.
    executing: 'cd ./usr/src/nv; make clean'...
    rm -f -f nv.o nv-vm.o os-agp.o os-interface.o os-registry.o nv-i2c.o nv.o nv
    -vm.o os-agp.o os-interface.o os-registry.o nv-i2c.o nvidia.mod.o
    rm -f -f build-in.o nv-linux.o *.d .*.{cmd,flags}
    rm -f -f nvidia.{o,ko,mod.{o,c}} nv_compiler.h *~
    rm -f -f stprof stprof.o symtab.h
    rm -f -rf .tmp_versions
    -> Building kernel module:
    executing: 'cd ./usr/src/nv; make module SYSSRC=/lib/modules/2.6.22-ARCH/bui
    ld SYSOUT=/lib/modules/2.6.22-ARCH/build'...
    NVIDIA: calling KBUILD...
    make CC=cc KBUILD_VERBOSE=1 -C /lib/modules/2.6.22-ARCH/build SUBDIRS=/home
    /kris/Source/nVidia GLX 87.76 Driver/NVIDIA-Linux-x86-1.0-8776-pkg1/usr/src/
    nv modules
    test -e include/linux/autoconf.h -a -e include/config/auto.conf || ( \
    echo; \
    echo " ERROR: Kernel configuration is invalid."; \
    echo " include/linux/autoconf.h or include/config/auto.conf are mis
    sing."; \
    echo " Run 'make oldconfig && make prepare' on kernel src to fix it
    echo; \
    /bin/false)
    make[2]: *** No rule to make target `GLX'. Stop.
    NVIDIA: left KBUILD.
    nvidia.ko failed to build!
    make[1]: *** [mdl] Error 1
    make: *** [module] Error 2
    -> Error.
    ERROR: Unable to build the NVIDIA kernel module.
    ERROR: Installation has failed. Please see the file
    '/var/log/nvidia-installer.log' for details. You may find suggestions
    on fixing installation problems in the README available on the Linux
    driver download page at www.nvidia.com.
    Any ideas as to how I can get the kernel module to build?
    I am using 'kernel26 2.6.22.1-4' with the 'kernel-headers 2.6.22.1-1' from the testing repo.
    Last edited by Nameless One (2007-08-10 07:08:38)

    make CC=cc  KBUILD_VERBOSE=1 -C /lib/modules/2.6.22-ARCH/buildSUBDIRS=/home/kris/Source/nVidia GLX 87.76 Driver/NVIDIA-Linux-x86-1.0-8776-pkg1/usr/src/
    The name of the directory you placed the driver in contains spaces. That is  why you get the no rule to make target GLX error.
    It would be better not to circumvent pacman. I am using the following PKGBUILDs for the 8776 driver:
    nvidia-8776:
    pkgname=nvidia-8776
    pkgver=1.0.8776
    _nver=1.0-8776
    _kernver='2.6.22-ARCH'
    pkgrel=1
    pkgdesc="NVIDIA drivers for Arch kernel."
    arch=(i686 x86_64)
    [ "$CARCH" = "i686" ] && ARCH=x86
    [ "$CARCH" = "x86_64" ] && ARCH=x86_64
    url="http://www.nvidia.com/"
    depends=(kernel26 nvidia-8776-utils)
    conflicts=('nvidia' 'nvidia-96xx' 'nvidia-71xx' 'nvidia-legacy')
    install=nvidia.install
    source=(http://download.nvidia.com/XFree86/Linux-$ARCH/${_nver}/NVIDIA-Linux-$ARCH-${_nver}-pkg0.run NVIDIA_kernel-1.0-8776-20061203.diff.txt)
    md5sums=('93ad45fe7b974a5a80348e1890f9b7c9' '70e669f06ee4881c2583261672de292a')
    [ "$CARCH" = "x86_64" ] && md5sums=('f5340e4bbce811add994b1685cdea03b' '70e669f06ee4881c2583261672de292a')
    build()
    # Extract
    cd $startdir/src/
    sh NVIDIA-Linux-$ARCH-${_nver}-pkg0.run --extract-only
    cd NVIDIA-Linux-$ARCH-${_nver}-pkg0
    # Any extra patches are applied in here...
    patch -p0 < $startdir/NVIDIA_kernel-1.0-8776-20061203.diff.txt ||return 1
    cd usr/src/nv/
    ln -s Makefile.kbuild Makefile
    make SYSSRC=/lib/modules/$_kernver/build module || return 1
    # install kernel module
    mkdir -p $startdir/pkg/lib/modules/${_kernver}/kernel/drivers/video/
    install -m644 nvidia.ko $startdir/pkg/lib/modules/${_kernver}/kernel/drivers/video/
    sed -i -e "s/KERNEL_VERSION='.*'/KERNEL_VERSION='${_kernver}'/" $startdir/*.install
    Place the patch (NVIDIA_kernel-1.0-8776-20061203.diff.txt) and nvidia.install in the same directory as the PKGBUILD.
    nvidia-utils:
    pkgname=nvidia-8776-utils
    pkgver=1.0.8776
    _nver=1.0-8776
    pkgrel=1
    pkgdesc="NVIDIA drivers utilities and libraries."
    arch=(i686 x86_64)
    [ "$CARCH" = "i686" ] && ARCH=x86
    [ "$CARCH" = "x86_64" ] && ARCH=x86_64
    url="http://www.nvidia.com/"
    depends=(xorg-server)
    conflicts=('libgl' 'libgl-dri' 'ati-fglrx-utils' 'nvidia-legacy-utils' 'nvidia-71xx-utils' 'nvidia-96xx-utils')
    provides=('libgl' )
    #install=nvidia.install
    source=(http://download.nvidia.com/XFree86/Linux-$ARCH/${_nver}/NVIDIA-Linux-$ARCH-${_nver}-pkg0.run)
    md5sums=('93ad45fe7b974a5a80348e1890f9b7c9')
    [ "$CARCH" = "x86_64" ] && md5sums=('f5340e4bbce811add994b1685cdea03b')
    build()
    # override nvida install routine and do it the long way.
    cd $startdir/src/
    sh NVIDIA-Linux-${ARCH}-${_nver}-pkg0.run --extract-only
    cd NVIDIA-Linux-${ARCH}-${_nver}-pkg0/usr/
    mkdir -p $startdir/pkg/usr/{lib,bin,share/applications,share/pixmaps,man/man1}
    mkdir -p $startdir/pkg/usr/lib/xorg/modules/{extensions,drivers}
    mkdir -p $startdir/pkg/usr/share/licenses/nvidia/
    install `find lib/ -iname \*.so\*` $startdir/pkg/usr/lib/
    install lib/tls/* $startdir/pkg/usr/lib
    install share/man/man1/* $startdir/pkg/usr/man/man1/
    rm $startdir/pkg/usr/man/man1/nvidia-installer.1.gz
    install X11R6/lib/libXv* $startdir/pkg/usr/lib/
    install share/applications/nvidia-settings.desktop $startdir/pkg/usr/share/applications/
    # fix nvidia .desktop file
    sed -e 's:__UTILS_PATH__:/usr/bin:' -e 's:__PIXMAP_PATH__:/usr/share/pixmaps:' -i $startdir/pkg/usr/share/applications/nvidia-settings.desktop
    install share/pixmaps/nvidia-settings.png $startdir/pkg/usr/share/pixmaps/
    install X11R6/lib/modules/drivers/nvidia_drv.so $startdir/pkg/usr/lib/xorg/modules/drivers
    install X11R6/lib/modules/extensions/libglx.so.$pkgver $startdir/pkg/usr/lib/xorg/modules/extensions
    install -m755 bin/nvidia-{settings,xconfig,bug-report.sh} $startdir/pkg/usr/bin/
    cd $startdir/pkg/usr/lib/;
    ln -s /usr/lib/libGL.so.$pkgver libGL.so
    ln -s /usr/lib/libGL.so.$pkgver libGL.so.1
    ln -s /usr/lib/libGLcore.so.$pkgver libGLcore.so.1
    ln -s /usr/lib/libnvidia-cfg.so.$pkgver libnvidia-cfg.so.1
    ln -s /usr/lib/libnvidia-tls.so.$pkgver libnvidia-tls.so.1
    cd $startdir/pkg/usr/lib/xorg/modules/extensions;
    ln -s /usr/lib/xorg/modules/extensions/libglx.so.$pkgver libglx.so
    install $startdir/src/NVIDIA-Linux-${ARCH}-${_nver}-pkg0/LICENSE $startdir/pkg/usr/share/licenses/nvidia/
    find $startdir/pkg/usr -type d -exec chmod 755 {} \;
    # phew :)
    Last edited by kappa (2007-08-09 11:14:42)

  • Sage-mathematics from AUR fails to build

    Anyone have any ideas why eclib shared libraries failed to build. I'd like to get the program running quickly, as I'm using it for college. On an unrelated note, why hasn't it remained in the repos? Its takes quite a long time to build. Let me know if anything else will help.
    [duke@cii ~]$ cd '/tmp/yaourt-tmp-duke/aur-sage-mathematics/src/sage-4.8/spkg/build/eclib-20100711.p0' && '/tmp/yaourt-tmp-duke/aur-sage-mathematics/src/sage-4.8/sage' -sh
    Starting subshell with Sage environment variables set.
    Be sure to exit when you are done and do not do anything
    with other copies of Sage!
    Bypassing shell configuration files ...
    SAGE_ROOT=/tmp/yaourt-tmp-duke/aur-sage-mathematics/src/sage-4.8
    (sage subshell) cii:eclib-20100711.p0 duke$ make
    make: *** No targets specified and no makefile found. Stop.
    SAGE_ROOT=/tmp/yaourt-tmp-duke/aur-sage-mathematics/src/sage-4.8
    (sage subshell) cii:eclib-20100711.p0 duke$ ./configure
    bash: ./configure: No such file or directory
    SAGE_ROOT=/tmp/yaourt-tmp-duke/aur-sage-mathematics/src/sage-4.8
    (sage subshell) cii:eclib-20100711.p0 duke$ ls
    spkg-check spkg-install SPKG.txt src
    SAGE_ROOT=/tmp/yaourt-tmp-duke/aur-sage-mathematics/src/sage-4.8
    (sage subshell) cii:eclib-20100711.p0 duke$ ./spkg-install
    Deleting old versions of eclib libraries, which
    would interfere with new builds.
    rm: cannot remove `libcurvesntl.*': No such file or directory
    rm: cannot remove `libg0nntl.*': No such file or directory
    rm: cannot remove `libjcntl.*': No such file or directory
    rm: cannot remove `librankntl.*': No such file or directory
    rm: cannot remove `libmwrank.*': No such file or directory
    Deleting old include directory
    mkdir -p include
    mkdir -p lib
    cd procs && make lib install
    make[1]: Entering directory `/tmp/yaourt-tmp-duke/aur-sage-mathematics/src/sage-4.8/spkg/build/eclib-20100711.p0/src/procs'
    Makefile:92: warning: overriding recipe for target `clean'
    ../Makefile:76: warning: ignoring old recipe for target `clean'
    Makefile:95: warning: overriding recipe for target `veryclean'
    ../Makefile:84: warning: ignoring old recipe for target `veryclean'
    Makefile:108: warning: overriding recipe for target `check'
    ../Makefile:95: warning: ignoring old recipe for target `check'
    ar r libjcntl.a interface_n.o arith_n.o marith_n.o gpslave_n.o conic_n.o legendre_n.o unimod_n.o quadratic_n.o cubic_n.o illl_n.o hilbert_n.o parifact_n.o p2points_n.o compproc_n.o kbessel_n.o vector_n.o matrix_n.o subspace_n.o mvector_n.o mmatrix_n.o msubspace_n.o xsplit2_n.o timer_n.o svector_n.o smatrix_n.o smatrix_elim_n.o polys_n.o realroots_n.o gf_n.o
    ranlib libjcntl.a
    chmod a+r *
    (cd ../include; rm -f interface.h templates.h arith.h xmod.h marith.h gpslave.h compproc.h vec.h vector.h mat.h matrix.h sub.h subspace.h rat.h bigrat.h kbessel.h svec.h svector.h smat.h smatrix.h smat_elim.h smatrix_elim.h mvector.h mmatrix.h msubspace.h method.h splitbase.h xsplit.h conic.h legendre.h quadratic.h unimod.h illl.h hilbert.h timer.h cubic.h gf.h polys.h realroots.h parifact.h p2points.h)
    cp -p interface.h templates.h arith.h xmod.h marith.h gpslave.h compproc.h vec.h vector.h mat.h matrix.h sub.h subspace.h rat.h bigrat.h kbessel.h svec.h svector.h smat.h smatrix.h smat_elim.h smatrix_elim.h mvector.h mmatrix.h msubspace.h method.h splitbase.h xsplit.h conic.h legendre.h quadratic.h unimod.h illl.h hilbert.h timer.h cubic.h gf.h polys.h realroots.h parifact.h p2points.h ../include
    chmod a+r ../include/*.h
    rm -f ../lib/libjcntl.a
    ar r ../lib/libjcntl.a interface_n.o arith_n.o marith_n.o gpslave_n.o conic_n.o legendre_n.o unimod_n.o quadratic_n.o cubic_n.o illl_n.o hilbert_n.o parifact_n.o p2points_n.o compproc_n.o kbessel_n.o vector_n.o matrix_n.o subspace_n.o mvector_n.o mmatrix_n.o msubspace_n.o xsplit2_n.o timer_n.o svector_n.o smatrix_n.o smatrix_elim_n.o polys_n.o realroots_n.o gf_n.o
    ar: creating ../lib/libjcntl.a
    ranlib ../lib/libjcntl.a
    chmod a+rx ../lib/libjcntl.a
    make[1]: Leaving directory `/tmp/yaourt-tmp-duke/aur-sage-mathematics/src/sage-4.8/spkg/build/eclib-20100711.p0/src/procs'
    cd qcurves && make lib install
    make[1]: Entering directory `/tmp/yaourt-tmp-duke/aur-sage-mathematics/src/sage-4.8/spkg/build/eclib-20100711.p0/src/qcurves'
    Makefile:123: warning: overriding recipe for target `clean'
    ../Makefile:76: warning: ignoring old recipe for target `clean'
    Makefile:126: warning: overriding recipe for target `veryclean'
    ../Makefile:84: warning: ignoring old recipe for target `veryclean'
    Makefile:134: warning: overriding recipe for target `check'
    ../Makefile:95: warning: ignoring old recipe for target `check'
    make[1]: Nothing to be done for `lib'.
    (cd ../include; rm -f curve.h points.h cperiods.h isogs.h reader.h mwprocs.h lambda.h sifter.h sieve_search.h htconst.h egr.h saturate.h divpol.h pointsmod.h curvemod.h ffmod.h tlss.h elog.h getcurve.h )
    for f in curve.h points.h cperiods.h isogs.h reader.h mwprocs.h lambda.h sifter.h sieve_search.h htconst.h egr.h saturate.h divpol.h pointsmod.h curvemod.h ffmod.h tlss.h elog.h getcurve.h ; \
    do cp ${f} ../include; \
    done
    chmod a+r ../include/*
    rm -f ../lib/libcurvesntl.a
    cp libcurvesntl.a ../lib
    chmod a+rx ../lib/libcurvesntl.a
    make[1]: Leaving directory `/tmp/yaourt-tmp-duke/aur-sage-mathematics/src/sage-4.8/spkg/build/eclib-20100711.p0/src/qcurves'
    cd qrank && make lib install
    make[1]: Entering directory `/tmp/yaourt-tmp-duke/aur-sage-mathematics/src/sage-4.8/spkg/build/eclib-20100711.p0/src/qrank'
    Makefile:78: warning: overriding recipe for target `clean'
    ../Makefile:76: warning: ignoring old recipe for target `clean'
    Makefile:122: warning: overriding recipe for target `veryclean'
    ../Makefile:84: warning: ignoring old recipe for target `veryclean'
    Makefile:146: warning: overriding recipe for target `check'
    ../Makefile:95: warning: ignoring old recipe for target `check'
    rm -f librankntl.a
    ar r librankntl.a mrank1_n.o mrank2_n.o mequiv_n.o mquartic_n.o mlocsol_n.o mglobsol_n.o qc_n.o sqfdiv_n.o desc2_n.o transform_n.o minim_n.o reduce_n.o bitspace_n.o GetOpt_n.o twoadic_n.o descent_n.o
    ar: creating librankntl.a
    ranlib librankntl.a
    (cd ../include; rm -f mrank2.h mequiv.h mlocsol.h mglobsol.h msoluble.h mquartic.h mrank1.h qc.h sqfdiv.h version.h minim.h reduce.h transform.h desc2.h bitspace.h options.h GetOpt.h twoadic.h descent.h)
    for f in mrank2.h mequiv.h mlocsol.h mglobsol.h msoluble.h mquartic.h mrank1.h qc.h sqfdiv.h version.h minim.h reduce.h transform.h desc2.h bitspace.h options.h GetOpt.h twoadic.h descent.h; \
    do cp ${f} ../include; \
    done
    chmod a+r ../include/*
    rm -f ../lib/librankntl.a
    cp librankntl.a ../lib
    chmod a+rx ../lib/librankntl.a
    make[1]: Leaving directory `/tmp/yaourt-tmp-duke/aur-sage-mathematics/src/sage-4.8/spkg/build/eclib-20100711.p0/src/qrank'
    cd g0n && make lib install
    make[1]: Entering directory `/tmp/yaourt-tmp-duke/aur-sage-mathematics/src/sage-4.8/spkg/build/eclib-20100711.p0/src/g0n'
    Makefile:115: warning: overriding recipe for target `clean'
    ../Makefile:76: warning: ignoring old recipe for target `clean'
    Makefile:118: warning: overriding recipe for target `veryclean'
    ../Makefile:84: warning: ignoring old recipe for target `veryclean'
    Makefile:121: warning: overriding recipe for target `check'
    ../Makefile:95: warning: ignoring old recipe for target `check'
    make[1]: Nothing to be done for `lib'.
    (cd ../include; rm -f periods.h cusp.h homspace.h newforms.h nflist.h moddata.h oldforms.h symb.h fixc6.h pcprocs.h)
    for f in periods.h cusp.h homspace.h newforms.h nflist.h moddata.h oldforms.h symb.h fixc6.h pcprocs.h; \
    do cp ${f} ../include; \
    done
    chmod a+r ../include/*
    rm -f ../lib/libg0nntl.a
    cp libg0nntl.a ../lib
    chmod a+rx ../lib/libg0nntl.a
    make[1]: Leaving directory `/tmp/yaourt-tmp-duke/aur-sage-mathematics/src/sage-4.8/spkg/build/eclib-20100711.p0/src/g0n'
    cd procs && make install_so && make tests progs
    make[1]: Entering directory `/tmp/yaourt-tmp-duke/aur-sage-mathematics/src/sage-4.8/spkg/build/eclib-20100711.p0/src/procs'
    Makefile:92: warning: overriding recipe for target `clean'
    ../Makefile:76: warning: ignoring old recipe for target `clean'
    Makefile:95: warning: overriding recipe for target `veryclean'
    ../Makefile:84: warning: ignoring old recipe for target `veryclean'
    Makefile:108: warning: overriding recipe for target `check'
    ../Makefile:95: warning: ignoring old recipe for target `check'
    g++ -fPIC --shared libjcntl.a interface_n.o arith_n.o marith_n.o gpslave_n.o conic_n.o legendre_n.o unimod_n.o quadratic_n.o cubic_n.o illl_n.o hilbert_n.o parifact_n.o p2points_n.o compproc_n.o kbessel_n.o vector_n.o matrix_n.o subspace_n.o mvector_n.o mmatrix_n.o msubspace_n.o xsplit2_n.o timer_n.o svector_n.o smatrix_n.o smatrix_elim_n.o polys_n.o realroots_n.o gf_n.o -o libjcntl.so -L/tmp/yaourt-tmp-duke/aur-sage-mathematics/src/sage-4.8/local/lib -lntl -lgmp -lpari -lpari -L/tmp/yaourt-tmp-duke/aur-sage-mathematics/src/sage-4.8/local/lib -L/tmp/yaourt-tmp-duke/aur-sage-mathematics/src/sage-4.8/local/lib -lntl -lgmp -lpari -lm
    cp libjcntl.so ../lib/
    make[1]: Leaving directory `/tmp/yaourt-tmp-duke/aur-sage-mathematics/src/sage-4.8/spkg/build/eclib-20100711.p0/src/procs'
    make[1]: Entering directory `/tmp/yaourt-tmp-duke/aur-sage-mathematics/src/sage-4.8/spkg/build/eclib-20100711.p0/src/procs'
    Makefile:92: warning: overriding recipe for target `clean'
    ../Makefile:76: warning: ignoring old recipe for target `clean'
    Makefile:95: warning: overriding recipe for target `veryclean'
    ../Makefile:84: warning: ignoring old recipe for target `veryclean'
    Makefile:108: warning: overriding recipe for target `check'
    ../Makefile:95: warning: ignoring old recipe for target `check'
    make[1]: Nothing to be done for `tests'.
    make[1]: Nothing to be done for `progs'.
    make[1]: Leaving directory `/tmp/yaourt-tmp-duke/aur-sage-mathematics/src/sage-4.8/spkg/build/eclib-20100711.p0/src/procs'
    cd qcurves && make install_so && make tests progs
    make[1]: Entering directory `/tmp/yaourt-tmp-duke/aur-sage-mathematics/src/sage-4.8/spkg/build/eclib-20100711.p0/src/qcurves'
    Makefile:123: warning: overriding recipe for target `clean'
    ../Makefile:76: warning: ignoring old recipe for target `clean'
    Makefile:126: warning: overriding recipe for target `veryclean'
    ../Makefile:84: warning: ignoring old recipe for target `veryclean'
    Makefile:134: warning: overriding recipe for target `check'
    ../Makefile:95: warning: ignoring old recipe for target `check'
    cp libcurvesntl.so ../lib/
    make[1]: Leaving directory `/tmp/yaourt-tmp-duke/aur-sage-mathematics/src/sage-4.8/spkg/build/eclib-20100711.p0/src/qcurves'
    make[1]: Entering directory `/tmp/yaourt-tmp-duke/aur-sage-mathematics/src/sage-4.8/spkg/build/eclib-20100711.p0/src/qcurves'
    Makefile:123: warning: overriding recipe for target `clean'
    ../Makefile:76: warning: ignoring old recipe for target `clean'
    Makefile:126: warning: overriding recipe for target `veryclean'
    ../Makefile:84: warning: ignoring old recipe for target `veryclean'
    Makefile:134: warning: overriding recipe for target `check'
    ../Makefile:95: warning: ignoring old recipe for target `check'
    make[1]: Nothing to be done for `tests'.
    g++ -o ./torsion torsion_n.o libcurvesntl.a -ljcntl -L../lib -lpari -L/tmp/yaourt-tmp-duke/aur-sage-mathematics/src/sage-4.8/local/lib -L/tmp/yaourt-tmp-duke/aur-sage-mathematics/src/sage-4.8/local/lib -lntl -L../lib -lgmp -lpari -lm
    g++ -c -fPIC -g -O2 -DNEW_OP_ORDER -DUSE_PARI_FACTORING -I../include -DNTL_ALL -I/tmp/yaourt-tmp-duke/aur-sage-mathematics/src/sage-4.8/local/include -I/tmp/yaourt-tmp-duke/aur-sage-mathematics/src/sage-4.8/local/include conductor.cc -o conductor_n.o
    g++ -o ./conductor conductor_n.o libcurvesntl.a -ljcntl -L../lib -lpari -L/tmp/yaourt-tmp-duke/aur-sage-mathematics/src/sage-4.8/local/lib -L/tmp/yaourt-tmp-duke/aur-sage-mathematics/src/sage-4.8/local/lib -lntl -L../lib -lgmp -lpari -lm
    g++ -c -fPIC -g -O2 -DNEW_OP_ORDER -DUSE_PARI_FACTORING -I../include -DNTL_ALL -I/tmp/yaourt-tmp-duke/aur-sage-mathematics/src/sage-4.8/local/include -I/tmp/yaourt-tmp-duke/aur-sage-mathematics/src/sage-4.8/local/include twist.cc -o twist_n.o
    g++ -o ./twist twist_n.o libcurvesntl.a -ljcntl -L../lib -lpari -L/tmp/yaourt-tmp-duke/aur-sage-mathematics/src/sage-4.8/local/lib -L/tmp/yaourt-tmp-duke/aur-sage-mathematics/src/sage-4.8/local/lib -lntl -L../lib -lgmp -lpari -lm
    g++ -c -fPIC -g -O2 -DNEW_OP_ORDER -DUSE_PARI_FACTORING -I../include -DNTL_ALL -I/tmp/yaourt-tmp-duke/aur-sage-mathematics/src/sage-4.8/local/include -I/tmp/yaourt-tmp-duke/aur-sage-mathematics/src/sage-4.8/local/include allisog.cc -o allisog_n.o
    g++ -o ./allisog allisog_n.o libcurvesntl.a -ljcntl -L../lib -lpari -L/tmp/yaourt-tmp-duke/aur-sage-mathematics/src/sage-4.8/local/lib -L/tmp/yaourt-tmp-duke/aur-sage-mathematics/src/sage-4.8/local/lib -lntl -L../lib -lgmp -lpari -lm
    g++ -c -fPIC -g -O2 -DNEW_OP_ORDER -DUSE_PARI_FACTORING -I../include -DNTL_ALL -I/tmp/yaourt-tmp-duke/aur-sage-mathematics/src/sage-4.8/local/include -I/tmp/yaourt-tmp-duke/aur-sage-mathematics/src/sage-4.8/local/include findinf.cc -o findinf_n.o
    g++ -o ./findinf findinf_n.o libcurvesntl.a -ljcntl -L../lib -lpari -L/tmp/yaourt-tmp-duke/aur-sage-mathematics/src/sage-4.8/local/lib -L/tmp/yaourt-tmp-duke/aur-sage-mathematics/src/sage-4.8/local/lib -lntl -L../lib -lgmp -lpari -lm
    g++ -c -fPIC -g -O2 -DNEW_OP_ORDER -DUSE_PARI_FACTORING -I../include -DNTL_ALL -I/tmp/yaourt-tmp-duke/aur-sage-mathematics/src/sage-4.8/local/include -I/tmp/yaourt-tmp-duke/aur-sage-mathematics/src/sage-4.8/local/include indep.cc -o indep_n.o
    g++ -o ./indep indep_n.o libcurvesntl.a -ljcntl -L../lib -lpari -L/tmp/yaourt-tmp-duke/aur-sage-mathematics/src/sage-4.8/local/lib -L/tmp/yaourt-tmp-duke/aur-sage-mathematics/src/sage-4.8/local/lib -lntl -L../lib -lgmp -lpari -lm
    make[1]: Leaving directory `/tmp/yaourt-tmp-duke/aur-sage-mathematics/src/sage-4.8/spkg/build/eclib-20100711.p0/src/qcurves'
    cd qrank && make install_so && make tests progs
    make[1]: Entering directory `/tmp/yaourt-tmp-duke/aur-sage-mathematics/src/sage-4.8/spkg/build/eclib-20100711.p0/src/qrank'
    Makefile:78: warning: overriding recipe for target `clean'
    ../Makefile:76: warning: ignoring old recipe for target `clean'
    Makefile:122: warning: overriding recipe for target `veryclean'
    ../Makefile:84: warning: ignoring old recipe for target `veryclean'
    Makefile:146: warning: overriding recipe for target `check'
    ../Makefile:95: warning: ignoring old recipe for target `check'
    g++ -fPIC --shared librankntl.a mrank1_n.o mrank2_n.o mequiv_n.o mquartic_n.o mlocsol_n.o mglobsol_n.o qc_n.o sqfdiv_n.o desc2_n.o transform_n.o minim_n.o reduce_n.o bitspace_n.o GetOpt_n.o twoadic_n.o descent_n.o -o librankntl.so -L/tmp/yaourt-tmp-duke/aur-sage-mathematics/src/sage-4.8/local/lib -lntl -L../lib -lgmp -lpari -L../lib -lcurvesntl -ljcntl -lpari -L/tmp/yaourt-tmp-duke/aur-sage-mathematics/src/sage-4.8/local/lib -L/tmp/yaourt-tmp-duke/aur-sage-mathematics/src/sage-4.8/local/lib -lntl -L../lib -lgmp -lpari -lpari -lm
    cp librankntl.so ../lib/
    make[1]: Leaving directory `/tmp/yaourt-tmp-duke/aur-sage-mathematics/src/sage-4.8/spkg/build/eclib-20100711.p0/src/qrank'
    make[1]: Entering directory `/tmp/yaourt-tmp-duke/aur-sage-mathematics/src/sage-4.8/spkg/build/eclib-20100711.p0/src/qrank'
    Makefile:78: warning: overriding recipe for target `clean'
    ../Makefile:76: warning: ignoring old recipe for target `clean'
    Makefile:122: warning: overriding recipe for target `veryclean'
    ../Makefile:84: warning: ignoring old recipe for target `veryclean'
    Makefile:146: warning: overriding recipe for target `check'
    ../Makefile:95: warning: ignoring old recipe for target `check'
    g++ -c -fPIC -g -O2 -DNEW_OP_ORDER -DUSE_PARI_FACTORING -I../include -DNTL_ALL -I/tmp/yaourt-tmp-duke/aur-sage-mathematics/src/sage-4.8/local/include -I/tmp/yaourt-tmp-duke/aur-sage-mathematics/src/sage-4.8/local/include version.cc -o version_n.o
    g++ -c -fPIC -g -O2 -DNEW_OP_ORDER -DUSE_PARI_FACTORING -I../include -DNTL_ALL -I/tmp/yaourt-tmp-duke/aur-sage-mathematics/src/sage-4.8/local/include -I/tmp/yaourt-tmp-duke/aur-sage-mathematics/src/sage-4.8/local/include mwrank.cc -o mwrank_n.o
    chmod og+r *
    g++ -o mwrank version_n.o mwrank_n.o descent_n.o mrank1_n.o mrank2_n.o mequiv_n.o mquartic_n.o \
    mlocsol_n.o mglobsol_n.o qc_n.o sqfdiv_n.o desc2_n.o \
    transform_n.o minim_n.o reduce_n.o bitspace_n.o GetOpt_n.o twoadic_n.o \
    -L../lib -lcurvesntl -ljcntl -lpari -L/tmp/yaourt-tmp-duke/aur-sage-mathematics/src/sage-4.8/local/lib -L/tmp/yaourt-tmp-duke/aur-sage-mathematics/src/sage-4.8/local/lib -lntl -L../lib -lgmp -lpari -lpari -lm
    collect2: ld returned 1 exit status
    make[1]: *** [mwrank] Error 1
    make[1]: Leaving directory `/tmp/yaourt-tmp-duke/aur-sage-mathematics/src/sage-4.8/spkg/build/eclib-20100711.p0/src/qrank'
    make: *** [so] Error 2
    Error building eclib shared libraries
    SAGE_ROOT=/tmp/yaourt-tmp-duke/aur-sage-mathematics/src/sage-4.8

    I'm getting something slightly different when I try to build this package. They all seem to be the same as this, except with different function names.
    error: ‘mulColDense’ was not declared in this scope, and no declarations were found by argument-dependent lookup at the point of instantiation [-fpermissive]
    Does anyone have any ideas on how to remedy this?

  • Failed to build mocha shape data

    Hello,
    I come with error that adobe is sending me when im trying to paste my mocha shape data in AE.
    This is what is showing in message :
    "AEGP Plugin MochaShapeConverter : Failed to build correct mocha shape data.
    ( 5027 :: 12 )"
    I took some steps to work it out and reinstalled software, cleaned registry, purged disk cash and all memory.
    This occured suddenly. There was no such problems in my earlier work.
    I did some searching. Still cant find solution on any forum.

    Sorry. System is Windows 7 x64, version of ae 13.0.0.214, version of mocha 3.2.1 .
    I cant move forward with project. I think this kind of problem must be common for all users, so it would be great to find possible solution.

  • [SOLVED] Surf-hg and tabbed-hg from aur fail to build

    Hi,
    I'm trying to install surf-hg and tabbed-hg from aur and when I makepkg -i this happens:
    ==> ERROR: A failure occurred in build().
    Aborting...
    I've tried to apply this patch to surf's config.mk but it fails anyway.
    diff -paur surf/config.mk surf.new/config.mk
    --- surf/config.mk 2012-01-29 11:46:00.851597838 +0100
    +++ surf.new/config.mk 2012-01-29 11:46:36.633503895 +0100
    @@ -15,7 +15,7 @@ GTKLIB = `pkg-config --libs gtk+-2.0 web
    # includes and libs
    INCS = -I. -I/usr/include -I${X11INC} ${GTKINC}
    -LIBS = -L/usr/lib -lc -L${X11LIB} -lX11 ${GTKLIB} -lgthread-2.0
    +LIBS = -L/usr/lib -lc -L${X11LIB} -lX11 ${GTKLIB} -lgthread-2.0 -ljavascriptcoregtk-1.0
    # flags
    CPPFLAGS = -DVERSION=\"${VERSION}\"
    Can anyone help me please?
    Last edited by whooper (2012-03-01 21:42:10)

    Yes they both fail to build, manually or with packer.
    I deleted the src directory but it still fails.
    packer -S surf-hg
    Aur Targets (1): surf-hg
    Proceed with installation? [Y/n] y
    Edit surf-hg PKGBUILD with $EDITOR? [Y/n] n
    ==> Determining latest hg revision...
    pulling from http://hg.suckless.org/surf
    searching for changes
    no changes found
    -> Version found: 238
    ==> Making package: surf-hg 238-1 (Thu Mar 1 00:27:47 WET 2012)
    ==> Checking runtime dependencies...
    ==> Checking buildtime dependencies...
    ==> Retrieving Sources...
    ==> Extracting Sources...
    ==> Removing existing pkg/ directory...
    ==> Entering fakeroot environment...
    ==> Starting build()...
    cleaning
    pulling from http://hg.suckless.org/surf
    searching for changes
    no changes found
    ==> ERROR: A failure occurred in build().
    Aborting...
    The build failed.

  • [Solved] Forms 10g .fmb Fails to Build ...

    Hi,
    I've been working on a 6i to 10g conversion and we're down to the last few Forms. One Form (originally written by a person no longer working at the company so has non-standard look and feel) doesn't build under 10g - but it's fine under 6i.
    By this, I mean Shift-Ctrl-K works fine for the PL/SQL but a Control-T will crash Forms builder.
    It also fails to build using the command line and it fails in both Windows and on AIX.
    It's a tricky one as there doesn't seem to be anything special about the Form and there isn't any error - as Builder has crashed.
    Has anyone come across anything like this ? and has any useful suggestions to find where to look ? (I'm currently removing things from the Form to see when it'll build)
    Steve

    It turns out that this is the same problem that Kevin had : there was a column in the Form with the "Column Name" defined as :
    box_barcode1 || '  ' || box_barcode2 || '  ' ||  box_barcode3  || '  '|| box_barcode3 || '  ' || box_barcode4 || '  ' || box_barcode5This has a length of 133 characters which appears to crash 10g.
    Here's a simple JDAPI to find these things out :
    package MyExamples;
    import oracle.forms.jdapi.*;
    public class ShowItems
       * @param args
      public static void main(String[] args)
        try
           for ( int c=0; c < args.length; c++ )
             JdapiModule.openModule(args[c]);
           invoke();
        finally
          Jdapi.shutdown();
      private static void invoke()
         for (JdapiIterator mods = Jdapi.getModules(); mods.hasNext(); ) {
           FormModule mod = (FormModule)(JdapiModule)mods.next();
           System.out.println("Form : " + mod.getName());
           for (JdapiIterator blocks = mod.getBlocks() ; blocks.hasNext(); ) {
             Block blk = (Block)blocks.next();
             for (JdapiIterator items = blk.getItems(); items.hasNext(); ) {
               Item itm = (Item)items.next();
               if ( itm.isDatabaseItem() && ! itm.getColumnName().equals("") && itm.getColumnName().length() > 123 ) {
                 System.out.println("Item : "+blk.getName()+"."+itm.getName()+" Column <"+itm.getColumnName()+"> length="+itm.getColumnName().length());
    }Hope this is useful !
    Steve

  • Failed to build Java Mail API 1.4.5 with maven-3.0.4

    Hi,
    I am trying to build Java Mail 1.4.5 with Maven-3.0.4 using default settings of maven.
    It is getting failed to build due to following errors -
    [ERROR] COMPILATION ERROR :
    [INFO] -----------------------------------------------------------
    [ERROR] \Workarea\mySourceData\src\Mail\mail\src\main\java\javax\mail\Session.java:[210,37] cannot find symbol
    symbol : variable Version
    location: class javax.mail.Session
    [ERROR] \Workarea\mySourceData\src\Mail\mail\src\main\java\javax\mail\Session.java:[369,47] cannot find symbol
    symbol : variable Version
    location: class javax.mail.Session
    [ERROR] \Workarea\mySourceData\src\Mail\mail\src\main\java\javax\mail\Session.java:[913,29] cannot find symbol
    symbol : variable Version
    location: class javax.mail.Session
    [ERROR] \Workarea\mySourceData\src\Mail\mail\src\main\java\javax\mail\Session.java:[916,29] cannot find symbol
    symbol : variable Version
    location: class javax.mail.Session
    [ERROR] \Workarea\mySourceData\src\Mail\mail\src\main\java\javax\mail\Session.java:[919,29] cannot find symbol
    symbol : variable Version
    location: class javax.mail.Session
    [ERROR] \Workarea\mySourceData\src\Mail\mail\src\main\java\javax\mail\Session.java:[922,29] cannot find symbol
    symbol : variable Version
    location: class javax.mail.Session
    [ERROR] \Workarea\mySourceData\src\Mail\mail\src\main\java\javax\mail\Session.java:[925,29] cannot find symbol
    symbol : variable Version
    location: class javax.mail.Session
    [ERROR] \Workarea\mySourceData\src\Mail\mail\src\main\java\javax\mail\Session.java:[928,29] cannot find symbol
    symbol : variable Version
    location: class javax.mail.Session
    [INFO] 8 errors
    [INFO] -----------------------------------------------------------
    [INFO] ----------------------------------------------------------------------
    [INFO] BUILD FAILURE
    [INFO] ----------------------------------------------------------------------
    [INFO] Total time: 1:51.197s
    [INFO] Finished at: Tue Jan 08 13:06:01 IST 2013
    [INFO] Final Memory: 12M/67M
    [INFO] ----------------------------------------------------------------------
    [ERROR] Failed to execute goal org.apache.maven.plugins:maven-compiler-plugin:2.
    3.2:compile (default-compile) on project javax.mail: Compilation failure: Compil
    ation failure:
    [ERROR] \Workarea\mySourceData\src\Mail\mail\src\main\java\javax\mail\Session.java:[210,37] cannot find symbol
    [ERROR] symbol : variable Version
    [ERROR] location: class javax.mail.Session
    [ERROR]\Workarea\mySourceData\src\Mail\mail\src\main\java\javax\mail\Session.java:[369,47] cannot find symbol
    [ERROR] symbol : variable Version
    [ERROR] location: class javax.mail.Session
    [ERROR] \Workarea\mySourceData\src\Mail\mail\src\main\java\javax\mail\Session.java:[913,29] cannot find symbol
    [ERROR] symbol : variable Version
    [ERROR] location: class javax.mail.Session
    [ERROR] \Workarea\mySourceData\src\Mail\mail\src\main\java\javax\mail\Session.java:[916,29] cannot find symbol
    [ERROR] symbol : variable Version
    [ERROR] location: class javax.mail.Session
    [ERROR] \Workarea\mySourceData\src\Mail\mail\src\main\java\javax\mail\Session.java:[919,29] cannot find symbol
    [ERROR] symbol : variable Version
    [ERROR] location: class javax.mail.Session
    [ERROR] \Workarea\mySourceData\src\Mail\mail\src\main\java\javax\mail\Session.java:[922,29] cannot find symbol
    [ERROR] symbol : variable Version
    [ERROR] location: class javax.mail.Session
    [ERROR]\Workarea\mySourceData\src\Mail\mail\src\main\java\javax\mail\Session.java:[925,29] cannot find symbol
    [ERROR] symbol : variable Version
    [ERROR] location: class javax.mail.Session
    [ERROR] \Workarea\mySourceData\src\Mail\mail\src\main\java\javax\mail\Session.java:[928,29] cannot find symbol
    [ERROR] symbol : variable Version
    [ERROR] location: class javax.mail.Session
    [ERROR] -> [Help 1]
    org.apache.maven.lifecycle.LifecycleExecutionException: Failed to execute goal o
    rg.apache.maven.plugins:maven-compiler-plugin:2.3.2:compile (default-compile) on
    project javax.mail: Compilation failure
    at org.apache.maven.lifecycle.internal.MojoExecutor.execute(MojoExecutor
    .java:213)
    at org.apache.maven.lifecycle.internal.MojoExecutor.execute(MojoExecutor
    .java:153)
    at org.apache.maven.lifecycle.internal.MojoExecutor.execute(MojoExecutor
    .java:145)
    at org.apache.maven.lifecycle.internal.LifecycleModuleBuilder.buildProje
    ct(LifecycleModuleBuilder.java:84)
    at org.apache.maven.lifecycle.internal.LifecycleModuleBuilder.buildProje
    ct(LifecycleModuleBuilder.java:59)
    at org.apache.maven.lifecycle.internal.LifecycleStarter.singleThreadedBu
    ild(LifecycleStarter.java:183)
    at org.apache.maven.lifecycle.internal.LifecycleStarter.execute(Lifecycl
    eStarter.java:161)
    at org.apache.maven.DefaultMaven.doExecute(DefaultMaven.java:320)
    at org.apache.maven.DefaultMaven.execute(DefaultMaven.java:156)
    at org.apache.maven.cli.MavenCli.execute(MavenCli.java:537)
    at org.apache.maven.cli.MavenCli.doMain(MavenCli.java:196)
    at org.apache.maven.cli.MavenCli.main(MavenCli.java:141)
    at sun.reflect.NativeMethodAccessorImpl.invoke0(Native Method)
    at sun.reflect.NativeMethodAccessorImpl.invoke(NativeMethodAccessorImpl.
    java:57)
    at sun.reflect.DelegatingMethodAccessorImpl.invoke(DelegatingMethodAcces
    sorImpl.java:43)
    at java.lang.reflect.Method.invoke(Method.java:601)
    at org.codehaus.plexus.classworlds.launcher.Launcher.launchEnhanced(Laun
    cher.java:290)
    at org.codehaus.plexus.classworlds.launcher.Launcher.launch(Launcher.jav
    a:230)
    at org.codehaus.plexus.classworlds.launcher.Launcher.mainWithExitCode(La
    uncher.java:409)
    at org.codehaus.plexus.classworlds.launcher.Launcher.main(Launcher.java:
    352)
    Caused by: org.apache.maven.plugin.CompilationFailureException: Compilation fail
    ure
    at org.apache.maven.plugin.AbstractCompilerMojo.execute(AbstractCompiler
    Mojo.java:656)
    at org.apache.maven.plugin.CompilerMojo.execute(CompilerMojo.java:128)
    at org.apache.maven.plugin.DefaultBuildPluginManager.executeMojo(Default
    BuildPluginManager.java:101)
    at org.apache.maven.lifecycle.internal.MojoExecutor.execute(MojoExecutor
    .java:209)
    ... 19 more
    [ERROR]
    [ERROR]
    [ERROR] For more information about the errors and possible solutions, please rea
    d the following articles:
    [ERROR] [Help 1] http://cwiki.apache.org/confluence/display/MAVEN/MojoFailureExceptionSame issue I am facing when I am trying to build Java Mail with netbeans - 7.2.1, it getting failed with same version issue in Session.java class.
    How can I set this Version in Session.java class to get rid of this error?
    If we can use nexus repository then please let me know how to set this.
    Thanks,
    Neelam Sharma

    I answered this question here:
    http://stackoverflow.com/questions/14217596/failed-to-build-java-mail-api-1-4-5-with-maven-3-0-4/14288418#14288418

  • Cbs build portal application dc fail.  Build Plugin IS NOT DEFINED for this

    hi all
    I use NW7.0 ehp1,have portal and a nwdi.
    I create a track at nwdi . and develop a portal application .
    local build is ok . but when i check in .run a activitce.  dc is broken.
    log is -
    CBS Request Log - [  300/DEP_PESKM_D  ]
    Build number assigned: 314
    Change request state from QUEUED to PROCESSING
    REQUEST PROCESSING started at 2010-11-05 02:17:38.921 GMT
        ACTIVATION request in Build Space "DEP_PESKM_D" at Node ID: 13,975,650
         [id: 300; parentID: 0; type: 4]
         [options: NO OPTIONS]
        Waiting for access: 79 ms
        ===== Pre-Processing =====  started at 2010-11-05 02:17:39.000 GMT
            List of requested for activation activities:
                'deep.com_PESKM_1' compartment
                    tet
                        [ISN 111][created by YANLIANG at 2010-11-05 10:17:31.0][OID 6b2f604ae87c11df94ff000000d54062]
                There is 1 activity in compartment deep.com_PESKM_1
                1 activity will be processed by this request
            Analyze dependencies to predecessor activities... started at 2010-11-05 02:17:39.031 GMT
                Analyzing predecessors in compartment "deep.com_PESKM_1"
                    No dependencies to predecessor activities found.
            Analyze dependencies to predecessor activities... finished at 2010-11-05 02:17:39.046 GMT and took 15 ms
            Analyze versions... started at 2010-11-05 02:17:39.046 GMT
                List Active Versions Report: "HTTP/1.1 207 Multi-Status" finished at 2010-11-05 02:17:41.812 GMT and took 2 s 766 ms
                Synchronize metadata for [deep.com.cn/dc_logo_par] started at 2010-11-05 02:17:41.812 GMT
                    Verification of DL [ws/PESKM/deep.com_PESKM/dev/active/] finished at 2010-11-05 02:17:41.906 GMT and took 0 ms
                    Verification of cache (level 2: Comparison of attributes) finished at 2010-11-05 02:17:41.937 GMT and took 31 ms
                Synchronize metadata for [deep.com.cn/dc_logo_par] finished at 2010-11-05 02:17:41.937 GMT and took 125 ms
                < CHANGE > 'deep.com.cn/dc_logo_par' DC
            Analyze versions... finished at 2010-11-05 02:17:41.937 GMT and took 2 s 891 ms
            Analyze activities... started at 2010-11-05 02:17:41.937 GMT
                Loading component definitions
                1 component to be build in compartment "deep.com_PESKM_1"
            Analyze activities... finished at 2010-11-05 02:17:42.000 GMT and took 63 ms
            Calculate all combinations of components and variants to be built...
            Analyze request DC BV... started at 2010-11-05 02:17:42.109 GMT
                    'deep.com.cn/dc_logo_par' variant 'default'
                    'deep.com.cn/dc_logo_par' variant 'default' cannot be built. ACTIVATION will fail.
                    Build Plugin IS NOT DEFINED for this component or the defined Build Plugin is INVALID.
            Analyze request DC BV... finished at 2010-11-05 02:17:42.140 GMT and took 31 ms
        ===== Pre-Processing =====  finished at 2010-11-05 02:17:42.187 GMT and took 3 s 187 ms
        Change request state from PROCESSING to FAILED
        Error! The following problem(s) occurred  during request processing:
        Error! The following error occurred during request processing:Activation failed due to component "deep.com.cn/dc_logo_par" variant "default". The component is BROKEN.
    REQUEST PROCESSING finished at 2010-11-05 02:17:42.187 GMT and took 3 s 266 ms
    No build logs available for the request.
    Edited by: yan liang on Nov 5, 2010 3:12 AM

    Hi Yan,
    please check the NWDI troubleshooting guide:
    http://wiki.sdn.sap.com/wiki/display/TechTSG/%28NWDI%29%28CBS%29Q0030
    --> Understanding Broken and Dirty DCs
    https://www.sdn.sap.com/irj/scn/go/portal/prtroot/docs/library/uuid/30b7c94e-fc6b-2910-30b8-d34a7b51309e
    Did you import the dependent build plugins for the track in question?
    (tab "development" in the /devinf --> CMS webui --> Transport studio)
    See also the sap note: #1080927 - Creating CMS Tracks for Common Application Types (http://service.sap.com/sap/support/notes/1080927)
    Best Regards,
    Ervin

  • Failed to build ipa after air sdk 16.272

    Our setting is flex 4.6 + air sdk.
    We are able to build our ipa with air 16.272.
    However, after updating the sdk to either 16.292 or using air 17, both them failed to build ipa.
    The error message is :
    Anyone knows what's causing the problem?

    I found best solution i could expect after i had little nice chat with Apple's developer helpdesk.
    This is response from Apple developer support specialist:
    Thanks for contacting Developer Technical Support. The size limits for binaries are not well documented, so I can understand your confusion. Size limit vary depending on the minimum OS for your app. 
    Your app has a minOS of 5.1.1, so iTunes Connect is enforcing an older binary limit of 80MB for the entire binary (the total of all slices).
    If you had a minOS of iOS 7 or higher, you’d see limits of 60MB per slice. (This is due to changes in the OS to allow for larger individual slices.)
    You are correct that the limit is on the __TEXT section.
    The most expedient way to resolve this issue is to increase your minimum OS requirements to at least iOS 7. According to the most recently information on our Developer website, 98% of devices are using iOS 7 or 8.
    (slice) - code compiled for one of architectures, we have two slices armv7 and arm64
    So you need to set MinimumOSVersion in application XML:
    <InfoAdditions>
                <![CDATA[
                  <key>UIDeviceFamily</key>
                <array>
                <string>2</string><!-- iPad -->
                </array>
                <key>MinimumOSVersion</key>
                <string>8.0.0</string>
      ]]>
            </InfoAdditions>
    And BOOM - you get 120mb limit!

Maybe you are looking for

  • Need inputs regarding the dvd drive on primary ide channel.

    Specs: Motherboard: MSI P35 Neo3 (MS-7935 1.0) CPU: Intel Core2 Duo E6550 Memory: Team Elite DDR2800 (2x1GB Dual Channel) Hard drive: Seagate Barracuda 7200.11 500GB 32MB Cache (SATA) Optical drive: LG GSA-H55L (IDE only) Firmware version 1.02 Graphi

  • SRM 7.0 catalog call, method launch_catalog

    Hi, can anyone tell me, how to call a catalog in web dynpro for Abap? I want to call al catalog similar to SRM 7.0. In SRM 7.0 the class /SAPSRM/CL_CH_WD_NAVI_SERV and the method LAUNCH_CATALOG is used to call a catalog. Does anyone have an example h

  • Shortcuts in CS4 don't work

    why is it that when I use ctrl+a to select all it doesn't work. this happens when I open an image as copy using camera raw. thanks!

  • Can we write 2 windows write_form inside loop endloop

    hi , my requirement is i have header and its table details .. and i am maintaining header in 1 window and table in other . can i write those two write form in a loop endloop. if u have any example it help alot.. thanks in advance.

  • HP 6500 need to delete from my Macs - iMac and Macbook Air

    HP 6500  need to delete from my Macs - iMac and Macbook Air, I gave up on this one that I exchanged 3 times! So how do I get the item out of my systems?