WRT54G3G – "Router not found" when trying to configure broadband cable network

Hi,
I have a WRT54G3G, v.1.1 router. I have used it successfully for ~3 years with mobile Internet (Huawei E800 card). Recently I installed broadband cable network in my place, tried to configure WRT54G3G to work with it and failed…
I tried manual configuration, and I was not able to set it up. I downloaded „Setup Wizard”, and tried all three options:
a) 3G/UMTS or GPRS
b) Broadband WAN Only
c) Broadband WAN and 3G/UMTS or GPRS
Only option a) can be completed successfully. When I try b) or c), I get following message from „Setup Wizard”: „Router not found, Please make sure the router is properly connected and try again.” I am sure I connected all cables as instructed.
When I plug cable network directly to my PC’s Ethernet slot, it is automatically configured, and all is working fine.
Can anyone advise please what to do? Thank you!
Best regards,
Jakub
Solved!
Go to Solution.

What is the ip address of your router? It seems like the WRT54G3G is already talking to your modem and is getting the connection properly. Make sure that the WRT is not on the 192.168.1.x segment. 

Similar Messages

  • Keep getting Disc Burner or software not found when trying to burn a CD

    I am not able to burn a playlist to a CD and get an error at the top of Itunes window "Disc Burner or Software Not Found". I have been able to burn CDs in the past with this same computer but had some issues with songs in itunes. Support had me uninstall Itunes and reinstall. I have also uninstalled the device in the device manager and re-installed it. I really don't know what to try except to ask for help here. I would appreciate any direction I can get. I have a Dell desktop XPS running on Windows 8.

    Hi daurel, 
    Thanks for participating in the Apple Support Communities. 
    It sounds like you receive the error "Disc Burner or Software Not Found" when trying to burn CDs. You mention that you've already tried removing and reinstalling iTunes, and other drivers, and these are good steps. 
    If the situation continues, be sure to try the tips in this article:
    iTunes for Windows: Optical drive is no longer recognized, or "Disc burner or software not found" alert after install - Apple Support
    Sincerely,
    Jeremy 

  • HT1923 did anyone get the apple application support was not found when trying to instal?

    I am having trouble instaling itunes.  has anyone got the apple application support was not found when trying to instal itunes?  it looks like it is not installing all of files to my computer and it can not reach a certain folder

    With the Error 2, let's try a standalone Apple Application Support install. It still might not install, but fingers crossed any error messages will give us a better idea of the underlying cause of the issue.
    Download and save a copy of the iTunesSetup.exe (or iTunes64setup.exe) installer file to your hard drive:
    http://www.apple.com/itunes/download/
    Download and install the free trial version of WinRAR:
    http://www.rarlab.com/
    Right-click the iTunesSetup.exe (or iTunes64Setup.exe), and select "Extract to iTunesSetup" (or "Extract to iTunes64Setup"). WinRAR will expand the contents of the file into a folder called "iTunesSetup" (or "iTunes64Setup").
    Go into the folder and doubleclick the AppleApplicationSupport.msi to do a standalone AAS install.
    Does it install properly for you?
    If instead you get an error message during the install, let us know what it says. (Precise text, please.)

  • Installed itunes update 10.5.0.142 and now get the error message "Disc Burner or Software Not Found" when trying to burn playlist to disc.

    Installed itunes update 10.5.0.142 and now get the error message "Disc Burner or Software Not Found" when trying to burn playlist to disc.  Windows 7

    Hello queenabs,
    It sounds like you are trying to burn a playlist to a disc in iTunes, but you are getting the error, "disc burner or software not found."  I found a couple of resources that I think might help with an error like this.
    I recommend starting with the steps in this article:
    iTunes for Windows: Optical drive is no longer recognized, or "Disc burner or software not found" alert after install
    http://support.apple.com/kb/TS2308
    If you are still having trouble with burning a disc after following the steps in that article, I recommend following the steps in this article:
    iTunes for Windows: Additional troubleshooting tips for burning issues
    http://support.apple.com/kb/TS1374
    Thank you for using Apple Support Communities.
    Best,
    Sheila M.

  • Why do I keep getting actionlist not found when trying to update to version 11.6.602.180?

    WHy do I keep getting actionlist not found when trying to update to update to version 11.6.602.180?

    This problem and others are outlined in this help document.  In addition, please try installing from the appropriate stand alone Windows installers located here:
    Installation Problems - Flash Player - Windows

  • It says "request resource not found" when trying to restore my iphone 4s

    it says "request resource not found" when trying to restore my iphone 4s

    This article is for iPhones that are unable to be restored.
    You may have to try recovery mode (as described below) more than once.
    http://support.apple.com/kb/HT1808

  • I keep getting result code -43 not found when trying to load certain instruments. Any idea why

    I keep getting error code -43 not found when trying to load certain instruments. Any ideas?

    Errors 3000-3999 (3004, 3013, 3014, 3018, 3164, 3194, and so on): Error codes in the 3000 range generally mean that iTunes cannot contact the update server (gs.apple.com) on ports 80 or 443.
    Update to the latest version of iTunes.
    Verify the computer's date and time are accurate.
    Check that your security or firewall software is not interfering with ports 80 or 443, or with the server gs.apple.com.
    Follow Troubleshooting security software. Often, uninstalling third-party security software will resolve these errors.
    An entry in your hosts file may be redirecting requests to gs.apple.com (see "Unable to contact the iOS software update server gs.apple.com" above).
    Internet proxy settings can cause this issue. If you are using a proxy, try without using one.
    Test restoring while connected to a known-good network.

  • E71 GPS 'route not found' when using device only s...

    Hi, earlier today I was getting help to not get AT&T network data charges.  I have set everything up per direction but now when I try to search for something and navigate to it I get 'Route not found'.  Any ideas how to fix this?
    Solved!
    Go to Solution.

    Start with a simple and obvious search string. If you give us an example of a search string that did not work we could have a look at it for you.

  • Why HTTP 404 Page not Found when trying to Backup Configuration?

    Good day:
    I bought this RV082 VPN Router.  After configuring it, I tried to save its configuration using the System Management's Backup Utility.  When I set everything up and ready to proceed, as I click on the Backup Configuration button, I get this Page Not Found error.
    After several additional retries, and cold startup of my laptop, I still get this.
    Then I wondered, "Why don't I try to upgrade the firmware instead?".
    Guess what: I get the same page not found error.
    Can anyone tell why is this?  Using Windows 7 Pro 32-bit.
    Thanks in advance!
    Javier.
    P.S. I have replied to another thread about not getting connected with Quick VPN to the RV082, which is another painful trouble I've got with it.

    Hi Rybak,  
    Thanks for your reply.
    Try to clean the Cache for TFS 2013 manually(delete the content of the folder only, not the cache folder itself):
    Clean the Cache folder on Server machine. The folder path is:
    C:\Program Files\Microsoft Team Foundation Server 12.0\Application Tier\Web Services\_tfs_data.  
    After cleaned, on Server machine, click Start and select
    Run… to open the dialog box, then input iisreset.exe and click OK, wait it run completely.
    If clean Cache cannot resolve this issue, please try to repair your TFS 2013 Update 4 Server, then check the result.
    Additionally, you can run TFS 2013 Power Tools BPA to scan the installation of your TFS Server.
    We are trying to better understand customer views on social support experience, so your participation in this interview project would be greatly appreciated if you have time. Thanks for helping make community forums a great place.
    Click
    HERE to participate the survey.

  • Sessions.xml is not found when debugging multiproject configuration

    I have a TOPLink project and it works fine when I am debugging it. But when I am debugging a servlet located in another project and uses my TOPLink project, the sessions.xml file is not found even if I pass it as an absolute path to the xmlloader. Why?
    I use the following construction:
    xmlloader = XMLSessionConfigLoader( absolute_path_of_sessions_xml );
    session = sessionmanager.getSession( xmlloader, name_of_my_session, class_loader );
    I tried to pas this.getClass().getClassLoader and
    Thread.currentThread.getContextClassLoade as class_loader, but without success. It's unbelievable. What can be the problem?

    How are you packaging you application?
    TopLink mapped classes and configuration files can be packaged directly in the WAR file under WEB-INF/classes.
    Alternatively you can package your model and configuration files in a separate JAR file in your EAR separate from the WAR file where the web application (your servlet) is located. In this case you will need to configure the WAR file to explicitly have access to the contents of the JAR file.
    There is also the option of accessing your persistence through a session bean facade using an EJB JAR file but this would not involve your servlet directly accessing the TopLink configuration.
    Can you described how you are packaging your application and we can give some more pointed guidance on classpath location of your TopLink configuration files.
    Doug

  • Error message "The specified user or domain group was not found" when trying to access certain sites

    Hello.
    My setup is as such (this is a testing environment), spread over two virtual machines:
    -Windows Server 2012 with AD DS and MS SQL Server 2012
    -SharePoint Server 2013
    When trying to access a lot of site collections in different web applications, I am given this error message. The error message started suddenly appearing, and I do not know what caused it. It started happening after I turned on Request Management Service
    Application, though I can't see how that would cause this, and it was not fixed after I turned it off.
    I have the necessary permissions, as I have been able to log on to the sites before without any issue. I am using a domain administrator account who is a site collection administrator.
    At first I thought it was an issue related to User Profile Service Application, as I was having issues starting the Synchronisation instance. I deleted and re-installed UPS, got synchronisation to work, and it still does not work. I have made no changed
    to the AD schema. I have not moved any accounts recently, and I have not deleted any accounts.
    Here are the ULS log entries. It seems to have been truncated some.
    06/11/2014 10:17:31.94 w3wp.exe (0x1904) 0x0FAC SharePoint Foundation Authentication Authorization agb9s Medium Non-OAuth request. IsAuthenticated=True, UserIdentityName=0#.w|sp\administrator, ClaimsCount=26 dbc2999c-6f92-a0b4-a4e8-f7ed10437e35
    06/11/2014 10:17:32.02 w3wp.exe (0x1904) 0x0FAC SharePoint Foundation Database ahjqp High [Forced due to logging gap, cached @ 06/11/2014 10:17:31.95, Original Level: Verbose] SQL connection time: 0.0556 dbc2999c-6f92-a0b4-a4e8-f7ed10437e35
    06/11/2014 10:17:32.02 w3wp.exe (0x1904) 0x0FAC SharePoint Foundation Files 00000 High UserAgent not available, file operations may not be optimized. at Microsoft.SharePoint.SPFileStreamManager.CreateCobaltStreamContainer(SPFileStreamStore spfs, ILockBytes ilb, Boolean copyOnFirstWrite, Boolean disposeIlb) at Microsoft.SharePoint.SPFileStreamManager.SetInputLockBytes(SPFileInfo& fileInfo, SqlSession session, PrefetchResult prefetchResult) at Microsoft.SharePoint.CoordinatedStreamBuffer.SPCoordinatedStreamBufferFactory.CreateFromDocumentRowset(Guid databaseId, SqlSession session, SPFileStreamManager spfstm, Object[] metadataRow, SPRowset contentRowset, SPDocumentBindRequest& dbreq, SPDocumentBindResults& dbres) at Microsoft.SharePoint.SPSqlClient.GetDocumentContentRow(Int32 rowOrd, Object ospFileStmMgr, SPDocumentBindRequest& dbreq, SPDocumentBindResults& dbres... dbc2999c-6f92-a0b4-a4e8-f7ed10437e35
    06/11/2014 10:17:32.02* w3wp.exe (0x1904) 0x0FAC SharePoint Foundation Files 00000 High ...) at Microsoft.SharePoint.Library.SPRequestInternalClass.GetFileAndMetaInfo(String bstrUrl, Byte bPageView, Byte bPageMode, Byte bGetBuildDependencySet, String bstrCurrentFolderUrl, Int32 iRequestVersion, Byte bMainFileRequest, Boolean& pbCanCustomizePages, Boolean& pbCanPersonalizeWebParts, Boolean& pbCanAddDeleteWebParts, Boolean& pbGhostedDocument, Boolean& pbDefaultToPersonal, Boolean& pbIsWebWelcomePage, String& pbstrSiteRoot, Guid& pgSiteId, UInt32& pdwVersion, String& pbstrTimeLastModified, String& pbstrContent, UInt32& pdwPartCount, Object& pvarMetaData, Object& pvarMultipleMeetingDoclibRootFolders, String& pbstrRedirectUrl, Boolean& pbObjectIsList, Guid& pgListId, UInt32& pdwItemId, Int64& pllListFlags, Boolean& pbAccessDenied, Guid& pgDocid, Byte& piLevel, UInt64& ppermMask, ... dbc2999c-6f92-a0b4-a4e8-f7ed10437e35
    06/11/2014 10:17:32.02* w3wp.exe (0x1904) 0x0FAC SharePoint Foundation Files 00000 High ...Object& pvarBuildDependencySet, UInt32& pdwNumBuildDependencies, Object& pvarBuildDependencies, String& pbstrFolderUrl, String& pbstrContentTypeOrder, Guid& pgDocScopeId) at Microsoft.SharePoint.Library.SPRequestInternalClass.GetFileAndMetaInfo(String bstrUrl, Byte bPageView, Byte bPageMode, Byte bGetBuildDependencySet, String bstrCurrentFolderUrl, Int32 iRequestVersion, Byte bMainFileRequest, Boolean& pbCanCustomizePages, Boolean& pbCanPersonalizeWebParts, Boolean& pbCanAddDeleteWebParts, Boolean& pbGhostedDocument, Boolean& pbDefaultToPersonal, Boolean& pbIsWebWelcomePage, String& pbstrSiteRoot, Guid& pgSiteId, UInt32& pdwVersion, String& pbstrTimeLastModified, String& pbstrContent, UInt32& pdwPartCount, Object& pvarMetaData, Object& pvarMultipleMeetingDoclibRootFolders, String& pbst... dbc2999c-6f92-a0b4-a4e8-f7ed10437e35
    06/11/2014 10:17:32.02* w3wp.exe (0x1904) 0x0FAC SharePoint Foundation Files 00000 High ...rRedirectUrl, Boolean& pbObjectIsList, Guid& pgListId, UInt32& pdwItemId, Int64& pllListFlags, Boolean& pbAccessDenied, Guid& pgDocid, Byte& piLevel, UInt64& ppermMask, Object& pvarBuildDependencySet, UInt32& pdwNumBuildDependencies, Object& pvarBuildDependencies, String& pbstrFolderUrl, String& pbstrContentTypeOrder, Guid& pgDocScopeId) at Microsoft.SharePoint.Library.SPRequest.GetFileAndMetaInfo(String bstrUrl, Byte bPageView, Byte bPageMode, Byte bGetBuildDependencySet, String bstrCurrentFolderUrl, Int32 iRequestVersion, Byte bMainFileRequest, Boolean& pbCanCustomizePages, Boolean& pbCanPersonalizeWebParts, Boolean& pbCanAddDeleteWebParts, Boolean& pbGhostedDocument, Boolean& pbDefaultToPersonal, Boolean& pbIsWebWelcomePage, String& pbstrSiteRoot, Guid& pgSiteId, UInt32& pdwVersion,... dbc2999c-6f92-a0b4-a4e8-f7ed10437e35
    06/11/2014 10:17:32.02* w3wp.exe (0x1904) 0x0FAC SharePoint Foundation Files 00000 High ... String& pbstrTimeLastModified, String& pbstrContent, UInt32& pdwPartCount, Object& pvarMetaData, Object& pvarMultipleMeetingDoclibRootFolders, String& pbstrRedirectUrl, Boolean& pbObjectIsList, Guid& pgListId, UInt32& pdwItemId, Int64& pllListFlags, Boolean& pbAccessDenied, Guid& pgDocid, Byte& piLevel, UInt64& ppermMask, Object& pvarBuildDependencySet, UInt32& pdwNumBuildDependencies, Object& pvarBuildDependencies, String& pbstrFolderUrl, String& pbstrContentTypeOrder, Guid& pgDocScopeId) at Microsoft.SharePoint.SPWeb.GetWebPartPageContent(Uri pageUrl, Int32 pageVersion, PageView requestedView, HttpContext context, Boolean forRender, Boolean includeHidden, Boolean mainFileRequest, Boolean fetchDependencyInformation, Boolean& ghostedPage, String& siteRoot, Guid& siteId, Int64& bytes, ... dbc2999c-6f92-a0b4-a4e8-f7ed10437e35
    06/11/2014 10:17:32.02* w3wp.exe (0x1904) 0x0FAC SharePoint Foundation Files 00000 High ...Guid& docId, UInt32& docVersion, String& timeLastModified, Byte& level, Object& buildDependencySetData, UInt32& dependencyCount, Object& buildDependencies, SPWebPartCollectionInitialState& initialState, Object& oMultipleMeetingDoclibRootFolders, String& redirectUrl, Boolean& ObjectIsList, Guid& listId) at Microsoft.SharePoint.ApplicationRuntime.SPRequestModuleData.FetchWebPartPageInformationForInit(HttpContext context, SPWeb spweb, Boolean mainFileRequest, String path, Boolean impersonate, Boolean& isAppWeb, Boolean& fGhostedPage, Guid& docId, UInt32& docVersion, String& timeLastModified, SPFileLevel& spLevel, String& masterPageUrl, String& customMasterPageUrl, String& webUrl, String& siteUrl, Guid& siteId, Object& buildDependencySetData, SPWebPartCollectionInitialState& initialState, ... dbc2999c-6f92-a0b4-a4e8-f7ed10437e35
    06/11/2014 10:17:32.02* w3wp.exe (0x1904) 0x0FAC SharePoint Foundation Files 00000 High ...String& siteRoot, String& redirectUrl, Object& oMultipleMeetingDoclibRootFolders, Boolean& objectIsList, Guid& listId, Int64& bytes) at Microsoft.SharePoint.ApplicationRuntime.SPRequestModuleData.GetFileForRequest(HttpContext context, SPWeb web, Boolean exclusion, String virtualPath) at Microsoft.SharePoint.ApplicationRuntime.SPRequestModule.InitContextWeb(HttpContext context, SPWeb web) at Microsoft.SharePoint.WebControls.SPControl.SPWebEnsureSPControl(HttpContext context) at Microsoft.SharePoint.ApplicationRuntime.SPRequestModule.GetContextWeb(HttpContext context) at Microsoft.SharePoint.ApplicationRuntime.SPRequestModule.PostResolveRequestCacheHandler(Object oSender, EventArgs ea) at System.Web.HttpApplication.SyncEventExecutionStep.System.Web.HttpApplication.IEx... dbc2999c-6f92-a0b4-a4e8-f7ed10437e35
    06/11/2014 10:17:32.02* w3wp.exe (0x1904) 0x0FAC SharePoint Foundation Files 00000 High ...ecutionStep.Execute() at System.Web.HttpApplication.ExecuteStep(IExecutionStep step, Boolean& completedSynchronously) at System.Web.HttpApplication.PipelineStepManager.ResumeSteps(Exception error) at System.Web.HttpApplication.BeginProcessRequestNotification(HttpContext context, AsyncCallback cb) at System.Web.HttpRuntime.ProcessRequestNotificationPrivate(IIS7WorkerRequest wr, HttpContext context) at System.Web.Hosting.PipelineRuntime.ProcessRequestNotificationHelper(IntPtr rootedObjectsPointer, IntPtr nativeRequestContext, IntPtr moduleData, Int32 flags) at System.Web.Hosting.PipelineRuntime.ProcessRequestNotification(IntPtr rootedObjectsPointer, IntPtr nativeRequestContext, IntPtr moduleData, Int32 flags) at System.Web.Hosting.UnsafeIISMethods.MgdIndicateCompl... dbc2999c-6f92-a0b4-a4e8-f7ed10437e35
    06/11/2014 10:17:32.02* w3wp.exe (0x1904) 0x0FAC SharePoint Foundation Files 00000 High ...etion(IntPtr pHandler, RequestNotificationStatus& notificationStatus) at System.Web.Hosting.UnsafeIISMethods.MgdIndicateCompletion(IntPtr pHandler, RequestNotificationStatus& notificationStatus) at System.Web.Hosting.PipelineRuntime.ProcessRequestNotificationHelper(IntPtr rootedObjectsPointer, IntPtr nativeRequestContext, IntPtr moduleData, Int32 flags) at System.Web.Hosting.PipelineRuntime.ProcessRequestNotification(IntPtr rootedObjectsPointer, IntPtr nativeRequestContext, IntPtr moduleData, Int32 flags) dbc2999c-6f92-a0b4-a4e8-f7ed10437e35
    06/11/2014 10:17:32.02 w3wp.exe (0x1904) 0x0FAC SharePoint Foundation Files aiv4w Medium Spent 0 ms to bind 3356 byte file stream dbc2999c-6f92-a0b4-a4e8-f7ed10437e35
    06/11/2014 10:17:32.02 w3wp.exe (0x1904) 0x0FAC SharePoint Foundation Logging Correlation Data xmnv Medium Site=/ dbc2999c-6f92-a0b4-a4e8-f7ed10437e35
    06/11/2014 10:17:32.02 w3wp.exe (0x1904) 0x0FAC SharePoint Foundation Monitoring b4ly High Leaving Monitored Scope (PostResolveRequestCacheHandler). Execution Time=66.6457 dbc2999c-6f92-a0b4-a4e8-f7ed10437e35
    06/11/2014 10:17:32.02 w3wp.exe (0x1904) 0x1BC0 SharePoint Portal Server User Profiles ajk4d Medium UserProfileProperty_WCFLogging::Begin ProfilePropertyServiceClient.ExecuteOnChannel acc2999c-dfbc-a0b4-a4e8-f962e574ee66
    06/11/2014 10:17:32.02 w3wp.exe (0x1904) 0x1BC0 SharePoint Portal Server User Profiles ajk35 Medium MossClientBase_WCFLogging::Begin MossClientBase.ExecuteOnChannel acc2999c-dfbc-a0b4-a4e8-f962e574ee66
    06/11/2014 10:17:32.02 w3wp.exe (0x1904) 0x1BC0 SharePoint Portal Server User Profiles ajk36 Medium MossClientBase_WCFLogging:: MossClientBase.ExecuteOnChannel - Executing codeblock on channel acc2999c-dfbc-a0b4-a4e8-f962e574ee66
    06/11/2014 10:17:32.02 w3wp.exe (0x1904) 0x1BC0 SharePoint Foundation Topology e5mc Medium WcfSendRequest: RemoteAddress: 'http://sp13:32843/44fa09d6891d4d7bb9856a0da10f6a84/ProfilePropertyService.svc' Channel: 'Microsoft.Office.Server.UserProfiles.IProfilePropertyService' Action: 'http://Microsoft.Office.Server.UserProfiles/GetProfileProperties' MessageId: 'urn:uuid:ec3c0f34-3285-4771-a7a1-24039cb4ced8' acc2999c-dfbc-a0b4-a4e8-f962e574ee66
    06/11/2014 10:17:32.03 w3wp.exe (0x1904) 0x0FAC Web Content Management Publishing 7fz3 Medium Setting [Display] as the FormContext.FormMode for the current page dbc2999c-6f92-a0b4-a4e8-f7ed10437e35
    06/11/2014 10:17:32.03 w3wp.exe (0x1904) 0x0FAC SharePoint Foundation General 8sl1 High DelegateControl: Exception thrown while adding control 'Microsoft.SharePoint.Publishing.Navigation.PortalSiteMapDataSource': Microsoft.SharePoint.SPException: The specified user or domain group was not found. ---> System.Security.Principal.IdentityNotMappedException: Some or all identity references could not be translated. at System.Security.Principal.NTAccount.Translate(IdentityReferenceCollection sourceAccounts, Type targetType, Boolean forceSuccess) at System.Security.Principal.NTAccount.Translate(Type targetType) at Microsoft.SharePoint.Administration.Claims.SPClaimProviderManager.GetProviderUserKeyClaim(IClaimsIdentity claimsIdentity, SPClaim loginClaim) --- End of inner exception stack trace --- at Microsoft.SharePoint.Administration.Claims.SPClaimProviderManager.... dbc2999c-6f92-a0b4-a4e8-f7ed10437e35
    06/11/2014 10:17:32.03* w3wp.exe (0x1904) 0x0FAC SharePoint Foundation General 8sl1 High ...GetProviderUserKeyClaim(IClaimsIdentity claimsIdentity, SPClaim loginClaim) at Microsoft.SharePoint.Administration.Claims.SPClaimProviderManager.GetProviderUserKey(IClaimsIdentity claimsIdentity, String encodedIdentityClaimSuffix) at Microsoft.SharePoint.Administration.Claims.SPClaimProviderManager.GetProviderUserKey(String encodedIdentityClaimSuffix) at Microsoft.SharePoint.Utilities.SPUtility.GetFullUserKeyFromFullName(String fullName) at Microsoft.SharePoint.SPGlobal.CreateSPRequestAndSetIdentity(SPSite site, String name, Boolean bNotGlobalAdminCode, String strUrl, Boolean bNotAddToContext, Byte[] UserToken, SPAppPrincipalToken appPrincipalToken, String userName, Boolean bIgnoreTokenTimeout, Boolean bAsAnonymous) at Microsoft.SharePoint.SPSite.get_Request() at Mi... dbc2999c-6f92-a0b4-a4e8-f7ed10437e35
    06/11/2014 10:17:32.03* w3wp.exe (0x1904) 0x0FAC SharePoint Foundation General 8sl1 High ...crosoft.SharePoint.SPSite.OpenWeb(Guid gWebId, Int32 mondoHint) at Microsoft.SharePoint.Publishing.CachedObjectFactory.OpenWebFromSuperUserSite(Guid webId) at Microsoft.SharePoint.Publishing.CacheManager..ctor(SPSite site) at Microsoft.SharePoint.Publishing.CacheManager.GetManager(SPSite site, Boolean useContextSite, Boolean allowContextSiteOptimization, Boolean refreshIfNoContext) at Microsoft.SharePoint.Publishing.CachedAreaLookup.EnsureLookup(Boolean errorsAsExceptions) at Microsoft.SharePoint.Publishing.CachedAreaLookup.GetCachedAreaOrException() at Microsoft.SharePoint.Publishing.Navigation.TaxonomyNavigationCache.GetCachedWebInfo(CachedAreaLookup cachedAreaLookup) at Microsoft.SharePoint.Publishing.Navigation.TaxonomyNavigationCache.GetWebNavigationSetting... dbc2999c-6f92-a0b4-a4e8-f7ed10437e35
    06/11/2014 10:17:32.03* w3wp.exe (0x1904) 0x0FAC SharePoint Foundation General 8sl1 High ...s(CachedAreaLookup cachedArea, CachedAreaLookup& parentCachedArea, Exception& loadError) at Microsoft.SharePoint.Publishing.Navigation.TaxonomyNavigation.GetEffectiveProviderSettingsList(CachedAreaLookup cachedArea, Boolean includeInheritedSettings) at Microsoft.SharePoint.Publishing.Navigation.TaxonomyNavigation.GetEffectiveProviderSettings[T](CachedAreaLookup cachedArea, String siteMapProviderName, Boolean includeInheritedSettings, CachedAreaLookup& cachedAreaWithSettings) at Microsoft.SharePoint.Publishing.Navigation.TaxonomyNavigation.GetEffectiveProviderSettings[T](SPWeb web, String siteMapProviderName, Boolean includeInheritedSettings) at Microsoft.SharePoint.Publishing.Navigation.SwitchableSiteMapProvider.GetCurrentWrappedProvider() at Microsoft.SharePoint.Publis... dbc2999c-6f92-a0b4-a4e8-f7ed10437e35
    06/11/2014 10:17:32.03* w3wp.exe (0x1904) 0x0FAC SharePoint Foundation General 8sl1 High ...hing.Navigation.SwitchableSiteMapProvider.get_RootNode() at Microsoft.SharePoint.Publishing.Navigation.SwitchableDataSourceBehavior.AssignProperties(SiteMapProvider targetProvider) at Microsoft.SharePoint.Publishing.Navigation.PortalSiteMapDataSource.OnInit(EventArgs e) at System.Web.UI.Control.InitRecursive(Control namingContainer) at System.Web.UI.Control.AddedControl(Control control, Int32 index) at Microsoft.SharePoint.WebControls.DelegateControl.AddControlResilient(Control ctl) dbc2999c-6f92-a0b4-a4e8-f7ed10437e35
    06/11/2014 10:17:32.03 w3wp.exe (0x1904) 0x0FAC SharePoint Foundation General 8sl1 High DelegateControl: Exception thrown while adding control 'Microsoft.SharePoint.Publishing.Navigation.PortalSiteMapDataSource': Microsoft.SharePoint.SPException: The specified user or domain group was not found. ---> System.Security.Principal.IdentityNotMappedException: Some or all identity references could not be translated. at System.Security.Principal.NTAccount.Translate(IdentityReferenceCollection sourceAccounts, Type targetType, Boolean forceSuccess) at System.Security.Principal.NTAccount.Translate(Type targetType) at Microsoft.SharePoint.Administration.Claims.SPClaimProviderManager.GetProviderUserKeyClaim(IClaimsIdentity claimsIdentity, SPClaim loginClaim) --- End of inner exception stack trace --- at Microsoft.SharePoint.Administration.Claims.SPClaimProviderManager.... dbc2999c-6f92-a0b4-a4e8-f7ed10437e35
    06/11/2014 10:17:32.03* w3wp.exe (0x1904) 0x0FAC SharePoint Foundation General 8sl1 High ...GetProviderUserKeyClaim(IClaimsIdentity claimsIdentity, SPClaim loginClaim) at Microsoft.SharePoint.Administration.Claims.SPClaimProviderManager.GetProviderUserKey(IClaimsIdentity claimsIdentity, String encodedIdentityClaimSuffix) at Microsoft.SharePoint.Administration.Claims.SPClaimProviderManager.GetProviderUserKey(String encodedIdentityClaimSuffix) at Microsoft.SharePoint.Utilities.SPUtility.GetFullUserKeyFromFullName(String fullName) at Microsoft.SharePoint.SPGlobal.CreateSPRequestAndSetIdentity(SPSite site, String name, Boolean bNotGlobalAdminCode, String strUrl, Boolean bNotAddToContext, Byte[] UserToken, SPAppPrincipalToken appPrincipalToken, String userName, Boolean bIgnoreTokenTimeout, Boolean bAsAnonymous) at Microsoft.SharePoint.SPSite.get_Request() at Mi... dbc2999c-6f92-a0b4-a4e8-f7ed10437e35
    06/11/2014 10:17:32.03* w3wp.exe (0x1904) 0x0FAC SharePoint Foundation General 8sl1 High ...crosoft.SharePoint.SPSite.OpenWeb(Guid gWebId, Int32 mondoHint) at Microsoft.SharePoint.Publishing.CachedObjectFactory.OpenWebFromSuperUserSite(Guid webId) at Microsoft.SharePoint.Publishing.CacheManager..ctor(SPSite site) at Microsoft.SharePoint.Publishing.CacheManager.GetManager(SPSite site, Boolean useContextSite, Boolean allowContextSiteOptimization, Boolean refreshIfNoContext) at Microsoft.SharePoint.Publishing.CachedAreaLookup.EnsureLookup(Boolean errorsAsExceptions) at Microsoft.SharePoint.Publishing.CachedAreaLookup.GetCachedAreaOrException() at Microsoft.SharePoint.Publishing.Navigation.TaxonomyNavigationCache.GetCachedWebInfo(CachedAreaLookup cachedAreaLookup) at Microsoft.SharePoint.Publishing.Navigation.TaxonomyNavigationCache.GetWebNavigationSetting... dbc2999c-6f92-a0b4-a4e8-f7ed10437e35
    06/11/2014 10:17:32.03* w3wp.exe (0x1904) 0x0FAC SharePoint Foundation General 8sl1 High ...s(CachedAreaLookup cachedArea, CachedAreaLookup& parentCachedArea, Exception& loadError) at Microsoft.SharePoint.Publishing.Navigation.TaxonomyNavigation.GetEffectiveProviderSettingsList(CachedAreaLookup cachedArea, Boolean includeInheritedSettings) at Microsoft.SharePoint.Publishing.Navigation.TaxonomyNavigation.GetEffectiveProviderSettings[T](CachedAreaLookup cachedArea, String siteMapProviderName, Boolean includeInheritedSettings, CachedAreaLookup& cachedAreaWithSettings) at Microsoft.SharePoint.Publishing.Navigation.TaxonomyNavigation.GetEffectiveProviderSettings[T](SPWeb web, String siteMapProviderName, Boolean includeInheritedSettings) at Microsoft.SharePoint.Publishing.Navigation.SwitchableSiteMapProvider.GetCurrentWrappedProvider() at Microsoft.SharePoint.Publis... dbc2999c-6f92-a0b4-a4e8-f7ed10437e35
    06/11/2014 10:17:32.03* w3wp.exe (0x1904) 0x0FAC SharePoint Foundation General 8sl1 High ...hing.Navigation.SwitchableSiteMapProvider.get_RootNode() at Microsoft.SharePoint.Publishing.Navigation.SwitchableDataSourceBehavior.AssignProperties(SiteMapProvider targetProvider) at Microsoft.SharePoint.Publishing.Navigation.PortalSiteMapDataSource.OnInit(EventArgs e) at System.Web.UI.Control.InitRecursive(Control namingContainer) at System.Web.UI.Control.AddedControl(Control control, Int32 index) at Microsoft.SharePoint.WebControls.DelegateControl.AddControlResilient(Control ctl) dbc2999c-6f92-a0b4-a4e8-f7ed10437e35
    06/11/2014 10:17:32.03 w3wp.exe (0x1904) 0x0FAC SharePoint Foundation General 8sl1 High DelegateControl: Exception thrown while adding control 'ASP._controltemplates_15_metadatanavtree_ascx': Microsoft.SharePoint.SPException: The specified user or domain group was not found. ---> System.Security.Principal.IdentityNotMappedException: Some or all identity references could not be translated. at System.Security.Principal.NTAccount.Translate(IdentityReferenceCollection sourceAccounts, Type targetType, Boolean forceSuccess) at System.Security.Principal.NTAccount.Translate(Type targetType) at Microsoft.SharePoint.Administration.Claims.SPClaimProviderManager.GetProviderUserKeyClaim(IClaimsIdentity claimsIdentity, SPClaim loginClaim) --- End of inner exception stack trace --- at Microsoft.SharePoint.Administration.Claims.SPClaimProviderManager.GetProviderUserKeyCla... dbc2999c-6f92-a0b4-a4e8-f7ed10437e35
    06/11/2014 10:17:32.03* w3wp.exe (0x1904) 0x0FAC SharePoint Foundation General 8sl1 High ...im(IClaimsIdentity claimsIdentity, SPClaim loginClaim) at Microsoft.SharePoint.Administration.Claims.SPClaimProviderManager.GetProviderUserKey(IClaimsIdentity claimsIdentity, String encodedIdentityClaimSuffix) at Microsoft.SharePoint.Administration.Claims.SPClaimProviderManager.GetProviderUserKey(String encodedIdentityClaimSuffix) at Microsoft.SharePoint.Utilities.SPUtility.GetFullUserKeyFromFullName(String fullName) at Microsoft.SharePoint.SPGlobal.CreateSPRequestAndSetIdentity(SPSite site, String name, Boolean bNotGlobalAdminCode, String strUrl, Boolean bNotAddToContext, Byte[] UserToken, SPAppPrincipalToken appPrincipalToken, String userName, Boolean bIgnoreTokenTimeout, Boolean bAsAnonymous) at Microsoft.SharePoint.SPSite.get_Request() at Microsoft.SharePoint.SP... dbc2999c-6f92-a0b4-a4e8-f7ed10437e35
    06/11/2014 10:17:32.03* w3wp.exe (0x1904) 0x0FAC SharePoint Foundation General 8sl1 High ...Site.OpenWeb(Guid gWebId, Int32 mondoHint) at Microsoft.SharePoint.Publishing.CachedObjectFactory.OpenWebFromSuperUserSite(Guid webId) at Microsoft.SharePoint.Publishing.CacheManager..ctor(SPSite site) at Microsoft.SharePoint.Publishing.CacheManager.GetManager(SPSite site, Boolean useContextSite, Boolean allowContextSiteOptimization, Boolean refreshIfNoContext) at Microsoft.Office.DocumentManagement.MetadataNavigation.MetadataNavigationSettings.GetCachedArea(SPWeb web) at Microsoft.Office.DocumentManagement.MetadataNavigation.MetadataNavigationContext.GetMetadataNavigationHintsForList(SPWeb web, Guid listGuid) at Microsoft.Office.DocumentManagement.MetadataNavigation.MetadataNavigationSettings.GetMetadataNavigationSettings(SPWeb web, Guid sourceListId, Boolean check... dbc2999c-6f92-a0b4-a4e8-f7ed10437e35
    06/11/2014 10:17:32.03* w3wp.exe (0x1904) 0x0FAC SharePoint Foundation General 8sl1 High ...WebPropHint) at Microsoft.Office.DocumentManagement.MetadataNavigation.MetadataNavigationContext.get_NavigationSettings() at Microsoft.Office.DocumentManagement.MetadataNavigation.MetadataNavigationContext.EnsurePageInitEventHandling(Control controlOnPage) at Microsoft.Office.Server.WebControls.MetadataHierarchyDataSourceControl.OnInit(EventArgs e) at System.Web.UI.Control.InitRecursive(Control namingContainer) at System.Web.UI.Control.InitRecursive(Control namingContainer) at System.Web.UI.Control.InitRecursive(Control namingContainer) at System.Web.UI.Control.AddedControl(Control control, Int32 index) at Microsoft.SharePoint.WebControls.DelegateControl.AddControlResilient(Control ctl) dbc2999c-6f92-a0b4-a4e8-f7ed10437e35
    06/11/2014 10:17:32.03 w3wp.exe (0x1904) 0x0FAC SharePoint Foundation General 8nca Medium Application error when access /SitePages/Home.aspx, Error=Some or all identity references could not be translated. at System.Security.Principal.NTAccount.Translate(IdentityReferenceCollection sourceAccounts, Type targetType, Boolean forceSuccess) at System.Security.Principal.NTAccount.Translate(Type targetType) at Microsoft.SharePoint.Administration.Claims.SPClaimProviderManager.GetProviderUserKeyClaim(IClaimsIdentity claimsIdentity, SPClaim loginClaim) dbc2999c-6f92-a0b4-a4e8-f7ed10437e35
    06/11/2014 10:17:32.03 w3wp.exe (0x1904) 0x0FAC SharePoint Foundation Runtime tkau Unexpected System.Security.Principal.IdentityNotMappedException: Some or all identity references could not be translated. at System.Security.Principal.NTAccount.Translate(IdentityReferenceCollection sourceAccounts, Type targetType, Boolean forceSuccess) at System.Security.Principal.NTAccount.Translate(Type targetType) at Microsoft.SharePoint.Administration.Claims.SPClaimProviderManager.GetProviderUserKeyClaim(IClaimsIdentity claimsIdentity, SPClaim loginClaim) dbc2999c-6f92-a0b4-a4e8-f7ed10437e35
    06/11/2014 10:17:32.03 w3wp.exe (0x1904) 0x0FAC SharePoint Foundation General ajlz0 High Getting Error Message for Exception System.Web.HttpUnhandledException (0x80004005): Exception of type 'System.Web.HttpUnhandledException' was thrown. ---> Microsoft.SharePoint.SPException: The specified user or domain group was not found. ---> System.Security.Principal.IdentityNotMappedException: Some or all identity references could not be translated. at System.Security.Principal.NTAccount.Translate(IdentityReferenceCollection sourceAccounts, Type targetType, Boolean forceSuccess) at System.Security.Principal.NTAccount.Translate(Type targetType) at Microsoft.SharePoint.Administration.Claims.SPClaimProviderManager.GetProviderUserKeyClaim(IClaimsIdentity claimsIdentity, SPClaim loginClaim) --- End of inner exception stack trace --- at Microsoft.SharePoint.Administration.... dbc2999c-6f92-a0b4-a4e8-f7ed10437e35
    06/11/2014 10:17:32.03* w3wp.exe (0x1904) 0x0FAC SharePoint Foundation General ajlz0 High ...Claims.SPClaimProviderManager.GetProviderUserKeyClaim(IClaimsIdentity claimsIdentity, SPClaim loginClaim) at Microsoft.SharePoint.Administration.Claims.SPClaimProviderManager.GetProviderUserKey(IClaimsIdentity claimsIdentity, String encodedIdentityClaimSuffix) at Microsoft.SharePoint.Administration.Claims.SPClaimProviderManager.GetProviderUserKey(String encodedIdentityClaimSuffix) at Microsoft.SharePoint.Utilities.SPUtility.GetFullUserKeyFromFullName(String fullName) at Microsoft.SharePoint.SPGlobal.CreateSPRequestAndSetIdentity(SPSite site, String name, Boolean bNotGlobalAdminCode, String strUrl, Boolean bNotAddToContext, Byte[] UserToken, SPAppPrincipalToken appPrincipalToken, String userName, Boolean bIgnoreTokenTimeout, Boolean bAsAnonymous) at Microsoft.SharePoint.... dbc2999c-6f92-a0b4-a4e8-f7ed10437e35
    06/11/2014 10:17:32.03* w3wp.exe (0x1904) 0x0FAC SharePoint Foundation General ajlz0 High ...SPSite.get_Request() at Microsoft.SharePoint.SPSite.OpenWeb(Guid gWebId, Int32 mondoHint) at Microsoft.SharePoint.Publishing.CachedObjectFactory.OpenWebFromSuperUserSite(Guid webId) at Microsoft.SharePoint.Publishing.CacheManager..ctor(SPSite site) at Microsoft.SharePoint.Publishing.CacheManager.GetManager(SPSite site, Boolean useContextSite, Boolean allowContextSiteOptimization, Boolean refreshIfNoContext) at Microsoft.SharePoint.Publishing.Internal.WebControls.PublishingRibbon.OnLoad(EventArgs e) at System.Web.UI.Control.LoadRecursive() at System.Web.UI.Control.LoadRecursive() at System.Web.UI.Control.LoadRecursive() at System.Web.UI.Control.LoadRecursive() at System.Web.UI.Control.LoadRecursive() at System.Web.UI.Control.LoadRecursive() at... dbc2999c-6f92-a0b4-a4e8-f7ed10437e35
    06/11/2014 10:17:32.03* w3wp.exe (0x1904) 0x0FAC SharePoint Foundation General ajlz0 High ... System.Web.UI.Control.LoadRecursive() at System.Web.UI.Control.LoadRecursive() at System.Web.UI.Control.LoadRecursive() at System.Web.UI.Page.ProcessRequestMain(Boolean includeStagesBeforeAsyncPoint, Boolean includeStagesAfterAsyncPoint) at System.Web.UI.Page.HandleError(Exception e) at System.Web.UI.Page.ProcessRequestMain(Boolean includeStagesBeforeAsyncPoint, Boolean includeStagesAfterAsyncPoint) at System.Web.UI.Page.ProcessRequest(Boolean includeStagesBeforeAsyncPoint, Boolean includeStagesAfterAsyncPoint) at System.Web.UI.Page.ProcessRequest() at System.Web.UI.Page.ProcessRequest(HttpContext context) at System.Web.HttpApplication.CallHandlerExecutionStep.System.Web.HttpApplication.IExecutionStep.Execute() at System.Web.HttpApplication.ExecuteS... dbc2999c-6f92-a0b4-a4e8-f7ed10437e35
    06/11/2014 10:17:32.03* w3wp.exe (0x1904) 0x0FAC SharePoint Foundation General ajlz0 High ...tep(IExecutionStep step, Boolean& completedSynchronously) dbc2999c-6f92-a0b4-a4e8-f7ed10437e35
    06/11/2014 10:17:32.03 w3wp.exe (0x1904) 0x0FAC SharePoint Foundation General aat87 Monitorable dbc2999c-6f92-a0b4-a4e8-f7ed10437e35
    06/11/2014 10:17:32.05 w3wp.exe (0x1904) 0x0FAC SharePoint Foundation Monitoring b4ly Medium Leaving Monitored Scope (Request (GET:http://sp13:80/SitePages/Home.aspx)). Execution Time=97.7205 dbc2999c-6f92-a0b4-a4e8-f7ed10437e35

    This is a very generic error message. 
    What user you are trying to search. Are you using username, display name or email address when searching
    Was any domain related changed done
    What if that users tried to logon to sharepoint site. 
    Does this error occur with all the account when you click edit? If not, based on the error,
    the user account which might be removed from Active Directory or renamed accidentally. Please have a check.
    Try to follow below:
    http://architectevangelist.wordpress.com/2010/12/07/sharepoint-2010-the-specified-user-or-domain-group-was-not-found/

  • File not found when trying to call a dll on LabVIEW Real Time machine

    I have a dll called "DLLRTTEST" that I've written, and have succesfully called on my host machine.  I'm now attempting to call this dll from a vi that is located on my real time computer.  Currently I get an "Error 7 occurred at Call Library Function Node in DLLRTTEST.vi." message upon execution
    In the attached screenshot I'm trying to ensure that the vi I'm running is in fact located on the real time system.  I then use a "Check if File or Folder Exists.vi" to confirm that the dll that I'm about to call does exist on the real time system as well.  However, I still receive an "error 7 file not found" error from the Call Library Function Node.
    Any help is appreciated.
    Solved!
    Go to Solution.
    Attachments:
    DLL_Call_Screenshot.png ‏61 KB
    DLL_Call_Screenshot.png ‏61 KB

    As nathand already mentioned, depending on your C toolchain your DLL will depend on other DLLs. Usually the according msvcrtXX.dll that matches your Visual C version, if you use Visual C, other runtime DLLs if you use a different C environment. These runtime DLLs are even necessary if you do not call anything in any of your functions, since the DLL makes various initialization steps when it gets loaded and that references some C runtime functions nevertheless. Compiling and linking the DLL with static C runtime is usually also not a clean solution since the linked in C runtime will then reference Windows APIs that are not available on LabVIEW RT.
    Depending on your version of LabVIEW RT you will have some mscvrtxx.dll files in your system directory but it will be an older one than from the latest Visual Studio version. If you can compile your DLL with that Visual Studio version then you should be fine, but could possibly run into new problems if you later upgrade to a newer LabVIEW RT version. Installing the C runtime distributables from newer Visual Studio versions is unfortunately also not a solution, since it references many (undocumented) Windows API functions that are not available in LabVIEW RT.
    Rolf Kalbermatter
    CIT Engineering Netherlands
    a division of Test & Measurement Solutions

  • User Was Not Found when trying to run SSRS report!

    I'm trying to run SSRS report (Custom Reports) for Dynamics CRM 2011. However, when I try to run the report from the Reporting Manager it errors out "User Was Not Found"!
    Here's the complete error log:'
    An error has occurred during report processing. (rsProcessingAborted)
    Query execution failed for dataset 'DSMain'. (rsErrorExecutingCommand)
    Microsoft.Crm.CrmException: An unexpected error occurred. System.ServiceModel.FaultException`1[[Microsoft.Xrm.Sdk.OrganizationServiceFault, Microsoft.Xrm.Sdk, Version=5.0.0.0, Culture=neutral, PublicKeyToken=31bf3856ad364e35]]:
    User Was Not Found <OrganizationServiceFault xmlns:i="http://www.w3.org/2001/XMLSchema-instance" xmlns="http://schemas.microsoft.com/xrm/2011/Contracts"> <ErrorCode>-2147220969</ErrorCode> <ErrorDetails xmlns:d2p1="http://schemas.datacontract.org/2004/07/System.Collections.Generic">
    <KeyValuePairOfstringanyType> <d2p1:key>CallStack</d2p1:key> <d2p1:value xmlns:d4p1="http://www.w3.org/2001/XMLSchema" i:type="d4p1:string"> at Microsoft.Crm.ServerLocatorService.GetCrmUserId(Guid organizationId,
    String authenticationInfo) at Microsoft.Crm.Sandbox.SandboxHostSids.IsCallerAllowed(SandboxSdkContext requestContext, String&amp; expectedSidSddlForm, String&amp; callerSidSddlForm) at Microsoft.Crm.Sandbox.SandboxSdkListener.AuthenticateCaller(SandboxCallInfo
    callInfo, SandboxSdkContext requestContext, String operation) at Microsoft.Crm.Sandbox.SandboxSdkListener.Execute(SandboxCallInfo callInfo, SandboxSdkContext requestContext, String operation, Byte[] serializedRequest)</d2p1:value> </KeyValuePairOfstringanyType>
    </ErrorDetails> <Message>User Was Not Found</Message> <Timestamp>2014-05-09T21:37:02.5487525Z</Timestamp> <InnerFault i:nil="true" /> <TraceText i:nil="true" /> </OrganizationServiceFault>
    An unexpected error occurred.
    User Was Not Found

    Hello,
    Can you preview the report in Report Builder or Report Designer?
    Based on the error message, the issue may related to a invalid user account for the report data source credentials.Please verify the user account is valid and has sufficient permission to access CRM data source.
    You can refer to the following blog to troubleshooting CRM custom report rsProcessingAborted error:
    http://blog.simpletrees.com/2013/04/mscrm-and-dreaded-rsprocessingaborted.html
    Regards,
    Fanny Liu
    Fanny Liu
    TechNet Community Support

  • Syncing files constantly issue & page not found when trying to access a file on web

    Can anyone assist with syncing issue. Syncing runs all day and new files are not syncing. I can see the files in web browser (not in desktop APP) however when I try to access the files I get page not found.
    I went into archive (after reading all the forums I coudl find) and I think there are a couple of damaged files as when I tried to delete them I received an encountered 'error' and could not permanently delete.
    I need assistance to get my syncing fixed, and page not found fixed.
    Help!
    Thanks@

    There can be a number of causes for not being able to access file form web browser.  One, you might be writing to wrong directory.  Two, you might not have sufficient privileges to either write to directory or overwrite files already in that directory.  From your description, it's the latter of the two, so you need to get a hold of creative cloud support and get file/folder permissions fixed.  Good luck.

  • Lookout 6.0.1.: Class Not Found when trying to open project on another PC

    I am using the same version on both PC's, but when I move the file over and run it, I get "Class not found!". Then "Error running process file".When running the lookout source file I get the following:
    Lookout Process File Compiler Version 6.0.1 (build 1)
    Copyright National Instruments 1992-2004  All rights reserved.
    C:\Documents and Settings\testing\Desktop\Latest Lookout\lprocess2.lks
    C:\Documents and Settings\testing\Desktop\Latest Lookout\lprocess2.lks(324): error: Class not found: DirectLogic
    C:\Documents and Settings\testing\Desktop\Latest Lookout\lprocess2.lks(667): error: Class not found: Meter
    C:\Documents and Settings\testing\Desktop\Latest Lookout\lprocess2.lks(670): error: Class not found: Meter
    C:\Documents and Settings\testing\Desktop\Latest Lookout\lprocess2.lks(673): error: Class not found: Meter
    C:\Documents and Settings\testing\Desktop\Latest Lookout\lprocess2.lks(676): error: Class not found: Meter
    C:\Documents and Settings\testing\Desktop\Latest Lookout\lprocess2.lks(1977): error: Class not found: Meter
    C:\Documents and Settings\testing\Desktop\Latest Lookout\lprocess2.lks(57): error: Object is not defined: DL1
    C:\Documents and Settings\testing\Desktop\Latest Lookout\lprocess2.lks(667): error: Object is not defined: Meter1
    C:\Documents and Settings\testing\Desktop\Latest Lookout\lprocess2.lks(670): error: Object is not defined: Meter2
    C:\Documents and Settings\testing\Desktop\Latest Lookout\lprocess2.lks(673): error: Object is not defined: Meter3
    C:\Documents and Settings\testing\Desktop\Latest Lookout\lprocess2.lks(676): error: Object is not defined: Meter4
    I have also tried to open on 6.1 with similar results.
    I am familiar with lookout, however I have taken this project over so I am not sure what I need to do from here.

    There are two object (DirectLogic and Meter) that are not present on the amchine you are moving the process to.   If the same version of Lookout, you might be able to just copy the cbx files.
    Mike
    Mike Crabtree - Lead Developer
    Destek of Nevada, Inc. / Digital Telemetry Systems, Inc.
    (866) 964-6948 / (760) 247-9512

Maybe you are looking for

  • Microphone headset with MacBook Pro

    Hi, I recently started playing a game on my Mac that requires a microphone headset to get the most out of playing online. But since there is just one "slot" (I can't remember what it's called) to plug into, and a microphone headset has two plugs, I h

  • My Wifi disconnect​s randomly

    Can you lend a{please keep your posts courteous}some wifi?

  • OpenDocument Prompts

    BO webi 6.5 allows to link two reports (parent and target) using the openDocument syntax in a cell formula's. I have following 2 issues while trying it: 1. Problem: The prompted values are not passed into the target document. The target (called docum

  • Are there any exams for LabWindows​/CVI for my assessment​?

    Hi I'm new in CVI I'm still studying its features Can anyone give me a link where I can learn more about CVI, a tutorial perhaps. I'm really interested about data manipulation and databases. What database can I use with CVI? And Are there any exams I

  • 3d axis and tools not displaying

    I am using the 3d workspace, I have reset 3d, have a 3d layer selected and I can play my animation in the timeline, switch between ortho and perspective. The timeline shows 3d camera position. But, the 3d tools are not displaying. What do I need to d