Db 11.2.0.3 install fails with this exception

Hello All,
To give a background :
have Virtual box on windows 7.. Virtual box have the oracle linux 6. Completed installed for clusterware.
I have successfully installed clusterware, while attempting to install database i get a alert at the step 2 of the db install.
this is my second attempt to install the db software , at the first time I had the bad checksum of the db installation software .. I cleaned up the Oracle home and made the second attempt to get the below warning and fails:
more oraInstall2013-04-11_06-50-25PM.err
---# Begin Stacktrace #---------------------------
ID: oracle.install.ivw.common.validator.SupportedOSValidator:363
oracle.cluster.verification.PreReqNotSupportedException: Reference data is not a
vailable for verifying prerequisites on this operating system distribution
     at oracle.cluster.verification.constraints.XmlTaskFactory.getTasks(XmlTa
skFactory.java:301)
     at oracle.cluster.verification.constraints.XmlTaskFactory.getTasks(XmlTa
skFactory.java:159)
     at oracle.ops.verification.framework.util.VerificationUtil.isPreReqSuppo
rted(VerificationUtil.java:7441)
     at oracle.ops.verification.framework.util.VerificationUtil.isPreReqSuppo
rted(VerificationUtil.java:7390)
     at oracle.cluster.verification.ClusterVerification.isPreReqSupported(Clu
sterVerification.java:6598)
     at oracle.install.ivw.common.validator.SupportedOSValidator.verifyEnviro
nment(SupportedOSValidator.java:68)
     at oracle.install.ivw.common.validator.SupportedOSValidator.validate(Sup
portedOSValidator.java:96)
     at oracle.install.commons.flow.validation.ValidationHelper.validateState
(ValidationHelper.java:185)
     at oracle.install.commons.flow.AbstractFlowExecutor.validate(AbstractFlo
wExecutor.java:415)
     at oracle.install.commons.flow.AbstractFlowExecutor.leaveVertex(Abstract
FlowExecutor.java:639)
     at oracle.install.commons.flow.AbstractFlowExecutor.transition(AbstractFlowExecutor.java:331)
     at oracle.install.commons.flow.AbstractFlowExecutor.nextState(AbstractFlowExecutor.java:271)
     at oracle.install.commons.flow.AbstractFlowExecutor.nextViewState(AbstractFlowExecutor.java:230)
     at oracle.install.commons.flow.DefaultFlowNavigator.goForward(DefaultFlowNavigator.java:58)
     at oracle.install.commons.flow.jewt.FlowWizard$1.run(FlowWizard.java:125)
     at oracle.install.commons.flow.jewt.FlowWizard$TransitionManager$1.run(FlowWizard.java:101)
     at java.util.concurrent.Executors$RunnableAdapter.call(Executors.java:417)
     at java.util.concurrent.FutureTask$Sync.innerRun(FutureTask.java:269)
     at java.util.concurrent.FutureTask.run(FutureTask.java:123)
     at java.util.concurrent.ThreadPoolExecutor$Worker.runTask(ThreadPoolExecutor.java:651)
     at java.util.concurrent.ThreadPoolExecutor$Worker.run(ThreadPoolExecutor.java:676)
     at java.lang.Thread.run(Thread.java:637)
---# End Stacktrace #-----------------------------
---# Begin Stacktrace #---------------------------
ID: oracle.install.commons.util.exception.DefaultErrorAdvisor:366
oracle.cluster.verification.PreReqNotSupportedException: Reference data is not available for verifying prerequisites on this operating system distribution
     at oracle.cluster.verification.constraints.XmlTaskFactory.getTasks(XmlTaskFactory.java:301)
     at oracle.cluster.verification.constraints.XmlTaskFactory.getTasks(XmlTaskFactory.java:159)
     at oracle.ops.verification.framework.util.VerificationUtil.isPreReqSupported(VerificationUtil.java:7441)
     at oracle.ops.verification.framework.util.VerificationUtil.isPreReqSupported(VerificationUtil.java:7390)
     at oracle.cluster.verification.ClusterVerification.isPreReqSupported(ClusterVerification.java:6598)
     at oracle.install.ivw.common.validator.SupportedOSValidator.verifyEnvironment(SupportedOSValidator.java:68)
     at oracle.install.ivw.common.validator.SupportedOSValidator.validate(SupportedOSValidator.java:96)
     at oracle.install.commons.flow.validation.ValidationHelper.validateState(ValidationHelper.java:185)
     at oracle.install.commons.flow.AbstractFlowExecutor.validate(AbstractFlowExecutor.java:415)
     at oracle.install.commons.flow.AbstractFlowExecutor.leaveVertex(AbstractFlowExecutor.java:639)
     at oracle.install.commons.flow.AbstractFlowExecutor.transition(AbstractFlowExecutor.java:331)
     at oracle.install.commons.flow.AbstractFlowExecutor.nextState(AbstractFlowExecutor.java:271)
     at oracle.install.commons.flow.AbstractFlowExecutor.nextViewState(AbstractFlowExecutor.java:230)
     at oracle.install.commons.flow.DefaultFlowNavigator.goForward(DefaultFlowNavigator.java:58)
     at oracle.install.commons.flow.jewt.FlowWizard$1.run(FlowWizard.java:125)
     at oracle.install.commons.flow.jewt.FlowWizard$TransitionManager$1.run(FlowWizard.java:101)
     at java.util.concurrent.Executors$RunnableAdapter.call(Executors.java:417)
     at java.util.concurrent.FutureTask$Sync.innerRun(FutureTask.java:269)
     at java.util.concurrent.FutureTask.run(FutureTask.java:123)
     at java.util.concurrent.ThreadPoolExecutor$Worker.runTask(ThreadPoolExecutor.java:651)
     at java.util.concurrent.ThreadPoolExecutor$Worker.run(ThreadPoolExecutor.java:676)
     at java.lang.Thread.run(Thread.java:637)
---# End Stacktrace #-----------------------------
I tried to deinstall the failed installation through deinstall but get an error with that as well with a perl error. Currently I do not have any files under my oracle home.
Any suggestions on how to proceed at this point would be really helpful.

Hi Friend,
Please check Pre-Requisites for Oracle 11g R2 database for Virtual Box. May be below link will give you some sort of idea.
http://eudba.wordpress.com/2012/08/10/installing-oracle-11g-on-oracle-linux-6-with-asm-eng/
Thanks
LaserSoft

Similar Messages

  • Post install failing with Java Exception creating the Oracle Context

    I have not been able to complete the post-install portion of the OID which is run by the Oracle 9iAS Infrastructure installer.
    Is there a way to create the Oracle Context and whatever else is part of the /ldap/postcfg/postcfg script without the use of the Java assistants? I am getting a Java exception when creating the Oracle Context.
    Thanks,
    e.

    are you trying to install ias on Linux or windows??

  • Install failed with exit code 11?

    Hi,
    I am trying to deploy a language pack and set the override language to English-US which I have created 2 programs for in my package. When the first program runs I am getting an error in the execmgr.log that "Install failed with exit code 11" Any
    ideas what this means? When I run this command manually on the machine it works fine:
    "C:\WINDOWS\System32\Dism.exe" /online /add-package /packagepath:"en-us\lp.cab"
    I checked the dism.log as well but I don't see any errors. Both logs are below, any help or suggestions would be greatly appreciated TIA
    <![LOG[Command line = "C:\WINDOWS\System32\Dism.exe" /online /add-package /packagepath:"en-us\lp.cab", Working Directory = C:\WINDOWS\ccmcache\4j\]LOG]!><time="08:00:28.447+300" date="01-27-2015" component="execmgr"
    context="" type="1" thread="4976" file="scriptexecution.cpp:352">
    <![LOG[Running "C:\WINDOWS\System32\Dism.exe" /online /add-package /packagepath:"en-us\lp.cab" with 32bitLauncher]LOG]!><time="08:00:28.447+300" date="01-27-2015" component="execmgr" context=""
    type="1" thread="4976" file="scriptexecution.cpp:370">
    <![LOG[Created Process for the passed command line]LOG]!><time="08:00:28.509+300" date="01-27-2015" component="execmgr" context="" type="1" thread="4976" file="scriptexecution.cpp:513">
    <![LOG[Raising event:
    [SMS_CodePage(437), SMS_LocaleID(1033)]
    instance of SoftDistProgramStartedEvent
     AdvertisementId = "LIA20115";
     ClientID = "GUID:428D91E4-84BD-4740-97D9-9177C39FA3F0";
     CommandLine = "\"C:\\WINDOWS\\System32\\Dism.exe\" /online /add-package /packagepath:\"en-us\\lp.cab\"";
     DateTime = "20150127130028.509000+000";
     MachineName = "";
     PackageName = "";
     ProcessID = 2012;
     ProgramName = "Install";
     SiteCode = "";
     ThreadID = 4976;
     UserContext = "NT AUTHORITY\\SYSTEM";
     WorkingDirectory = "C:\\WINDOWS\\ccmcache\\4j\\";
    ]LOG]!><time="08:00:28.509+300" date="01-27-2015" component="execmgr" context="" type="1" thread="4976" file="event.cpp:715">
    <![LOG[Raised Program Started Event for Ad:LIA20115, Package:LIA002A0, Program: Install]LOG]!><time="08:00:28.509+300" date="01-27-2015" component="execmgr" context="" type="1" thread="4976"
    file="executioncontext.cpp:459">
    <![LOG[Raising client SDK event for class CCM_Program, instance CCM_Program.PackageID="LIA002A0",ProgramID="Install", actionType 1l, value NULL, user NULL, session 4294967295l, level 0l, verbosity 30l]LOG]!><time="08:00:28.509+300"
    date="01-27-2015" component="execmgr" context="" type="1" thread="4976" file="event.cpp:405">
    <![LOG[Raising client SDK event for class CCM_Program, instance CCM_Program.PackageID="LIA002A0",ProgramID="Install", actionType 1l, value , user NULL, session 4294967295l, level 0l, verbosity 30l]LOG]!><time="08:00:28.509+300"
    date="01-27-2015" component="execmgr" context="" type="1" thread="4976" file="event.cpp:405">
    <![LOG[MTC task with id {B7EEE891-740D-4762-8D2B-BA2D7E351F1D}, changed state from 4 to 5]LOG]!><time="08:00:28.525+300" date="01-27-2015" component="execmgr" context="" type="1" thread="5904"
    file="execreqmgr.cpp:6288">
    <![LOG[Program exit code 11]LOG]!><time="08:00:28.650+300" date="01-27-2015" component="execmgr" context="" type="1" thread="2488" file="scriptexecution.cpp:676">
    <![LOG[Looking for MIF file to get program status]LOG]!><time="08:00:28.650+300" date="01-27-2015" component="execmgr" context="" type="1" thread="2488" file="executionstatus.cpp:282">
    <![LOG[Script for Package:LIA002A0, Program: Install failed with exit code 11]LOG]!><time="08:00:28.650+300" date="01-27-2015" component="execmgr" context="" type="3" thread="2488" file="executionstatus.cpp:252">
    <![LOG[Raising event:
    [SMS_CodePage(437), SMS_LocaleID(1033)]
    instance of SoftDistProgramErrorEvent
     AdvertisementId = "LIA20115";
     ClientID = "GUID:428D91E4-84BD-4740-97D9-9177C39FA3F0";
     DateTime = "20150127130028.650000+000";
     ExitCode = "11";
     MachineName = "";
     PackageName = "LIA002A0";
     ProcessID = 2012;
     ProgramName = "Install";
     SiteCode = "";
     ThreadID = 2488;
     UserContext = "NT AUTHORITY\\SYSTEM";
    ]LOG]!><time="08:00:28.650+300" date="01-27-2015" component="execmgr" context="" type="1" thread="2488" file="event.cpp:715">
    <![LOG[Raised Program Error Event for Ad:LIA20115, Package:LIA002A0, Program: Install]LOG]!><time="08:00:28.650+300" date="01-27-2015" component="execmgr" context="" type="1" thread="2488"
    file="executioncontext.cpp:572">
    <![LOG[Execution is complete for program Install. The exit code is 11, the execution status is FailureNonRetry]LOG]!><time="08:00:28.665+300" date="01-27-2015" component="execmgr" context="" type="1"
    thread="1956" file="execreqmgr.cpp:4165">
    <![LOG[Requesting MTC to delete task with id: {B7EEE891-740D-4762-8D2B-BA2D7E351F1D}]LOG]!><time="08:00:28.681+300" date="01-27-2015" component="execmgr" context="" type="1" thread="1956"
    file="executionrequest.cpp:9041">
    <![LOG[MTC task with id: {B7EEE891-740D-4762-8D2B-BA2D7E351F1D} deleted successfully.]LOG]!><time="08:00:28.681+300" date="01-27-2015" component="execmgr" context="" type="1" thread="1956"
    file="executionrequest.cpp:9070">
    <![LOG[Raising client SDK event for class CCM_Program, instance CCM_Program.PackageID="LIA002A0",ProgramID="InstallEN", actionType 10l, value Result:FALSE, user NULL, session 4294967295l, level 0l, verbosity 30l]LOG]!><time="08:00:28.697+300"
    date="01-27-2015" component="execmgr" context="" type="1" thread="1956" file="event.cpp:405">
    <![LOG[Deleting request for program Install. Failing parent program InstallEN]LOG]!><time="08:00:28.697+300" date="01-27-2015" component="execmgr" context="" type="1" thread="1956" file="execreqmgr.cpp:8147">
    <![LOG[Requesting MTC to delete task with id: ]LOG]!><time="08:00:28.697+300" date="01-27-2015" component="execmgr" context="" type="1" thread="1956" file="executionrequest.cpp:9041">
    <![LOG[This execution request does not have a corresponding task in MTC.]LOG]!><time="08:00:28.697+300" date="01-27-2015" component="execmgr" context="" type="1" thread="1956" file="executionrequest.cpp:9059">
    <![LOG[Requesting MTC to delete task with id: {B7EEE891-740D-4762-8D2B-BA2D7E351F1D}]LOG]!><time="08:00:28.697+300" date="01-27-2015" component="execmgr" context="" type="1" thread="1956"
    file="executionrequest.cpp:9041">
    <![LOG[This execution request does not have a corresponding task in MTC.]LOG]!><time="08:00:28.697+300" date="01-27-2015" component="execmgr" context="" type="1" thread="1956" file="executionrequest.cpp:9059">
    <![LOG[Raising client SDK event for class CCM_Program, instance CCM_Program.PackageID="LIA002A0",ProgramID="Install", actionType 1l, value , user NULL, session 4294967295l, level 0l, verbosity 30l]LOG]!><time="08:00:28.697+300"
    date="01-27-2015" component="execmgr" context="" type="1" thread="1956" file="event.cpp:405">
    015-01-27 08:00:28, Info                  DISM   DISM.EXE:
    2015-01-27 08:00:28, Info                  DISM   DISM.EXE: <----- Starting Dism.exe session ----->
    2015-01-27 08:00:28, Info                  DISM   DISM.EXE:
    2015-01-27 08:00:28, Info                  DISM   DISM.EXE: Host machine information: OS Version=6.3.9600, Running architecture=x86, Number of processors=4
    2015-01-27 08:00:28, Info                  DISM   DISM.EXE: Dism.exe version: 6.3.9600.16384
    2015-01-27 08:00:28, Info                  DISM   DISM.EXE: Executing command line: "C:\WINDOWS\System32\Dism.exe" /online /add-package /packagepath:"en-us\lp.cab"
    2015-01-27 08:00:28, Info                  DISM   DISM Provider Store: PID=5984 TID=4336 Getting Provider FolderManager - CDISMProviderStore::GetProvider
    2015-01-27 08:00:28, Info                  DISM   DISM Provider Store: PID=5984 TID=4336 Provider has not previously been encountered.  Attempting to initialize
    the provider. - CDISMProviderStore::Internal_GetProvider
    2015-01-27 08:00:28, Info                  DISM   DISM Provider Store: PID=5984 TID=4336 Loading Provider from location C:\WINDOWS\System32\Dism\FolderProvider.dll
    - CDISMProviderStore::Internal_GetProvider
    2015-01-27 08:00:28, Info                  DISM   DISM Provider Store: PID=5984 TID=4336 Connecting to the provider located at C:\WINDOWS\System32\Dism\FolderProvider.dll.
    - CDISMProviderStore::Internal_LoadProvider
    2015-01-27 08:00:28, Info                  DISM   DISM.EXE: Image session has been closed. Reboot required=no.
    2015-01-27 08:00:28, Info                  DISM   DISM.EXE:
    2015-01-27 08:00:28, Info                  DISM   DISM.EXE: <----- Ending Dism.exe session ----->
    2015-01-27 08:00:28, Info                  DISM   DISM.EXE:

    Thanks, it seems as though it is not doing anything now. I just see that the policy has arrived in the log below but it is not installing it? The dism.log hasn't changed at all so it seems that it isn't even executing the command now? Am I missing something
    else? I even tried re-advertising it though client center.
    Command is now:
    C:\WINDOWS\sysnative\Dism.exe  /online /add-package /packagepath:"en-us\lp.cab"
    <![LOG[Raising client SDK event for class CCM_Program, instance CCM_Program.PackageID="LIA002A0",ProgramID="InstallEN", actionType 45l, value NULL, user NULL, session 4294967295l, level 0l, verbosity 30l]LOG]!><time="08:52:28.943+300"
    date="01-27-2015" component="execmgr" context="" type="1" thread="5036" file="event.cpp:405">
    <![LOG[Policy arrived for child program Install]LOG]!><time="09:12:48.440+300" date="01-27-2015" component="execmgr" context="" type="1" thread="3528" file="execreqmgr.cpp:6867">
    <![LOG[Policy arrived for parent package LIA002A0 program InstallEN]LOG]!><time="09:12:48.487+300" date="01-27-2015" component="execmgr" context="" type="1" thread="3528" file="execreqmgr.cpp:6893">
    <![LOG[Raising client SDK event for class CCM_Program, instance CCM_Program.PackageID="LIA002A0",ProgramID="InstallEN", actionType 6l, value NULL, user NULL, session 4294967295l, level 0l, verbosity 30l]LOG]!><time="09:12:48.487+300"
    date="01-27-2015" component="execmgr" context="" type="1" thread="3528" file="event.cpp:405">
    <![LOG[Raising event:
    [SMS_CodePage(437), SMS_LocaleID(1033)]
    instance of SoftDistProgramOfferReceivedEvent
     AdvertisementId = "LIA20116";
     ClientID = "GUID:428D91E4-84BD-4740-97D9-9177C39FA3F0";
     DateTime = "20150127141248.502000+000";
     MachineName = "";
     ProcessID = 2012;
     SiteCode = "";
     ThreadID = 3528;
    ]LOG]!><time="09:12:48.502+300" date="01-27-2015" component="execmgr" context="" type="1" thread="3528" file="event.cpp:715">
    <![LOG[The user has logged off.]LOG]!><time="09:36:59.174+300" date="01-27-2015" component="execmgr" context="" type="1" thread="4320" file="execreqmgr.cpp:5138">

  • CRM 2015 Update 0.1 Install Fails with SQL Error

    Hi, anyone managed to install CRM 2015 Update 0.1?
    The software installed fine but the DB updates fail with a SQL error. Just want to know if this is just my issue or if MS have a bug in the update. This is the SQL error:
    System.Reflection.TargetInvocationException: Exception has been thrown by the target of an invocation. ---> System.Data.SqlClient.SqlException: The current transaction cannot be committed and cannot support operations that write to the log file. Roll
    back the transaction.
    Uncommittable transaction is detected at the end of the batch. The transaction is rolled back.
    All of the ORGs fail with this error, even when I try to apply the DB update via Deployment manager. I've had to back out the rollup.

    The issue appears when the update process creates the index cndx_BusinessDataLocalizedLabel. This is a known cause which is under investigation internally. Currently it seems to plan to release in CRM 2015 SP1

  • An attempt to install Adobe reader X on my Mac OS 10.5.8 failed, with this message: "Run preinstall script for application." What is that, and how do I do it?

    An attempt to install Adobe reader X on my Mac OS 10.5.8 failed, with this message: "Run preinstall script for application." What is that, and how do I do it?

    Hi renmusn79002737,
    Could you please try installing Reader again from the below mentioned link:
    http://get.adobe.com/reader
    Ensure that you are logged in as administrator and anti-virus is disabled as that might interrupt downloading.
    Try again and then let me know.
    Regards,
    Anubha

  • Flash Player Install failed with error code: 30

    Hi, I want to report a problem with the Adobe Flash Player 13.0.0.182 (Mac OS X, English) installer on OS X 10.9.2. Mavericks.  I'm posting this so the engineers will know what to fix in the next update version.
    I have a 2013 iMac so according to Adobe blog posts it shouldn't be affected by the invalid cpu instruction issue.
    Symptom is the first installer downloads the 2nd, starts to launch it, then quits it with "Error: Unable to proceed with the installation" and a green (success?) checkmark.  The GUI provides no other assistance except to "FINISH", which leads to the generic "Adobe Flash Player could not be installed." page.
    The system log says: Adobe Flash Player Install Manager[22567]: Install failed with error code: 30.
    The FlashPlayerInstallManager.log says:
    2014-04-13 16:12:01 -0500 [I]  IM: ---------- log start ----------
    2014-04-13 16:12:01 -0500 [I]  IM: All install checks pass
    2014-04-13 16:12:01 -0500 [W]  IM: Unexpected umask value for process: 0
    2014-04-13 16:12:06 -0500 [I]  IM: User does not have any processes that need to be closed.
    2014-04-13 16:12:06 -0500 [I]  IM: [install started]
    2014-04-13 16:12:06 -0500 [E]  RA: Unable to launch FPInstallHelper. Error = 'launch path not accessible'
    2014-04-13 16:12:06 -0500 [E]  RA:
    Attributes for '/var/folders/zz/zyxvpxvq6csfxvn_n0000000000000/T/FPInstallHelper':
        NSFileCreationDate = "2014-03-27 04:20:43 +0000";
        NSFileExtensionHidden = 0;
        NSFileGroupOwnerAccountID = 0;
        NSFileGroupOwnerAccountName = wheel;
        NSFileHFSCreatorCode = 0;
        NSFileHFSTypeCode = 0;
        NSFileModificationDate = "2014-03-27 04:20:43 +0000";
        NSFileOwnerAccountID = 0;
        NSFileOwnerAccountName = root;
        NSFilePosixPermissions = 2541;
        NSFileReferenceCount = 1;
        NSFileSize = 13348;
        NSFileSystemFileNumber = 4892044;
        NSFileSystemNumber = 16777224;
        NSFileType = NSFileTypeRegular;
    2014-04-13 16:12:06 -0500 [E]  RA:
    Attributes for '/var/folders/zz/zyxvpxvq6csfxvn_n0000000000000/T':
        NSFileCreationDate = "2014-04-07 13:43:21 +0000";
        NSFileExtensionHidden = 0;
        NSFileGroupOwnerAccountID = 0;
        NSFileGroupOwnerAccountName = wheel;
        NSFileModificationDate = "2014-04-13 21:12:06 +0000";
        NSFileOwnerAccountID = 0;
        NSFileOwnerAccountName = root;
        NSFilePosixPermissions = 449;
        NSFileReferenceCount = 12;
        NSFileSize = 408;
        NSFileSystemFileNumber = 4552991;
        NSFileSystemNumber = 16777224;
        NSFileType = NSFileTypeDirectory;
    2014-04-13 16:12:06 -0500 [E]  IM: [install failed: 30]
    2014-04-13 16:12:06 -0500 [E]  IM: Install failed with error code: 30.
    2014-04-13 16:12:06 -0500 [I]  IM: ----------  log end  ----------

    I have a 2013 iMac so according to Adobe blog posts it shouldn't be affected by the invalid cpu instruction issue.
    Regardless... I still recommend "falling back" to 12 until they get this release right for everyone. I've read plenty of posts in the Apple forums from new iMac, Mini and MacBook users who've had nothing but trouble. Even the "gurus" there are linking to Chris Campbell's post here:
    ATTENTION MAC CUSTOMERS - Flash Player 13 "Plugin Failure" Workaround
    Using the offline installer completely eliminates the errors seen with the stub installer.

  • DTM install fails with error 1935 on Windows 7

    Trying to install DTM 600_b047 on a Windows 7 64-bit system.  Install fails with
    Error 1935 and HRESULT= 80073712. Have tried to run via Run As Administrator.  It seems to get most of the way through before failing.  (Without Run As Admin, it fails much earlier complaining about a cab file not found.)
    Any ideas?

    Hey adairlw,
    Welcome to the BlackBerry Support Community Forums.
    What security software is currently installed on the computer?
    Also can I get you to re-name the install shield folder which is located under C:\Program files\common files.  Once you re-name the folder, then try to install the software.
    I look forward to your reply.
    -ViciousFerret
    Come follow your BlackBerry Technical Team on Twitter! @BlackBerryHelp
    Be sure to click Like! for those who have helped you.
    Click  Accept as Solution for posts that have solved your issue(s)!

  • ACR 8.4 CC RC install fails with AAM message 'patch not applicable'

    ACR 8.4 CC RC install fails with AAM message 'patch not applicable' - Running Photoshop CC on OSX 10.7.5
    Anyone seen this or have any ideas for a fix?
    I also have my legacy CS6 installed on the same Mac - tried installing ACR 8.4 CS6 RC and that fails with the same dialogue box from AAM
    The DNG converter installs no issue.
    Thx
    Chris.

    Do you have some other software, like Photoshop Elements 12 on your system that would generally also be compatible with ACR 8.4 final but isn’t compatible with the RC because the RC’s only for PS users? 
    I installed the RC the same day it was released on my computer that has PS-CS6 & PS-CC with Windows 7 and it worked ok, so the update generally works, but something isn’t on your systems.
    Are you up-to-date with your PS-CC version, which seems to be 14.2.1:
    http://blogs.adobe.com/crawlspace/2014/02/photoshop-cc-14-1-1-update-now-available.html
    And is CS6 updated to 13.0.6?
    http://www.adobe.com/support/downloads/product.jsp?product=39 <http://www.adobe.com/support/downloads/product.jsp?product=39&platform=Macintosh> &platform=Macintosh

  • Cumulative Update 3 client update install failed with code 1642

    We have SCCM 2012 R2 and recently updated to CU3
    Existing client is version 5.00.7958.1000
    Pushing update package created during CU3 update failing on some computers
    I am trying to update some of laptops using CU3 x86 update and getting following errors
    Script for Package:ABC00126, Program: Cumulative update 3 - x86 client update install failed with exit code 1642
    I have reviewed many forms but couldn't find relevant.
    Update works on about 70% on machines with same image but failed on rest with same 1642 error
    Same issues occurs applying client on during TSequence on some of machines.
    It is very inconsistent,
    Any help would be greatly apprciated
    Thanks
    RJ
    RJ09

    I verified package does copied over in ccmcache folder.
    Also try to run update package using pstools, got error same as Torsten mentioned.
    Here are logs from client.
    Checking content location C:\Windows\ccmcache\gt for use
    execmgr 13/01/2015 6:56:04 PM
    2588 (0x0A1C)
    Successfully selected content location C:\Windows\ccmcache\gt
    execmgr 13/01/2015 6:56:04 PM
    2588 (0x0A1C)
    Executing program as a script execmgr
    13/01/2015 6:56:04 PM 2588 (0x0A1C)
    Found executable file msiexec.exe with complete path C:\Windows\system32\msiexec.exe
    execmgr 13/01/2015 6:56:04 PM
    2588 (0x0A1C)
    Successfully prepared command line "C:\Windows\system32\msiexec.exe" /p configmgr2012ac-r2-kb2994331-i386.msp /L*v C:\Windows\TEMP\configmgr2012ac-r2-kb2994331-i386.msp.LOG /q REINSTALL=ALL REINSTALLMODE=mous
    execmgr 13/01/2015 6:56:04 PM
    2588 (0x0A1C)
    Command line = "C:\Windows\system32\msiexec.exe" /p configmgr2012ac-r2-kb2994331-i386.msp /L*v C:\Windows\TEMP\configmgr2012ac-r2-kb2994331-i386.msp.LOG /q REINSTALL=ALL REINSTALLMODE=mous, Working Directory = C:\Windows\ccmcache\gt\
    execmgr 13/01/2015 6:56:04 PM
    2588 (0x0A1C)
    Created Process for the passed command line
    execmgr 13/01/2015 6:56:04 PM
    2588 (0x0A1C)
    Raising event:
    [SMS_CodePage(437), SMS_LocaleID(1033)]
    instance of SoftDistProgramStartedEvent
    AdvertisementId = "ABC212D1";
    ClientID = "GUID:f298da2e-dfd1-428e-8b3c-b03602f95719";
    CommandLine = "\"C:\\Windows\\system32\\msiexec.exe\" /p configmgr2012ac-r2-kb2994331-i386.msp /L*v C:\\Windows\\TEMP\\configmgr2012ac-r2-kb2994331-i386.msp.LOG /q REINSTALL=ALL REINSTALLMODE=mous";
    DateTime = "20150114005604.541000+000";
    MachineName = "DH-07";
    PackageName = "ABC00126";
    ProcessID = 3496;
    ProgramName = "Cumulative update 3 - x86 client update install";
    SiteCode = "abc";
    ThreadID = 2588;
    UserContext = "NT AUTHORITY\\SYSTEM";
    WorkingDirectory = "C:\\Windows\\ccmcache\\gt\\";
    execmgr
    13/01/2015 6:56:04 PM 2588 (0x0A1C)
    Raised Program Started Event for Ad:ABC212D1, Package:ABC00126, Program: Cumulative update 3 - x86 client update install
    execmgr 13/01/2015 6:56:04 PM
    2588 (0x0A1C)
    Raising client SDK event for class CCM_Program, instance CCM_Program.PackageID="ABC00126",ProgramID="Cumulative update 3 - x86 client update install", actionType 1l, value NULL, user NULL, session 4294967295l, level 0l, verbosity 30l
    execmgr 13/01/2015 6:56:04 PM
    2588 (0x0A1C)
    Raising client SDK event for class CCM_Program, instance CCM_Program.PackageID="ABC00126",ProgramID="Cumulative update 3 - x86 client update install", actionType 1l, value , user NULL, session 4294967295l, level 0l, verbosity 30l
    execmgr 13/01/2015 6:56:04 PM
    2588 (0x0A1C)
    MTC task with id {8EB498C5-71D5-4933-BA80-6EEB8E189F98}, changed state from 4 to 5
    execmgr 13/01/2015 6:56:04 PM
    2588 (0x0A1C)
    Program exit code 1642 execmgr
    13/01/2015 6:56:04 PM 2784 (0x0AE0)
    Could some please review and advise..
    Thanks
    RJ09

  • Flash Player Install Manager[681:16322] Install failed with error code: 30

    OS 10.10, MBP 2011 i7, latest updates. I ran the installer by opening up the app package and invoking the install via terminal. at the 75% mark ( download finishes ) the installer fails. in the terminal I got this maybe helpful error message. any idea on getting flash to install ? its worse because I've run the uninstaller so parts of various websites don't work now
    S

    ok, its a permissions error because the installer isn't at the right run level, even asking for my admin password. if I do
    sudo Install Adobe Flash Player.app
    [enter password]
    Installer now runs. it generates a bunch of error messages in the terminal
    Install Adobe Flash Player[744:19476] Error loading /Library/QuickTime/DivX Decoder.component/Contents/MacOS/DivX Decoder:  dlopen(/Library/QuickTime/DivX Decoder.component/Contents/MacOS/DivX Decoder, 262): Library not loaded: /Library/Frameworks/DivX Toolkit.framework/Versions/A/DivX Toolkit
      Referenced from: /Library/QuickTime/DivX Decoder.component/Contents/MacOS/DivX Decoder
      Reason: image not found
    ——— does this about 10 times ending like this -------
    2014-10-28 22:03:10.831 Install Adobe Flash Player[744:19476] Error loading /Library/QuickTime/DivX Decoder.component/Contents/MacOS/DivX Decoder:  dlopen(/Library/QuickTime/DivX Decoder.component/Contents/MacOS/DivX Decoder, 262): Library not loaded: /Library/Frameworks/DivX Toolkit.framework/Versions/A/DivX Toolkit
      Referenced from: /Library/QuickTime/DivX Decoder.component/Contents/MacOS/DivX Decoder
      Reason: image not found
    2014-10-28 22:03:47.190 Adobe Flash Player Install Manager[764:19989] Install failed with error code: 17.
    the install actually finishes though  and flash is working… YAH ! but only a semi uber geek would ever figure this out or think to try it. please fix the installer as its got a problem under 10.10

  • Sync failed with the exception "We have encountered an issue in syncing your data."

    Getting this rather useless sync error. Can you help identify our problem please.
    Sync failed with the exception "We have encountered an issue in syncing your data."    For more information, provide tracing ID ‘56e1113f-93db-4cee-9088-81d29ee39687’ to customer support.
    Thanks
    Nicholas
    CTO of Hard Medium Soft Ltd. and Independent Developer

    Hello,
    Sorry to hear you met this issue.
    Please post your subscription ID and Sync Group ID.The Microsoft support engineer will help to sovle the problem from backend.Sometime delay might be expected. Your patience is greatly appreciated. Thank you for your understanding and support.
    Regards,
    Fanny Liu
    If you have any feedback on our support, please click here.
    Fanny Liu
    TechNet Community Support

  • ARV_BC_XMB_DEL Fails With Raise Exception

    Hi All,
        I have scheduled the archiving job in PI 7.0 through sxmb_adm -> Schedule Archiving.
        After scheduling I can see two jobs successfully released
                1. ARV_BC_XMB_DEL - This job uses the program "RSXMB_DELETE_ARCHIVED_MESSAGES"
                2. ARV_BC_XMB_WRP - This uses the program "RSXMB_ARCHIVE_MESSAGES"
        The second job (which is archiving of xml messages) is running good but the First Job "ARV_BC_XMB_DEL" fails with a
        "ABAP/4 processor: RAISE_EXCEPTION."
       Both the jobs are running fine on DEV & QA systems.
       But the first job fails on Pre-Prod & Prd (which are high available systems).
       Any hints/help on why its failing with an exception on Pre-PRD & PRD ?
    <removed by moderator>
    Thanks
    Sourav
    Edited by: Mike Pokraka on Jul 24, 2008 12:52 PM

    Yes. This is what it says.
    Short text
        Exception condition "NO_DDIC_TYPE" raised.
    What happened?
        The current ABAP/4 program encountered an unexpected
        situation.
    What can you do?
        Note down which actions and inputs caused the error.
        To process the problem further, contact you SAP system
        administrator.
        Using Transaction ST22 for ABAP Dump Analysis, you can look
        at and manage termination messages, and you can also
        keep them for a long time.
    Error analysis
        A RAISE statement in the program "CL_ABAP_TYPEDESCR=============CP" raised the
         exception
        condition "NO_DDIC_TYPE".
        Since the exception was not intercepted by a superior
        program, processing was terminated.
        Short description of exception condition:
        For detailed documentation of the exception condition, use
        Transaction SE37 (Function Library). You can take the called
        function module from the display of active calls.
    How to correct the error
        If the error occures in a non-modified SAP program, you may be able to
        find an interim solution in an SAP Note.
        If you have access to SAP Notes, carry out a search with the following
        keywords:
        "RAISE_EXCEPTION" " "
        "CL_ABAP_TYPEDESCR=============CP" or "CL_ABAP_TYPEDESCR=============CM00C"
        "GET_DDIC_HEADER"
        or
        "CL_ABAP_TYPEDESCR=============CP" "NO_DDIC_TYPE"
        or
        "RSXMB_DELETE_ARCHIVED_MESSAGES " "NO_DDIC_TYPE"
        If you cannot solve the problem yourself and want to send an error
        notification to SAP, include the following information:
        1. The description of the current problem (short dump)
           To save the description, choose "System->List->Save->Local File
        (Unconverted)".
        2. Corresponding system log
           Display the system log by calling transaction SM21.
           Restrict the time interval to 10 minutes before and five minutes
        after the short dump. Then choose "System->List->Save->Local File
        (Unconverted)".
        3. If the problem occurs in a problem of your own or a modified SAP
        program: The source code of the program
           In the editor, choose "Utilities->More
        Utilities->Upload/Download->Download".
        4. Details about the conditions under which the error occurred or which
        actions and input led to the error.

  • The PowerShell script failed with below exception

    I'm receiving the following errors on all SQL Express Servers (every machine that has SQL Express inside).
    it seems that the discovery has found SQL Express but could not connect to the instance.
    details on the alerts:
    Date and Time:
    10/22/2013 12:04:22 PM
    Log Name:
    Operations Manager
    Source:
    Health Service Modules
    Generating Rule:
    Collect Power Shell Module Events
    Event Number:
    22406
    Level:
     Error
    Logging Computer:
    SQLEXPRESS.DOMAIN.COM
    User:
    N/A
    Description:
    The PowerShell script failed with below exception
    System.Management.Automation.RuntimeException: Exception calling "Fill" with "1" argument(s): "A network-related or instance-specific error occurred while establishing a connection to SQL Server. The server was not found or was not
    accessible. Verify that the instance name is correct and that SQL Server is configured to allow remote connections. (provider: SQL Network Interfaces, error: 26 - Error Locating Server/Instance Specified)"
    At line:44 char:19
    + $SqlAdapter.Fill <<<< ($DataSet)|out-null
    at System.Management.Automation.FlowControlNode.Execute(Array input, Pipe outputPipe, ExecutionContext context)
    at System.Management.Automation.ParseTreeNode.Execute(Array input, Pipe outputPipe, ArrayList& resultList, ExecutionContext context)
    at System.Management.Automation.StatementListNode.ExecuteStatement(ParseTreeNode statement, Array input, Pipe outputPipe, ArrayList& resultList, ExecutionContext context)
    Script Name: StolenServerMemory2008.ps1
    One or more workflows were affected by this.
    Workflow name: Microsoft.SQLServer.2008.DBEngine.StolenServerMemoryMonitor
    Instance name: SQLEXPRESS
    Instance ID: {9705795C-4F3B-C2EF-AA7D-C736B40FD6A4}
    Management group: SCOMGROUP 

    Some additional inf.
    http://stackoverflow.com/questions/6466974/unable-to-connect-to-sql-express-error-26-error-locating-server-instance-speci?rq=1
    anyway you can disable this rule/monitor as no control from monitoring solution in that case. Or try to rewrite the same monitor...
    The problem in your case is when function tries to get Max Server Memory MB by connecting to master DB, but you can replace it with performance counter like Target Server Memory (KB)...
    just see the function main in StolenServerMemory2008.ps1 and what you need to replace
    $api = New-Object -comObject "MOM.ScriptAPI"
    $bag = $api.CreatePropertyBag()
    $msg = [Environment]::NewLine
    $err = [Environment]::NewLine
    #try {
    $maxMemoryMB = GetMaxServerMemoryMB $ComputerName $InstanceName
    $stolenPages = (Get-Counter ("\" + $PerformanceCounterObject + ":Buffer Manager\Stolen Pages")).CounterSamples[0].CookedValue
    $pakeSizeKB = 8
    [double]$stolenMemoryMB = $stolenPages * $pakeSizeKB / 1024                                      
    [double]$stolenMemoryPercent = 0
    if($maxMemoryMB -gt 0){
    [double]$stolenMemoryPercent= 100.0 * $stolenMemoryMB / $maxMemoryMB
    $bag.AddValue("StolenMemoryMB", $stolenMemoryMB)
    $bag.AddValue("StolenMemoryPercent", $stolenMemoryPercent)                                  
    $msg += "StolenMemoryMB=$stolenMemoryMB StolenMemoryPercent=$stolenMemoryPercent"
    $msg += [Environment]::NewLine                          
    #debug $api.LogScriptEvent("SQL 2008 Stolen Server Memory data source", $SCRIPT_EVENT_ID, $INFORMATION_EVENT_TYPE, $msg + $err)                     
    #catch {
    #             $header = "Managegement Group: $Target/ManagementGroup/Name$. Script: {0}" -f ($MyInvocation.MyCommand).Name.ToString()
    #             $msg += "Error occured during SQL 2008 Stolen Server Memory data source executing.{0}Computer:{1} {0}Reason: {2}" -f [Environment]::NewLine, $env:COMPUTERNAME, $_.Exception.Message
    #             $api.LogScriptEvent($header, $SCRIPT_EVENT_ID, $ERROR_EVENT_TYPE, $msg + $err)                           
    $bag

  • Indexing Lotus Repository fails with an exception

    Hi,
    I am trying to index a lotus repository. But after indexing around 10000 documents the indexing fails with an exception.
    "Crawler global_index_Telstra Technology Doc Library failed - com.sapportals.wcm.service.xcrawler.XCrawlerException: crawler task INDEXMANAGEMENT_global_index.409bc343-1a86-2710-0292-b5747d8b1241 terminated unexpectedly (retriever failure)"
    Does anyone have an idea why its happening like this
    Its a bit urgent
    Regards
    Prakash

    Hi Prakash,
    assuming your intrante sites are crawled by a crawler profile "for Web-RM" the most common things you may still need to do are:
    - In the crawler parameters, Mark "Follow Links (or Redirects on Web-Sites)", if your start page(s)
    - On the intranet sites, check if they use robot information that says "noindex" or "nofollow" and possibly change that
    If that does not help...sorry, it's OSS again.
    Karsten

  • My application comes back with this exception!

    Hi,
    Could you tell me what is the problem?
    My application comes back with this exception:
    Exception:SERVLET-run_failed:Failed in running
    template:/myappname/html/index.jsp,
    java.lang.NoClassDefFoundError: javax/xml/parsers/SAXParserFactory
    Exception:SERVLET-run_failed:Failed in running template:[App=Glasses,
    Servlet=XXXMagicJspCompileServlet],
    java.lang.ClassCastException:java.lang.NoClassDefFoundError
    My application runs on other application servers!
    Maybe, I have to configure something?
    Set the classpath?
    Could you tell me, what is the problem?
    Thank you
    Krisztian

    Hi,
    Have you included the appropriate jars into the classpath or the
    jre/lib/ext directory?
    Regards,
    Gyorgy
    "Krisztian Maraczi" wrote:
    Hi,
    Could you tell me what is the problem?
    My application comes back with this exception:
    Exception:SERVLET-run_failed:Failed in running
    template:/myappname/html/index.jsp,
    java.lang.NoClassDefFoundError: javax/xml/parsers/SAXParserFactory
    Exception:SERVLET-run_failed:Failed in running template:[App=Glasses,
    Servlet=XXXMagicJspCompileServlet],
    java.lang.ClassCastException:java.lang.NoClassDefFoundError
    My application runs on other application servers!
    Maybe, I have to configure something?
    Set the classpath?
    Could you tell me, what is the problem?
    Thank you
    Krisztian

Maybe you are looking for

  • Original iPhone used as an iPod

    I purchased an iPhone 4. Now can my original iPhone be used as an iPod? If so, how do I do that I have erased all the data and apps off, can they be replaced? Thanks.

  • Please ask your , is its explanation true or not

    Hello: you know, indication of battery's power on zen touch's screen is "three squares" that shows how much power. I heard that it is better to charge battery when leave a "square" on the screen of indication of battery's power instead of charging ba

  • Splitting File Size

    I have to transfer file from one server to another server using MQSeries. I can transfer file size of Maxm.1000kb But i have file size limit of upto 5000kb. Is there any way to split the file size and transfer the file. Can anybody help me. Thanks. A

  • Can't import fl.video

    I can't import fl.video I've looked for it but can't find it and I'm not sure I'm looking in all the right places.  Where on my Windows XP system should I be looking?

  • Illustrator won't export to Photoshop

    When attempting to export an AI (CS4) file to Photoshop, I get "not enough memory" error. The AI file is only 1.3mb. I have over 100gb of freespace on my mac. I have no other programs open. I have continually restarted Illustrator to clear cache memo